{"text_format":"1","workbook":"xlsx","n_sheets":4,"sheets":["Vendor Instructions","DPPO Provider Listing","DHMO Provider Listing","Field List"],"not_rendered":{"charts":0,"images":0,"macros":1,"external_links":0,"defined_names":6,"comments":0,"pivot_tables":0},"unopened":[],"bounds":{"document_bytes":16777216,"sheet_cells":100000,"rows_first":2000,"rows_last":500,"rows_between":2000,"halvings":0,"cell_chars":16384,"cell_head_chars":4096},"cells_cut":0,"cells_raw":0,"read":"whole","date_system":"1900"}

{"sheet":"Vendor Instructions","index":0,"n_rows":33,"n_cols":8,"rows_kept":33,"cut":false,"hidden":false,"merged":[[10,3,10,4],[11,3,11,4],[12,3,12,4],[26,2,26,10],[31,2,31,10],[32,2,32,10],[30,2,30,10],[27,2,27,10],[28,2,28,10],[29,2,29,10]]}
[]
[null,"Provider Disruption Reporting Template"]
[]
[null,"Basic information"]
[null,null,"Enter the name of your organization and (if applicable) the name of the network being analyzed"]
[]
[null,"Basic information"]
[null,null,"Enter the name of your organization and (if applicable) the name of the network being analyzed"]
[null,null,"If multiple networks were requested, please complete separate copies of this workbook"]
[]
[null,null,"Vendor Name"]
[null,null,"DPPO Primary Network"]
[null,null,"DPPO Alt Network",null,null,"(leave blank if not applicable)"]
[]
[null,"Required Tabs"]
[null,null,"There are separate tabs provided for the State's current DPPO and DHMO plans provider listings."]
[null,null,"Please complete the required fields within both of the tabs with the DPPO network included in your proposal"]
[]
[null,"Required Fields"]
[null,null,"All fields in each of the \"Provider Listing\" tabs must be completed (Columns $K-$M).  If an alternate network will be proposed, columns $N-$P must be completed as well."]
[null,null,null,{"$f":"\"1) \"&'DPPO Provider Listing'!$K$6","v":"1) Is this Provider contracted in network?\n(Y/D/N/E)"},null,null,null,"[See definitions below]"]
[null,null,null,{"$f":"\"2) \"&'DPPO Provider Listing'!$L$6","v":"2) Match Criteria "}]
[null,null,null,{"$f":"\"3) \"&'DPPO Provider Listing'!$M$6","v":"3) Additional comment (optional)"}]
[null,null,"Please enter this information for each row of data within the \"Provider Listing\" tabs, even if a provider with the same TIN and Address information is listed more than once."]
[]
[null,"Definitions"]
[null,null,"TIN - The 9-digit Federal Taxpayer Identification Number of the specific physician rendering the service, even if the physician is part of a larger group practice."]
[null,null,"NPI - The 10-digit National Provider Identification number for the physician rendering the service"]
[null,null,"Is this Provider contracted in network?"]
[null,null,"[Y] Provider is contracted with a proprietary contract with your network - This category reflects providers with whom you directly hold the contract via the network you are proposing.  This would NOT include any discounts tied to contracts via a third-party or via another network which you offer."]
[null,null,"[D] Provider is contracted in your network, but via a wrap or secondary network - This category would include discounts via rental networks, but also any discount not covered via the ongoing proprietary contract you hold with the provider (i.e. discounts via a “shared savings” program, or a second network you offer)."]
[null,null,"[N] Provider is not contracted in your network - This category should include ALL providers with whom you do not directly hold a contract (e.g. anesthesiologists, radiologists, or other hospital-based physicians if they are not separately contracted with you)."]
[null,null,"[E] Excluded from analysis - This indicator should be used when you were unable to determine if the provider is Y/N/D."]

{"sheet":"DPPO Provider Listing","index":1,"n_rows":5809,"n_cols":16,"rows_kept":5809,"cut":false,"hidden":false,"merged":[[4,10,4,12],[4,13,4,15],[1,1,1,4],[2,1,2,4],[3,1,3,4],[3,10,3,12],[3,13,3,15]]}
[]
[null,"The State of Delaware"]
[null,"DPPO Providers Utilized"]
[null,"INCURRED January 1, 2025 through December 31, 2025 and PAID from January 1, 2025 through current",null,null,null,"DO NOT SORT OR REORDER ANY OF THE ROWS BELOW",null,null,null,null,{"$f":"IF('Vendor Instructions'!$D$11=\"\",\"Vendor Name\",'Vendor Instructions'!$D$11)","v":"Vendor Name"},null,null,{"$f":"IF('Vendor Instructions'!$D$11=\"\",\"Vendor Name\",'Vendor Instructions'!$D$11)","v":"Vendor Name"}]
[null,null,null,null,null,null,null,null,null,null,{"$f":"IF('Vendor Instructions'!$D$12=\"\",\"DPPO Primary Network\",'Vendor Instructions'!$D$12)","v":"DPPO Primary Network"},null,null,{"$f":"IF('Vendor Instructions'!$D$13=\"\",\"DPPO Alt Network\",'Vendor Instructions'!$D$13)","v":"DPPO Alt Network"}]
[null,"Provider TIN","Provider NPI","Provider Name","Address where service was rendered","Address 2","City where service was rendered","State where \nservice was rendered","Zip code where \nservice was rendered","Coverage","Is this Provider contracted in network?\n(Y/D/N/E)","Match Criteria ","Additional comment (optional)","Is this Provider contracted in network?\n(Y/D/N/E)","Match Criteria","Additional comment (optional)"]
[null,271740902,1568598514,"AMIT P PATEL","60 WOLF CREEK BLVD","DOVER","DE",19901,"DENTAL","General Dentist"]
[null,510246944,1598057895,"HEATHER R BOYLE","385 SAULSBURY RD","DOVER","DE",19904,"DENTAL","General Dentist"]
[null,932235027,1326064932,"ROBERT W WEBSTER","1522 S STATE ST","DOVER","DE",19901,"DENTAL","General Dentist"]
[null,510266734,1972896322,"MICHAEL D KELLER","543 N SHIPLEY ST STE E","SEAFORD","DE",19973,"DENTAL","General Dentist"]
[null,831433343,1528409448,"JAE M GRYMES","625 N DUPONT BLVD","MILFORD","DE",19963,"DENTAL","Pediatric Dentist"]
[null,510255657,1194929836,"JULIE Q NIES","1380 S STATE ST","DOVER","DE",19901,"DENTAL","Pediatric Dentist"]
[null,510399899,1326205105,"MATTHEW L SEDA","250 BEISER BLVD STE 102","DOVER","DE",19904,"DENTAL","General Dentist"]
[null,510162936,1568629277,"MICHAEL JOHN NIES","27 DEAK DR","SMYRNA","DE",19977,"DENTAL","General Dentist"]
[null,842032097,1518462373,"WAYNE C THOMAS","1981 S STATE ST","DOVER","DE",19901,"DENTAL","General Dentist"]
[null,853656477,1447695127,"JEFFREY S BARTOSHESKY","10250 STONE CREEK DR UNIT 1","LAUREL","DE",19956,"DENTAL","General Dentist"]
[null,462158764,1528258779,"JESSICA  DICERBO DIPIETRO","18947 JOHN J WILLIAMS HWY UNIT 309","REHOBOTH BEACH","DE",19971,"DENTAL","Pediatric Dentist"]
[null,273034258,1740380849,"NORMAN S STEWARD","214 S WALNUT ST","MILFORD","DE",19963,"DENTAL","General Dentist"]
[null,510162936,1538276217,"DAVID R DEAKYNE","27 DEAK DR","SMYRNA","DE",19977,"DENTAL","General Dentist"]
[null,203723460,1881671493,"ALVIS D BURRIS","199 SOUTH ST","CAMDEN","DE",19934,"DENTAL","General Dentist"]
[null,272896503,1679613335,"LISA A FAGIOLETTI","25 W COMMERCE ST","SMYRNA","DE",19977,"DENTAL","General Dentist"]
[null,460826508,1508145970,"DANIEL J FAY","748 S NEW ST","DOVER","DE",19904,"DENTAL","General Dentist"]
[null,881009167,1245450774,"CONSTANTINE  PIPERIS","218 PENNSYLVANIA AVE","SEAFORD","DE",19973,"DENTAL","General Dentist"]
[null,510385838,1639225790,"BLAIR A JONES","34359 CARPENTERS WAY","LEWES","DE",19958,"DENTAL","General Dentist"]
[null,823910939,1164701033,"PHILLIP JAMES LOUIE","250 BEISER BLVD STE 101","DOVER","DE",19904,"DENTAL","Pediatric Dentist"]
[null,462158764,1891327466,"JEREMY  IRVING","18947 JOHN J WILLIAMS HWY UNIT 309","REHOBOTH BEACH","DE",19971,"DENTAL","Pediatric Dentist"]
[null,462158764,1891327466,"JEREMY  IRVING","51 FALLON AVE","SEAFORD","DE",19973,"DENTAL","Pediatric Dentist"]
[null,510367791,1700023165,"MICHAEL R BUTTERWORTH","31059 DUPONT BLVD","DAGSBORO","DE",19939,"DENTAL","General Dentist"]
[null,510385838,1235285149,"CHARLES J LABIN","34359 CARPENTERS WAY","LEWES","DE",19958,"DENTAL","General Dentist"]
[null,932235027,1366931073,"RYAN PATRICK ECKLEY","1522 S STATE ST","DOVER","DE",19901,"DENTAL","General Dentist"]
[null,510115432,1366657322,"ERIC S BALLIET","212 W MARKET ST","GEORGETOWN","DE",19947,"DENTAL","General Dentist"]
[null,510399899,1942396924,"DANIELLE L GERBER","250 BEISER BLVD STE 102","DOVER","DE",19904,"DENTAL","General Dentist"]
[null,510413028,1558473934,"KEVIN H BRAFMAN","31381 DOGWOOD ACRES DR","DAGSBORO","DE",19939,"DENTAL","General Dentist"]
[null,450518729,1285800524,"ANDREA N PUDDICOMBE","215 W LIBERTY WAY","MILFORD","DE",19963,"DENTAL","General Dentist"]
[null,270466764,1457406407,"JUNIOR  DOVER","1084 S STATE ST","DOVER","DE",19901,"DENTAL","General Dentist"]
[null,831433343,1568719003,"GERARDO  MARTINEZ","625 N DUPONT BLVD","MILFORD","DE",19963,"DENTAL","Pediatric Dentist"]
[null,450518729,1083961460,"HALLEH  ASADPOUR","215 W LIBERTY WAY","MILFORD","DE",19963,"DENTAL","General Dentist"]
[null,873845775,1598776460,"BRIAN A WISK","17 W GLENWOOD AVE","SMYRNA","DE",19977,"DENTAL","General Dentist"]
[null,510413028,1841302221,"WENDY  BRAFMAN","31381 DOGWOOD ACRES DR","DAGSBORO","DE",19939,"DENTAL","General Dentist"]
[null,450518729,1568802577,"PHILIP O SELS","215 W LIBERTY WAY","MILFORD","DE",19963,"DENTAL","General Dentist"]
[null,880714495,1932329612,"NAVID  ASGARI","909 N DUPONT BLVD","MILFORD","DE",19963,"DENTAL","General Dentist"]
[null,273034258,1952720260,"CANDACE L GAULL","214 S WALNUT ST","MILFORD","DE",19963,"DENTAL","General Dentist"]
[null,850849636,1881946333,"NANCY  PANCKO","20785 PROFESSIONAL PARK BLVD","GEORGETOWN","DE",19947,"DENTAL","Orthodontist"]
[null,204150838,1083922785,"MICHAEL C DUFFY","210 W PARK PL","NEWARK","DE",19711,"DENTAL","General Dentist"]
[null,208909361,1801005475,"JEFFREY M COOPER","18947 JOHN J WILLIAMS HWY UNIT 301","REHOBOTH BEACH","DE",19971,"DENTAL","General Dentist"]
[null,832041051,1730442252,"JITEN P PATEL","100 SUSSEX AVE","MILFORD","DE",19963,"DENTAL","General Dentist"]
[null,510376139,1154536464,"MICHAEL T ALOE","850 S STATE ST","DOVER","DE",19901,"DENTAL","Endodontist"]
[null,450518729,1053327593,"LUCINDA K BUNTING","215 W LIBERTY WAY","MILFORD","DE",19963,"DENTAL","General Dentist"]
[null,920779456,1386704815,"PAUL R CHRISTIAN","423 E MAIN ST","MIDDLETOWN","DE",19709,"DENTAL","General Dentist"]
[null,510385838,1588710404,"THOMAS  KUON","34359 CARPENTERS WAY","LEWES","DE",19958,"DENTAL","General Dentist"]
[null,510115432,1013569946,"JULIE  PARKER","212 W MARKET ST","GEORGETOWN","DE",19947,"DENTAL","General Dentist"]
[null,830399007,1295754505,"ROBERT R COOPE","1250 S GOVERNORS AVE","DOVER","DE",19904,"DENTAL","General Dentist"]
[null,271740902,1740704832,"VENKAT YASHASWI Y KONDAPALLI","60 WOLF CREEK BLVD","DOVER","DE",19901,"DENTAL","General Dentist"]
[null,208643759,1144462649,"FRANKLIN X PANCKO","1004 S STATE ST STE 1","DOVER","DE",19901,"DENTAL","Oral Surgeon"]
[null,203900082,1215947494,"TAURANCE  BISHOP","300 BIDDLE AVE STE 204","NEWARK","DE",19702,"DENTAL","General Dentist"]
[null,510376139,1346419546,"SUK-YOUNG Y CARR","850 S STATE ST","DOVER","DE",19901,"DENTAL","Endodontist"]
[null,202377988,1942318555,"JOSEPH C KELLY","2205 SILVERSIDE RD","WILMINGTON","DE",19810,"DENTAL","General Dentist"]
[null,450518729,1720446164,"MARA E SHINDELL","215 W LIBERTY WAY","MILFORD","DE",19963,"DENTAL","General Dentist"]
[null,203455344,1104955160,"RICHARD J TANANIS","12000 OLD VINE BLVD UNIT 112","LEWES","DE",19958,"DENTAL","General Dentist"]
[null,462752854,1992097307,"RYAN P ROBINSON","4901 LIMESTONE RD","WILMINGTON","DE",19808,"DENTAL","General Dentist"]
[null,271740902,1134571565,"KEHAN  LI","60 WOLF CREEK BLVD","DOVER","DE",19901,"DENTAL","General Dentist"]
[null,461589362,1336418151,"JOHN B FONTANA","910 WALKER RD STE A","DOVER","DE",19904,"DENTAL","General Dentist"]
[null,510109171,1497809131,"JEFFREY J STOUT","344 E MAIN ST","NEWARK","DE",19711,"DENTAL","General Dentist"]
[null,205457140,1033217005,"NEENA  MUKKAMALA","95 WOLF CREEK BLVD STE 3","DOVER","DE",19901,"DENTAL","General Dentist"]
[null,201522783,1053471219,"GREGG  FINK","1 CENTURIAN DR STE 213","NEWARK","DE",19713,"DENTAL","General Dentist"]
[null,472600937,1295969160,"MEGAN LEIGH COOK","12 PENNINGTON ST STE 300","MIDDLETOWN","DE",19709,"DENTAL","General Dentist"]
[null,462752854,1467802553,"NICHOLAS BRIAN FAURE","4901 LIMESTONE RD","WILMINGTON","DE",19808,"DENTAL","General Dentist"]
[null,271740902,1447983523,"HARSH  BOGHARA","60 WOLF CREEK BLVD","DOVER","DE",19901,"DENTAL","General Dentist"]
[null,510402578,1407164197,"NICHOLAS J RUSSO","300 FOULK RD STE 101","WILMINGTON","DE",19803,"DENTAL","General Dentist"]
[null,510214005,1841320025,"ERIC S ESBITT","1200 PEOPLES PLZ STE 1260","NEWARK","DE",19702,"DENTAL","General Dentist"]
[null,934717803,1548473002,"DARIA  RYAN","38 PEOPLES PLZ","NEWARK","DE",19702,"DENTAL","General Dentist"]
[null,421613231,1366462558,"SCOTT A ARRIGHI","122 SANDHILL DR STE 101","MIDDLETOWN","DE",19709,"DENTAL","General Dentist"]
[null,208643759,1033257530,"DOUGLAS L DITTY","1004 S STATE ST STE 1","DOVER","DE",19901,"DENTAL","Oral Surgeon"]
[null,204852199,1225004195,"SUSAN E VICKERS","6512A DEER POINTE DR","SALISBURY","MD",21804,"DENTAL","Orthodontist"]
[null,461600713,1457483968,"BERND J ROGGE","838 WALKER RD STE 21-1","DOVER","DE",19904,"DENTAL","General Dentist"]
[null,510385838,1306992318,"RYAN C BARNHART","34359 CARPENTERS WAY","LEWES","DE",19958,"DENTAL","General Dentist"]
[null,823910939,1346248895,"LAWRENCE A LOUIE","250 BEISER BLVD STE 101","DOVER","DE",19904,"DENTAL","Pediatric Dentist"]
[null,510201104,1942329032,"TIMOTHY  GANFIELD","12 POLLY DRUMMOND HILL RD","NEWARK","DE",19711,"DENTAL","General Dentist"]
[null,932235027,1336825025,"KUSH  PATEL","1522 S STATE ST","DOVER","DE",19901,"DENTAL","General Dentist"]
[null,462158764,1528258779,"JESSICA  DICERBO DIPIETRO","51 FALLON AVE","SEAFORD","DE",19973,"DENTAL","Pediatric Dentist"]
[null,510385838,1487073888,"JOSHUA  BRYAN","34359 CARPENTERS WAY","LEWES","DE",19958,"DENTAL","General Dentist"]
[null,881625957,1508211715,"JUSTIN N JOSELL","51 HUNTFIELD DR STE 100","SMYRNA","DE",19977,"DENTAL","Pediatric Dentist"]
[null,991871464,1265535637,"MICHAEL J WAHL","2003 CONCORD PIKE","WILMINGTON","DE",19803,"DENTAL","General Dentist"]
[null,510233332,1689734519,"JEFFREY J EMMI","1601 MILLTOWN RD STE 25","WILMINGTON","DE",19808,"DENTAL","General Dentist"]
[null,463508754,1881722635,"JEFFREY F RUTLEDGE","410 N CASS ST","MIDDLETOWN","DE",19709,"DENTAL","General Dentist"]
[null,273216615,1760655930,"HANS T LIU","212 CELEBRATION CT","MIDDLETOWN","DE",19709,"DENTAL","General Dentist"]
[null,850849636,1386164846,"SIM  CHING","20785 PROFESSIONAL PARK BLVD","GEORGETOWN","DE",19947,"DENTAL","General Dentist"]
[null,274016911,1134316144,"JEFFREY E FELZER","3105 LIMESTONE RD STE 203","WILMINGTON","DE",19808,"DENTAL","Periodontist"]
[null,881625957,1033495510,"DAVID A DELGADO","51 HUNTFIELD DR STE 100","SMYRNA","DE",19977,"DENTAL","Pediatric Dentist"]
[null,203397646,1376651380,"STEVEN  ALBAN","3 SUSSEX AVE","MILFORD","DE",19963,"DENTAL","General Dentist"]
[null,462621874,1003907007,"ERIN E COX O'LEARY","29 CENTER ST","NEWARK","DE",19711,"DENTAL","General Dentist"]
[null,824082988,1225191927,"JEAN A LEWIS","677 S SALISBURY BLVD","SALISBURY","MD",21801,"DENTAL","Pediatric Dentist"]
[null,991871464,1497240170,"YAELLA LANDAU ARONHIME","2003 CONCORD PIKE","WILMINGTON","DE",19803,"DENTAL","General Dentist"]
[null,510387180,1750419099,"RICHARD S WILLIAMSON","900 FOREST ST","DOVER","DE",19904,"DENTAL","General Dentist"]
[null,475411387,1619172491,"THOMAS J LANZILOTTI","139 E CHESTNUT HILL RD","NEWARK","DE",19713,"DENTAL","General Dentist"]
[null,474925156,1710276910,"NATHAN  POLECK","5501 KIRKWOOD HWY","WILMINGTON","DE",19808,"DENTAL","General Dentist"]
[null,510115735,1508551102,"ELIZABETH  DENNIS","77 SAULSBURY RD","DOVER","DE",19904,"DENTAL","General Dentist"]
[null,263570285,1811096357,"ROBERT M COLLINS","5500 SKYLINE DR STE 3","WILMINGTON","DE",19808,"DENTAL","Pediatric Dentist"]
[null,462752854,1831530708,"WHITNEY  KEHRER","4901 LIMESTONE RD","WILMINGTON","DE",19808,"DENTAL","General Dentist"]
[null,850849636,1730635111,"JINYU  SUN","20785 PROFESSIONAL PARK BLVD","GEORGETOWN","DE",19947,"DENTAL","General Dentist"]
[null,813248774,1134726896,"BRADLEY  ROGGE","92 READS WAY STE 200","NEW CASTLE","DE",19720,"DENTAL","General Dentist"]
[null,260067430,1417961400,"EMIL W TETZNER","804 S STATE ST","DOVER","DE",19901,"DENTAL","Periodontist"]
[null,510385838,1619364858,"ZACHARY T ROACH","34359 CARPENTERS WAY","LEWES","DE",19958,"DENTAL","General Dentist"]
[null,510562439,1407464423,"PING  WANG","28318 DUPONT BLVD UNIT 1","MILLSBORO","DE",19966,"DENTAL","General Dentist"]
[null,274267415,1114941986,"KELLY  WALKER MITCHELL","1991 PULASKI HWY","BEAR","DE",19701,"DENTAL","General Dentist"]
[null,421613231,1215371661,"NORMAN A WANG","122 SANDHILL DR STE 101","MIDDLETOWN","DE",19709,"DENTAL","General Dentist"]
[null,872740098,1336601137,"KYLE  NORWOOD","33576 CROSSING AVE UNIT 1","LEWES","DE",19958,"DENTAL","General Dentist"]
[null,113726241,1922012525,"MONICA ANNE MEHRING","179 W CHESTNUT HILL RD","NEWARK","DE",19713,"DENTAL","General Dentist"]
[null,820740118,1104984582,"SCOTT IAN ROTHBART","330 CHRISTIANA MEDICAL CTR","NEWARK","DE",19702,"DENTAL","General Dentist"]
[null,934717803,1053497818,"LYNN M COLLINS","38 PEOPLES PLZ","NEWARK","DE",19702,"DENTAL","Pediatric Dentist"]
[null,510409269,1639267024,"VINCENT J DANIELS","2300 PENNSYLVANIA AVE STE 2C","WILMINGTON","DE",19806,"DENTAL","General Dentist"]
[null,813855907,1275932006,"JAVIER D SANZ MOLINER","2300 PENNSYLVANIA AVE STE 5C","WILMINGTON","DE",19806,"DENTAL","Periodontist"]
[null,204711056,1013598770,"ALEXANDER  CRAWFORD","1702 LOVERING AVE","WILMINGTON","DE",19806,"DENTAL","General Dentist"]
[null,850849636,1366931073,"RYAN PATRICK ECKLEY","20785 PROFESSIONAL PARK BLVD","GEORGETOWN","DE",19947,"DENTAL","General Dentist"]
[null,202377988,1437594728,"CAITLIN A MURPHY","2205 SILVERSIDE RD","WILMINGTON","DE",19810,"DENTAL","General Dentist"]
[null,510562439,1356402499,"GREG C HANSEN","106 SAINT ANNES CHURCH RD","MIDDLETOWN","DE",19709,"DENTAL","General Dentist"]
[null,510392854,1639289754,"ADLY T AWAYES","513 S DUPONT BLVD","MILFORD","DE",19963,"DENTAL","General Dentist"]
[null,510402578,1083922785,"MICHAEL C DUFFY","300 FOULK RD STE 101","WILMINGTON","DE",19803,"DENTAL","General Dentist"]
[null,863333501,1548889371,"BRIANNA  RAFETTO","600 N BROAD ST STE 7","MIDDLETOWN","DE",19709,"DENTAL","General Dentist"]
[null,200511529,1801929294,"MARK A WIECZOREK","494 BEAR CHRISTIANA RD","BEAR","DE",19701,"DENTAL","General Dentist"]
[null,862938345,1457630808,"SOPHIA C YI","406 S RIDGE AVE","MIDDLETOWN","DE",19709,"DENTAL","Pediatric Dentist"]
[null,862933141,1558610139,"AUSTIN S JANG","408 S RIDGE AVE","MIDDLETOWN","DE",19709,"DENTAL","Endodontist"]
[null,473101368,1922204502,"JOHN J WASNIEWSKI","262 FOXHUNT DR","BEAR","DE",19701,"DENTAL","General Dentist"]
[null,271663061,1336209261,"NATHANIEL  BENT","625 BARKSDALE RD STE 115-117","NEWARK","DE",19711,"DENTAL","General Dentist"]
[null,208643759,1679868095,"RHAE A RIEGEL","1004 S STATE ST STE 1","DOVER","DE",19901,"DENTAL","Oral Surgeon"]
[null,510402626,1518183557,"DEVON CARL SADLOWSKI","882 WALKER RD STE A","DOVER","DE",19904,"DENTAL","General Dentist"]
[null,510562439,1174684211,"IAN K BINNERSLEY","106 SAINT ANNES CHURCH RD","MIDDLETOWN","DE",19709,"DENTAL","General Dentist"]
[null,461107735,1073660031,"JILLANN I HOUNSELL","2300 PENNSYLVANIA AVE STE 3D","WILMINGTON","DE",19806,"DENTAL","General Dentist"]
[null,510110986,1265535637,"MICHAEL J WAHL","2003 CONCORD PIKE","WILMINGTON","DE",19803,"DENTAL","General Dentist"]
[null,820972471,1912314139,"SEYAR A BAQI","231 S DUPONT BLVD","SMYRNA","DE",19977,"DENTAL","General Dentist"]
[null,510115735,1457747362,"GALEN A GIACCONE CULLEN","524 UNION ST","MILTON","DE",19968,"DENTAL","General Dentist"]
[null,462643203,1023336187,"ANDREW C SWIATOWICZ","1211 MILLTOWN RD","WILMINGTON","DE",19808,"DENTAL","General Dentist"]
[null,510385541,1366715419,"RUSSELL J TIBBETTS","3516 SILVERSIDE RD STE 17","WILMINGTON","DE",19810,"DENTAL","General Dentist"]
[null,204943193,1265710552,"JAMIE  AHL","1004 S STATE ST STE 3","DOVER","DE",19901,"DENTAL","Orthodontist"]
[null,203048055,1356648059,"CATHY L HARRIS","34 W MAIN ST STE 400","CHRISTIANA","DE",19702,"DENTAL","General Dentist"]
[null,510228416,1225114945,"DAVID  ISAACS","707 FOULK RD STE 103","WILMINGTON","DE",19803,"DENTAL","General Dentist"]
[null,510201104,1235357765,"DONALD T BOND","12 POLLY DRUMMOND HILL RD","NEWARK","DE",19711,"DENTAL","General Dentist"]
[null,510255407,1215063342,"JENNIFER REBECCA GREENLEY","702 E BASIN RD STE 1","NEW CASTLE","DE",19720,"DENTAL","General Dentist"]
[null,510386757,1720212285,"ERIKA  WILLIAMS","5317 LIMESTONE RD STE 101","WILMINGTON","DE",19808,"DENTAL","General Dentist"]
[null,261512023,1700910346,"JAMES K KRAMER","13 S MAIN ST","SELBYVILLE","DE",19975,"DENTAL","General Dentist"]
[null,510409269,1639267024,"VINCENT J DANIELS","2300 PENNSYLVANIA AVE STE 2C","WILMINGTON","DE",19806,"DENTAL","General Dentist"]
[null,510109171,1073969259,"REI-YANG  HSU","344 E MAIN ST","NEWARK","DE",19711,"DENTAL","General Dentist"]
[null,884102465,1043662083,"ARPIT R PATEL","3105 LIMESTONE ROAD","WILMINGTON","DE",19808,"DENTAL","General Dentist"]
[null,204943193,1447516661,"CHARIS M O'CONNOR","1004 S STATE ST STE 3","DOVER","DE",19901,"DENTAL","Orthodontist"]
[null,853474997,1295277374,"JOEL  PINTER","2415 MILLTOWN RD","WILMINGTON","DE",19808,"DENTAL","General Dentist"]
[null,510562439,1780745836,"MICHAEL J RYAN","106 SAINT ANNES CHURCH RD","MIDDLETOWN","DE",19709,"DENTAL","General Dentist"]
[null,510271539,1427137363,"BRUCE E MATTHEWS","1403 SILVERSIDE RD STE A","WILMINGTON","DE",19810,"DENTAL","General Dentist"]
[null,453020546,1821240219,"PUJA  BALCHANDANI","72 OMEGA DR BLDG D Omega Professional Cnt","NEWARK","DE",19713,"DENTAL","General Dentist"]
[null,510214005,1396872974,"NICHOLAS  PUNTURIERI","710 GREENBANK RD","WILMINGTON","DE",19808,"DENTAL","General Dentist"]
[null,850849636,1205579737,"RACQUEL  ZOLPER","20785 PROFESSIONAL PARK BLVD","GEORGETOWN","DE",19947,"DENTAL","General Dentist"]
[null,204711056,1245383793,"GEORGETTE B BINNERSLEY","1702 LOVERING AVE","WILMINGTON","DE",19806,"DENTAL","General Dentist"]
[null,834330867,1174659445,"ALI S HUSAIN","2444 PULASKI HWY STE 200","NEWARK","DE",19702,"DENTAL","Orthodontist"]
[null,823711837,1265843783,"JASON M JUSTISON","5513 KIRKWOOD HWY","WILMINGTON","DE",19808,"DENTAL","General Dentist"]
[null,813248774,1497496830,"LINDA  ASIAMAH","92 READS WAY STE 200","NEW CASTLE","DE",19720,"DENTAL","General Dentist"]
[null,932822013,1679109508,"BRIAN  CALHOON","4600 LINDEN HILL RD STE 102","WILMINGTON","DE",19808,"DENTAL","General Dentist"]
[null,473101368,1922204502,"JOHN J WASNIEWSKI","103 LOUVIERS DR","NEWARK","DE",19711,"DENTAL","General Dentist"]
[null,923660226,1205040896,"MICHAEL  BLACKHURST","2323 PENNSYLVANIA AVE","WILMINGTON","DE",19806,"DENTAL","General Dentist"]
[null,233051080,1528056702,"LANCE R PANARELLO","5000 CHICHESTER AVE","ASTON","PA",19014,"DENTAL","General Dentist"]
[null,463753274,1457406407,"JUNIOR  DOVER","3920 DUPONT PKWY","TOWNSEND","DE",19734,"DENTAL","General Dentist"]
[null,825295341,1245426543,"CATHERINE M YOUNG","4133 OGLETOWN STANTON RD","NEWARK","DE",19713,"DENTAL","General Dentist"]
[null,510115735,1467032565,"MARK  CHARVAT","524 UNION ST","MILTON","DE",19968,"DENTAL","General Dentist"]
[null,510562439,1265283618,"ERIK HANS PEDER HANSEN","106 SAINT ANNES CHURCH RD","MIDDLETOWN","DE",19709,"DENTAL","General Dentist"]
[null,811763510,1679883904,"ERIN  MACKO","625 BARKSDALE RD # 101","NEWARK","DE",19711,"DENTAL","General Dentist"]
[null,510115735,1932894425,"CHLOE  PHILIP","524 UNION ST","MILTON","DE",19968,"DENTAL","General Dentist"]
[null,202377988,1376004218,"HAYLEY  WILLER","2205 SILVERSIDE RD","WILMINGTON","DE",19810,"DENTAL","General Dentist"]
[null,510118943,1053391706,"BRADFORD  KLASSMAN","1110 N BANCROFT PKWY","WILMINGTON","DE",19805,"DENTAL","Periodontist"]
[null,884102465,1043662083,"ARPIT R PATEL","3105 LIMESTONE ROAD","WILMINGTON","DE",19808,"DENTAL","General Dentist"]
[null,271636541,1861708927,"JONATHAN  JOHNSON","18947 JOHN J WILLIAMS HWY UNIT 310","REHOBOTH BEACH","DE",19971,"DENTAL","General Dentist"]
[null,510386757,1538285457,"DAVID S WILLIAMS","5317 LIMESTONE RD STE 101","WILMINGTON","DE",19808,"DENTAL","General Dentist"]
[null,510233332,1073261095,"MARK N TANCHANCO","1601 MILLTOWN RD STE 25","WILMINGTON","DE",19808,"DENTAL","General Dentist"]
[null,203995662,1104046812,"ZACHARY L CHIPMAN","5505 KIRKWOOD HWY","WILMINGTON","DE",19808,"DENTAL","General Dentist"]
[null,463508754,1063540342,"JANE C RUTLEDGE","410 N CASS ST","MIDDLETOWN","DE",19709,"DENTAL","General Dentist"]
[null,208282015,1699836742,"DAVID J GAZ","715 NOTTINGHAM RD","NEWARK","DE",19711,"DENTAL","General Dentist"]
[null,510115735,1467032565,"MARK  CHARVAT","77 SAULSBURY RD","DOVER","DE",19904,"DENTAL","General Dentist"]
[null,993024950,1790538155,"ALVIN  CHEN","200 CLEAVER FARMS RD STE 101","MIDDLETOWN","DE",19709,"DENTAL","General Dentist"]
[null,510394517,1669436903,"CHRISTOPHER D BURNS","871 S GOVERNORS AVE STE 1","DOVER","DE",19904,"DENTAL","Prosthodontist"]
[null,850849636,1275932006,"JAVIER D SANZ MOLINER","20785 PROFESSIONAL PARK BLVD","GEORGETOWN","DE",19947,"DENTAL","Periodontist"]
[null,208643759,1831458207,"NICHOLAS J ALCORN","1004 S STATE ST STE 1","DOVER","DE",19901,"DENTAL","Oral Surgeon"]
[null,271971248,1740253004,"HUNG V LE","83 OMEGA DR BLDG C","NEWARK","DE",19713,"DENTAL","General Dentist"]
[null,923660226,1558780775,"NINA A BLACKHURST","2323 PENNSYLVANIA AVE","WILMINGTON","DE",19806,"DENTAL","General Dentist"]
[null,521585460,1841465184,"BRIAN H CARR","111 W HIGH ST STE 111","ELKTON","MD",21921,"DENTAL","General Dentist"]
[null,510252814,1821222795,"KRISTIN M TIGANI TAYLOR","4600 LINDEN HILL RD STE 202","WILMINGTON","DE",19808,"DENTAL","General Dentist"]
[null,510562439,1144512229,"CATERINA  CARAFIDES","1415 FOULK RD STE 200","WILMINGTON","DE",19803,"DENTAL","General Dentist"]
[null,510259653,1801189212,"MATTHEW RICHARD BARAN","5317 LIMESTONE RD","WILMINGTON","DE",19808,"DENTAL","General Dentist"]
[null,510338319,1891730347,"DANIEL D TRUONO","2300 PENNSYLVANIA AVE 6CD","WILMINGTON","DE",19806,"DENTAL","General Dentist"]
[null,510109838,1881847580,"MICHAEL D LENZ","2309 PENNSYLVANIA AVE","WILMINGTON","DE",19806,"DENTAL","General Dentist"]
[null,510212559,1912940602,"PETER F SUBACH","1601 MILLTOWN RD STE 17 Lindell Sq","WILMINGTON","DE",19808,"DENTAL","Oral Surgeon"]
[null,922561704,1962556407,"ALAN R LEVINE","2018 NAAMANS RD","WILMINGTON","DE",19810,"DENTAL","General Dentist"]
[null,453834259,1124350772,"AARON  POLECK","H-50 OMEGA DR","NEWARK","DE",19713,"DENTAL","General Dentist"]
[null,208643759,1114488772,"JENNIFER  CAUGHEY","1004 S STATE ST STE 1","DOVER","DE",19901,"DENTAL","Oral Surgeon"]
[null,510562439,1710048871,"ERIK S BRADLEY","1415 FOULK RD STE 200","WILMINGTON","DE",19803,"DENTAL","General Dentist"]
[null,510214005,1205561354,"JOHN  CLIVE","1200 PEOPLES PLZ STE 1260","NEWARK","DE",19702,"DENTAL","General Dentist"]
[null,823895100,1942511563,"COREY L SMITH","11007 MANKLIN CREEK RD UNIT 1","BERLIN","MD",21811,"DENTAL","General Dentist"]
[null,883745404,1336638311,"GARRETT  BRINK","1127 VALLEY RD STE 203","HOCKESSIN","DE",19707,"DENTAL","General Dentist"]
[null,510110358,1821195017,"GARY D SAFIAN","707 FOULK RD STE 203","WILMINGTON","DE",19803,"DENTAL","General Dentist"]
[null,934717803,1689751265,"PATRICIA M SMITH","38 PEOPLES PLZ","NEWARK","DE",19702,"DENTAL","Pediatric Dentist"]
[null,203723460,1548248156,"LEROY  BELL","199 SOUTH ST","CAMDEN","DE",19934,"DENTAL","General Dentist"]
[null,521814817,1083855852,"JEAN M BRAUNING","9936 STEPHEN DECATUR HWY STE 505","OCEAN CITY","MD",21842,"DENTAL","General Dentist"]
[null,421654905,1235274986,"BRYAN  KAPUTA","2315 E NAYLOR MILL RD","SALISBURY","MD",21804,"DENTAL","General Dentist"]
[null,814859705,1336278282,"VINCENT  LONGO","2300 PENNSYLVANIA AVE STE 4A","WILMINGTON","DE",19806,"DENTAL","General Dentist"]
[null,202289843,1891917266,"PATRICK F SWEENEY","1700 N RODNEY ST","WILMINGTON","DE",19806,"DENTAL","General Dentist"]
[null,923660226,1558656710,"SARAH K SMITH","2323 PENNSYLVANIA AVE","WILMINGTON","DE",19806,"DENTAL","General Dentist"]
[null,842019790,1518257161,"AMANDA M BAYLEY MATTHEWS","900 FOULK RD STE 203","WILMINGTON","DE",19803,"DENTAL","General Dentist"]
[null,882814931,1669000311,"KYE  WILLIAMS","314 E MAIN ST","MIDDLETOWN","DE",19709,"DENTAL","General Dentist"]
[null,200511529,1609285261,"COLIN  RICE","494 BEAR CHRISTIANA RD","BEAR","DE",19701,"DENTAL","General Dentist"]
[null,462752854,1649304924,"MYOCHUL  KWON","4901 LIMESTONE RD","WILMINGTON","DE",19808,"DENTAL","General Dentist"]
[null,261304632,1487729786,"SYAMACK  GANJAVIAN","100 BECKS WOODS DR STE 102","BEAR","DE",19701,"DENTAL","General Dentist"]
[null,510214005,1205395043,"ALEXIS  ESBITT","1200 PEOPLES PLZ STE 1260","NEWARK","DE",19702,"DENTAL","General Dentist"]
[null,510228227,1487757464,"DANIEL R KRESHTOOL","1815 W 13TH ST STE 7","WILMINGTON","DE",19806,"DENTAL","Endodontist"]
[null,510562439,1437354362,"AMIT  DUA","500 LANTANA DR","HOCKESSIN","DE",19707,"DENTAL","General Dentist"]
[null,815282711,1790276319,"KATELYN M VINCENT","18912 JOHN J WILLIAMS HWY","REHOBOTH BEACH","DE",19971,"DENTAL","General Dentist"]
[null,462643203,1336882802,"KHUSHBU  PATEL","1211 MILLTOWN RD","WILMINGTON","DE",19808,"DENTAL","General Dentist"]
[null,510113004,1396874350,"STEPHEN A NIEMOELLER","523 CAPITOL TRL","NEWARK","DE",19711,"DENTAL","General Dentist"]
[null,882298449,1912120676,"G WILLIAM W KELLER","20 MONTCHANIN RD STE 150","WILMINGTON","DE",19807,"DENTAL","General Dentist"]
[null,815282711,1992445456,"STEPHANIE  SMITH","18912 JOHN J WILLIAMS HWY","REHOBOTH BEACH","DE",19971,"DENTAL","General Dentist"]
[null,141918732,1386725794,"ERIN L RAUTIO","410 FOULK RD STE 204","WILMINGTON","DE",19803,"DENTAL","General Dentist"]
[null,510361961,1467016279,"JASMINE I WATERS","2004 FOULK RD STE 1","WILMINGTON","DE",19810,"DENTAL","General Dentist"]
[null,510265384,1063563294,"HOPE D THOMAS-GLAVIN","5317 LIMESTONE RD","WILMINGTON","DE",19808,"DENTAL","General Dentist"]
[null,"020637461",1053466581,"ROBERT J KACMARCIK","5936 LIMESTONE RD STE 201","HOCKESSIN","DE",19707,"DENTAL","General Dentist"]
[null,208643759,1144462649,"FRANKLIN X PANCKO","19323 LIGHTHOUSE PLAZA BLVD UNIT 4","REHOBOTH BEACH","DE",19971,"DENTAL","Oral Surgeon"]
[null,993270691,1093334443,"CONOR  CAMPBELL","3512 SILVERSIDE RD STE 12","WILMINGTON","DE",19810,"DENTAL","Oral Surgeon"]
[null,510233332,1982136305,"RYAN ALEXANDRA GRAHAM","1601 MILLTOWN RD STE 25","WILMINGTON","DE",19808,"DENTAL","General Dentist"]
[null,510214005,1609542000,"CHRISTOPHER  HAHN","1200 PEOPLES PLZ STE 1260","NEWARK","DE",19702,"DENTAL","General Dentist"]
[null,510562439,1467147801,"MICHAEL RYAN CLEARY","106 SAINT ANNES CHURCH RD","MIDDLETOWN","DE",19709,"DENTAL","General Dentist"]
[null,271742376,1235229428,"SHEFALI R PANDYA","707 FOULK RD STE 201","WILMINGTON","DE",19803,"DENTAL","General Dentist"]
[null,843059707,1669933149,"MORGAN CORYNNE DORSEY","533 MAIN ST","WILMINGTON","DE",19804,"DENTAL","General Dentist"]
[null,208643759,1144462649,"FRANKLIN X PANCKO","9096 RIVERSIDE DR","SEAFORD","DE",19973,"DENTAL","Oral Surgeon"]
[null,510389727,1841340502,"VICTOR L GREGORY","5301 LIMESTONE RD","WILMINGTON","DE",19808,"DENTAL","General Dentist"]
[null,452423259,1699811380,"LEO J KITUSKIE","1941 LIMESTONE RD STE 105","WILMINGTON","DE",19808,"DENTAL","Periodontist"]
[null,900417424,1164582086,"TREVOR R SCHEFF","6300 LIMESTONE RD","HOCKESSIN","DE",19707,"DENTAL","General Dentist"]
[null,274016911,1063816650,"JENNIFER  LOPES","58 OMEGA DR UNIT F58","NEWARK","DE",19713,"DENTAL","Periodontist"]
[null,510562439,1043301963,"CHRISTOPHER J TAI","1415 FOULK RD STE 200","WILMINGTON","DE",19803,"DENTAL","General Dentist"]
[null,510400264,1679610695,"BRUCE D FISHER","17605 NASSAU COMMONS BLVD STE C","LEWES","DE",19958,"DENTAL","Oral Surgeon"]
[null,522067980,1972683266,"CYNTHIA S BRADLEY","2415 SILVERSIDE RD","WILMINGTON","DE",19810,"DENTAL","General Dentist"]
[null,352169432,1649220526,"RAYMOND W PETRUNICH","2444 PULASKI HWY STE 100","NEWARK","DE",19702,"DENTAL","Oral Surgeon"]
[null,900604147,1902063910,"ERIC R COPES","200 BIDDLE AVE STE 201","NEWARK","DE",19702,"DENTAL","Pediatric Dentist"]
[null,204711056,1548305535,"MARISSA A SCHNELLE","1702 LOVERING AVE","WILMINGTON","DE",19806,"DENTAL","General Dentist"]
[null,270192016,1568558542,"DAWN M GRANDISON","773 S QUEEN ST STE B","DOVER","DE",19904,"DENTAL","General Dentist"]
[null,815282711,1104184936,"DANIEL  LUCKENBAUGH","18912 JOHN J WILLIAMS HWY","REHOBOTH BEACH","DE",19971,"DENTAL","General Dentist"]
[null,932643343,1083174114,"GARRETT  GOODLING","2601 ANNAND DR STE 2","WILMINGTON","DE",19808,"DENTAL","General Dentist"]
[null,208643759,1831458207,"NICHOLAS J ALCORN","19323 LIGHTHOUSE PLAZA BLVD UNIT 4","REHOBOTH BEACH","DE",19971,"DENTAL","Oral Surgeon"]
[null,815282711,1629644844,"DUSTIN  VENABLES","18912 JOHN J WILLIAMS HWY","REHOBOTH BEACH","DE",19971,"DENTAL","General Dentist"]
[null,843631521,1003061276,"FREDERICK  BALLARD","1126 PULASKI HWY","BEAR","DE",19701,"DENTAL","Pediatric Dentist"]
[null,462752854,1326738410,"SURAJ  PATEL","4901 LIMESTONE RD","WILMINGTON","DE",19808,"DENTAL","General Dentist"]
[null,863882861,1467814699,"CHRISTOPHER  PAOLINO","1708 LOVERING AVE STE 101","WILMINGTON","DE",19806,"DENTAL","Oral Surgeon"]
[null,510257229,1568680411,"GARRETT B LYONS","100 W ROCKLAND RD # P 1","MONTCHANIN","DE",19710,"DENTAL","General Dentist"]
[null,884102465,1538388335,"MARK C DELLOSE","3105 LIMESTONE ROAD","WILMINGTON","DE",19808,"DENTAL","General Dentist"]
[null,815282711,1871652578,"STEVEN  WRIGHT","18912 JOHN J WILLIAMS HWY","REHOBOTH BEACH","DE",19971,"DENTAL","General Dentist"]
[null,510562439,1497973804,"RICHARD S D ANTONIO","1415 FOULK RD STE 200","WILMINGTON","DE",19803,"DENTAL","General Dentist"]
[null,208643759,1033257530,"DOUGLAS L DITTY","9096 RIVERSIDE DR","SEAFORD","DE",19973,"DENTAL","Oral Surgeon"]
[null,510356621,1508165903,"JEANETTE  SON","2601 ANNAND DR STE 8","WILMINGTON","DE",19808,"DENTAL","General Dentist"]
[null,204067734,1194895268,"KAREN J ROSE","446A S NEW ST","DOVER","DE",19904,"DENTAL","General Dentist"]
[null,521615851,1366445777,"CURTIS J LECIEJEWSKI","19643 BLUE BIRD LN UNT 1","REHOBOTH BEACH","DE",19971,"DENTAL","General Dentist"]
[null,510109171,1366949240,"KWAN Y NGAI","344 E MAIN ST","NEWARK","DE",19711,"DENTAL","General Dentist"]
[null,510109838,1396965117,"ANTHONY W VATTILANA","2309 PENNSYLVANIA AVE","WILMINGTON","DE",19806,"DENTAL","General Dentist"]
[null,510214005,1679625164,"ROBERT  CHRISTY","710 GREENBANK RD","WILMINGTON","DE",19808,"DENTAL","General Dentist"]
[null,203048055,1174673800,"JAY J HARRIS","34 W MAIN ST STE 400","CHRISTIANA","DE",19702,"DENTAL","Pediatric Dentist"]
[null,260873657,1639235187,"PARHAM  FARHI","6 LARCH AVE STE 402","WILMINGTON","DE",19804,"DENTAL","General Dentist"]
[null,510336351,1215044706,"DANN J GLADNICK","1104 N BROOM ST","WILMINGTON","DE",19806,"DENTAL","General Dentist"]
[null,510122179,1134283963,"CHRISTOPHER S BARAN","1601 MILLTOWN RD STE 19","WILMINGTON","DE",19808,"DENTAL","General Dentist"]
[null,743149047,1366587651,"GREGORY  DEARING","5360 SUMMIT BRIDGE RD STE 1","MIDDLETOWN","DE",19709,"DENTAL","Endodontist"]
[null,922561704,1144679499,"WILSON  PHILLIPS","2018 NAAMANS RD","WILMINGTON","DE",19810,"DENTAL","General Dentist"]
[null,510228227,1174612626,"JUNG BAIK KIM","1815 W 13TH ST STE 7","WILMINGTON","DE",19806,"DENTAL","Endodontist"]
[null,462184700,1366401762,"ALINA  RODEK","2204 SINGERLY RD","ELKTON","MD",21921,"DENTAL","General Dentist"]
[null,853220826,1154754927,"MATTHEW M GAWLAS","25 MILLTOWN RD","WILMINGTON","DE",19808,"DENTAL","General Dentist"]
[null,510562439,1326544792,"LENA  JIA","106 SAINT ANNES CHURCH RD","MIDDLETOWN","DE",19709,"DENTAL","General Dentist"]
[null,208643759,1033257530,"DOUGLAS L DITTY","19323 LIGHTHOUSE PLAZA BLVD UNIT 4","REHOBOTH BEACH","DE",19971,"DENTAL","Oral Surgeon"]
[null,208643759,1679868095,"RHAE A RIEGEL","19323 LIGHTHOUSE PLAZA BLVD UNIT 4","REHOBOTH BEACH","DE",19971,"DENTAL","Oral Surgeon"]
[null,800600168,1821221573,"RINKU  PARMAR","2036 FOULK RD STE 203","WILMINGTON","DE",19810,"DENTAL","Endodontist"]
[null,822854414,1619288461,"PATRICIA H RIST","4201 MILLER RD","WILMINGTON","DE",19802,"DENTAL","Pediatric Dentist"]
[null,472538503,1902012388,"I-YIN  LIU","17 N MAIN ST","SMYRNA","DE",19977,"DENTAL","General Dentist"]
[null,510398102,1659833168,"VINH  NGUYEN","685 E CHESTNUT HILL RD","NEWARK","DE",19713,"DENTAL","General Dentist"]
[null,831301436,1033241864,"LAURA  DOUGHERTY","2505 SILVERSIDE RD","WILMINGTON","DE",19810,"DENTAL","General Dentist"]
[null,261304632,1487729786,"SYAMACK  GANJAVIAN","129 S WEST ST","WILMINGTON","DE",19801,"DENTAL","General Dentist"]
[null,522250030,1346417482,"JOHN MICHAEL TILGHMAN","1324 BELMONT AVE Ste 104","SALISBURY","MD",21804,"DENTAL","Orthodontist"]
[null,833598838,1447346580,"BENJAMIN F GILBERT","1229 QUINTILIO DR","BEAR","DE",19701,"DENTAL","General Dentist"]
[null,510191513,1417083627,"DAVID A KING","2601 ANNAND DR STE 10","WILMINGTON","DE",19808,"DENTAL","Oral Surgeon"]
[null,813248774,1124181391,"STEVEN E CHAMISH","92 READS WAY STE 200","NEW CASTLE","DE",19720,"DENTAL","General Dentist"]
[null,462643203,1023336187,"ANDREW C SWIATOWICZ","1211 MILLTOWN RD","WILMINGTON","DE",19808,"DENTAL","General Dentist"]
[null,462158764,1306545827,"CHRISTY  YARMOSKY","18947 JOHN J WILLIAMS HWY UNIT 309","REHOBOTH BEACH","DE",19971,"DENTAL","Pediatric Dentist"]
[null,204711056,1548351414,"D MICHAEL  GIOFFRE","1702 LOVERING AVE","WILMINGTON","DE",19806,"DENTAL","General Dentist"]
[null,272755317,1093865461,"DAVID B LUPPENS","4 E CHESTNUT ST","DELMAR","MD",21875,"DENTAL","General Dentist"]
[null,850849636,1013337625,"NITCHEL  BASTIEN","20785 PROFESSIONAL PARK BLVD","GEORGETOWN","DE",19947,"DENTAL","General Dentist"]
[null,208145184,1821138140,"SATTAR A SYED","5507 KIRKWOOD HWY","WILMINGTON","DE",19808,"DENTAL","General Dentist"]
[null,522046213,1003963174,"MARTA B BLACKHURST","3522 SILVERSIDE RD STE 29","WILMINGTON","DE",19810,"DENTAL","General Dentist"]
[null,811085179,1801001516,"DAVID H DIEU","1202 FOULK RD STE A","WILMINGTON","DE",19803,"DENTAL","Oral Surgeon"]
[null,990749467,1831454693,"AVDHESH  PATEL","301 S CHAPEL ST","NEWARK","DE",19711,"DENTAL","General Dentist"]
[null,833282225,1386896777,"MICHAEL  KISSELL","25935 PLAZA DR UNIT 14","MILLSBORO","DE",19966,"DENTAL","General Dentist"]
[null,800569484,1457565830,"JEFFREY L COOK","16 PEDDLERS VILLAGE","CHRISTIANA","DE",19702,"DENTAL","General Dentist"]
[null,993024950,1609897016,"BRIAN  MCALLISTER","200 CLEAVER FARMS RD STE 101","MIDDLETOWN","DE",19709,"DENTAL","General Dentist"]
[null,993024950,1013598770,"ALEXANDER  CRAWFORD","200 CLEAVER FARMS RD STE 101","MIDDLETOWN","DE",19709,"DENTAL","General Dentist"]
[null,455628355,1598889438,"SAMUEL C NWOGU","200 BIDDLE AVE STE 214","NEWARK","DE",19702,"DENTAL","Oral Surgeon"]
[null,510562439,1669107793,"MADELYN  DEFORD","500 LANTANA DR","HOCKESSIN","DE",19707,"DENTAL","General Dentist"]
[null,814381489,1255747259,"GEOFFERY D SHULTZ","201 NORTH ST","ELKTON","MD",21921,"DENTAL","General Dentist"]
[null,205498134,1225122203,"ARVIND P JAIN","614 EASTERN SHORE DR STE D","SALISBURY","MD",21804,"DENTAL","General Dentist"]
[null,261545477,1194410787,"ELINOR  BROWN","32895 COASTAL HWY UNT 102","BETHANY BEACH","DE",19930,"DENTAL","General Dentist"]
[null,820972471,1528761780,"JORDAN  TAUB","231 S DUPONT BLVD","SMYRNA","DE",19977,"DENTAL","General Dentist"]
[null,510122179,1396880894,"PAUL  BROWN","1601 MILLTOWN RD STE 19","WILMINGTON","DE",19808,"DENTAL","General Dentist"]
[null,300523385,1992918296,"DEBRA L CARRI","31 OMEGA DR STE J-31","NEWARK","DE",19713,"DENTAL","Endodontist"]
[null,510361961,1083093603,"LANA  NGUYEN","2004 FOULK RD STE 1","WILMINGTON","DE",19810,"DENTAL","General Dentist"]
[null,932523423,1922635606,"JOHN M FACCIOLO","1304 N BROOM ST","WILMINGTON","DE",19806,"DENTAL","General Dentist"]
[null,510361961,1821558677,"ALENNA  MONET","2004 FOULK RD STE 1","WILMINGTON","DE",19810,"DENTAL","General Dentist"]
[null,510232483,1932601655,"EMILY  WEAVER","189 CHRISTIANA RD","NEW CASTLE","DE",19720,"DENTAL","General Dentist"]
[null,521317104,1386999605,"JESSICA A HARRISON","1310 BELMONT AVE STE 301","SALISBURY","MD",21804,"DENTAL","General Dentist"]
[null,462752854,1104970730,"PHILIP L PIKE","4901 LIMESTONE RD","WILMINGTON","DE",19808,"DENTAL","General Dentist"]
[null,830633383,1942694997,"PETER  KARIAN","4462 SUMMIT BRIDGE RD","MIDDLETOWN","DE",19709,"DENTAL","General Dentist"]
[null,264076896,1952407884,"JEENA M JOLLY","102 SLEEPY HOLLOW DR STE 100","MIDDLETOWN","DE",19709,"DENTAL","General Dentist"]
[null,460826508,1700312527,"MICHAEL  MOELLER","748 S NEW ST","DOVER","DE",19904,"DENTAL","General Dentist"]
[null,475627773,1831354091,"JINWOO  PARK","2601 ANNAND DR STE 18","WILMINGTON","DE",19808,"DENTAL","General Dentist"]
[null,208643759,1679868095,"RHAE A RIEGEL","9096 RIVERSIDE DR","SEAFORD","DE",19973,"DENTAL","Oral Surgeon"]
[null,832203908,1215167952,"MITALI S PATEL","1 WINSTON AVE","WILMINGTON","DE",19804,"DENTAL","General Dentist"]
[null,232667609,1245285568,"HERBERT T CASALENA","2300 PENNSYLVANIA AVE STE A 6TH FL","WILMINGTON","DE",19806,"DENTAL","General Dentist"]
[null,813484222,1275700130,"JOHN C EUM","5185 W WOODMILL DR STE 2","WILMINGTON","DE",19808,"DENTAL","General Dentist"]
[null,262566714,1205894789,"RAMA L YERNENI","671 S CARTER RD STE 13","SMYRNA","DE",19977,"DENTAL","General Dentist"]
[null,815282711,1568721017,"KATHERINE M TOWNSEND","18912 JOHN J WILLIAMS HWY","REHOBOTH BEACH","DE",19971,"DENTAL","General Dentist"]
[null,272053073,1609086479,"MARY KATHERINE MATTHEWS","451 HOCKESSIN CORS","HOCKESSIN","DE",19707,"DENTAL","Pediatric Dentist"]
[null,232438607,1043374515,"THOMAS P DOUGHERTY","5317 LIMESTONE RD","WILMINGTON","DE",19808,"DENTAL","Oral Surgeon"]
[null,272053073,1902983414,"DANIEL E MATTHEWS","451 HOCKESSIN CORS","HOCKESSIN","DE",19707,"DENTAL","General Dentist"]
[null,510214005,1740675305,"MICHELLE F MAHER","1200 PEOPLES PLZ STE 1260","NEWARK","DE",19702,"DENTAL","General Dentist"]
[null,833246828,1285150003,"BLAIRE  STOVELD","2000 FOULK RD STE C","WILMINGTON","DE",19810,"DENTAL","Pediatric Dentist"]
[null,510214005,1740675305,"MICHELLE F MAHER","710 GREENBANK RD","WILMINGTON","DE",19808,"DENTAL","General Dentist"]
[null,521103997,1972698884,"CHRISTOPHER T TAKACS","12308 OCEAN GTWY STE 6","OCEAN CITY","MD",21842,"DENTAL","General Dentist"]
[null,873220400,1184150815,"DHEEREN  PADHIAR","1202 FOULK RD","WILMINGTON","DE",19803,"DENTAL","General Dentist"]
[null,274016911,1063816650,"JENNIFER  LOPES","3105 LIMESTONE RD STE 203","WILMINGTON","DE",19808,"DENTAL","Periodontist"]
[null,651197492,1245340694,"EDWARD A WEINSTEIN","2390 LIMESTONE RD","WILMINGTON","DE",19808,"DENTAL","General Dentist"]
[null,334632910,1518257161,"AMANDA M BAYLEY MATTHEWS","1401 SILVERSIDE RD STE A","WILMINGTON","DE",19810,"DENTAL","General Dentist"]
[null,510327835,1306932546,"CONNIE F CICORELLI","1401 SILVERSIDE RD # 2A","WILMINGTON","DE",19810,"DENTAL","General Dentist"]
[null,261304632,1295938769,"ZAHRA  ASHRAFI","100 BECKS WOODS DR STE 102","BEAR","DE",19701,"DENTAL","General Dentist"]
[null,520981077,1326189135,"JAMES M NANCE","551 RIVERSIDE DR","SALISBURY","MD",21801,"DENTAL","General Dentist"]
[null,462643203,1336882802,"KHUSHBU  PATEL","1211 MILLTOWN RD","WILMINGTON","DE",19808,"DENTAL","General Dentist"]
[null,510395407,1568590834,"ALEXIS ANN SENHOLZI LEVENDIS","720 YORKLYN RD STE 120","HOCKESSIN","DE",19707,"DENTAL","General Dentist"]
[null,521103997,1598774028,"LAWRENCE S MICHNICK","12308 OCEAN GTWY STE 6","OCEAN CITY","MD",21842,"DENTAL","General Dentist"]
[null,472538503,1457883647,"LA'CHANDA  AKERS","17 N MAIN ST","SMYRNA","DE",19977,"DENTAL","General Dentist"]
[null,204943193,1265710552,"JAMIE  AHL","601 NW FRONT ST","MILFORD","DE",19963,"DENTAL","Orthodontist"]
[null,510321801,1548527104,"FADI N KOSA","4133 OGLETOWN STANTON RD STE 200","NEWARK","DE",19713,"DENTAL","Oral Surgeon"]
[null,521317104,1104956796,"JOSEPH P HARMON","1310 BELMONT AVE STE 301","SALISBURY","MD",21804,"DENTAL","General Dentist"]
[null,510562439,1306465141,"DAKIN  BOND","1304 N BROOM ST","WILMINGTON","DE",19806,"DENTAL","General Dentist"]
[null,263894534,1003915091,"DARLA M BRICE","3512 SILVERSIDE RD STE 6","WILMINGTON","DE",19810,"DENTAL","Periodontist"]
[null,510191513,1417083627,"DAVID A KING","1304 N BROOM ST","WILMINGTON","DE",19806,"DENTAL","Oral Surgeon"]
[null,510228416,1982455457,"COLLEEN N BEHAN","707 FOULK RD STE 103","WILMINGTON","DE",19803,"DENTAL","General Dentist"]
[null,882202452,1134384597,"JASON  LAMBERT","18977 MUNCHY BRANCH RD STE 6","REHOBOTH BEACH","DE",19971,"DENTAL","General Dentist"]
[null,521317104,1710169354,"LIESCHEN D AUCHEY","1310 BELMONT AVE STE 301","SALISBURY","MD",21804,"DENTAL","General Dentist"]
[null,510115735,1841467586,"ADAM C SYDELL","524 UNION ST","MILTON","DE",19968,"DENTAL","General Dentist"]
[null,510115735,1609940980,"SEAN M MERCER","90 ATLANTIC AVE","OCEAN VIEW","DE",19970,"DENTAL","General Dentist"]
[null,472538503,1275016073,"TANG  CHEN","17 N MAIN ST","SMYRNA","DE",19977,"DENTAL","General Dentist"]
[null,991871464,1326738410,"SURAJ  PATEL","2003 CONCORD PIKE","WILMINGTON","DE",19803,"DENTAL","General Dentist"]
[null,510109171,1770335549,"MADELEINE  TAYLOR","344 E MAIN ST","NEWARK","DE",19711,"DENTAL","General Dentist"]
[null,510321801,1487008397,"HABIB T ASMARO","4133 OGLETOWN STANTON RD STE 200","NEWARK","DE",19713,"DENTAL","Oral Surgeon"]
[null,852559335,1558720128,"ANDRES  HURTADO","4100 DAWNBROOK DR STE 4","WILMINGTON","DE",19804,"DENTAL","General Dentist"]
[null,933402097,1326657016,"MATTHEW  ASERMELY","917 SNOW HILL RD STE D","SALISBURY","MD",21804,"DENTAL","Pediatric Dentist"]
[null,208643759,1114488772,"JENNIFER  CAUGHEY","9096 RIVERSIDE DR","SEAFORD","DE",19973,"DENTAL","Oral Surgeon"]
[null,521095766,1992920433,"D MARCUS  FORNO","1411 WESLEY DR","SALISBURY","MD",21801,"DENTAL","Endodontist"]
[null,510321801,1134565963,"AHMAD  ELTEJAYE","4133 OGLETOWN STANTON RD STE 200","NEWARK","DE",19713,"DENTAL","Oral Surgeon"]
[null,811331849,1679794440,"HARRY YU HE","1400 PEOPLES PLZ STE 207","NEWARK","DE",19702,"DENTAL","Periodontist"]
[null,510398102,1053466250,"NADINE L VAUGHAN","42 OMEGA DR BLDG H","NEWARK","DE",19713,"DENTAL","General Dentist"]
[null,451812443,1629177084,"JOHN E PHILLIPS","2533 AUGUSTINE HERMAN HWY # B","CHESAPEAKE CITY","MD",21915,"DENTAL","General Dentist"]
[null,273575643,1699824797,"SAQIB  USMANI","201 CARTER DR STE A","MIDDLETOWN","DE",19709,"DENTAL","General Dentist"]
[null,510321801,1134565963,"AHMAD  ELTEJAYE","114 SAINT ANNES CHURCH RD","MIDDLETOWN","DE",19709,"DENTAL","Oral Surgeon"]
[null,510321801,1386699379,"EUGENE M DAMICO","4133 OGLETOWN STANTON RD STE 200","NEWARK","DE",19713,"DENTAL","Oral Surgeon"]
[null,921021923,1013201987,"LIDA  ALIMORAD","3105 LIMESTONE RD STE 305","WILMINGTON","DE",19808,"DENTAL","Pediatric Dentist"]
[null,474778929,1316043383,"MARK  KRAUSE","560 RIVERSIDE DR STE A205","SALISBURY","MD",21801,"DENTAL","General Dentist"]
[null,453193971,1982722617,"ALAN S NGUYEN","3009 PHILADELPHIA PIKE","CLAYMONT","DE",19703,"DENTAL","General Dentist"]
[null,510562439,1164949418,"GEORGE  BENNITT","17 ATLANTIC AVE STE 4","OCEAN VIEW","DE",19970,"DENTAL","General Dentist"]
[null,934439827,1780663161,"ANDREW ALAN BOOKWALTER","314 FRANKLIN AVE STE 502","BERLIN","MD",21811,"DENTAL","Oral Surgeon"]
[null,522260835,1013125392,"DEBRA J PACE","1405 SILVERSIDE RD","WILMINGTON","DE",19810,"DENTAL","General Dentist"]
[null,208643759,1831458207,"NICHOLAS J ALCORN","9096 RIVERSIDE DR","SEAFORD","DE",19973,"DENTAL","Oral Surgeon"]
[null,510115735,1609940980,"SEAN M MERCER","524 UNION ST","MILTON","DE",19968,"DENTAL","General Dentist"]
[null,270417013,1669628350,"YURI D MAJUL","26670 CENTERVIEW DR UNT 19","MILLSBORO","DE",19966,"DENTAL","General Dentist"]
[null,822854414,1659786648,"ERA  PYAKUREL","4201 MILLER RD","WILMINGTON","DE",19802,"DENTAL","General Dentist"]
[null,821754768,1396016747,"CARL E BACCELLIERI","630 COPE RD STE A","KENNETT SQUARE","PA",19348,"DENTAL","General Dentist"]
[null,932643343,1306900642,"MICHAEL T ROSEN","2601 ANNAND DR STE 2","WILMINGTON","DE",19808,"DENTAL","General Dentist"]
[null,510562439,1740635002,"AMANDA  GOLSHIRI","1415 FOULK RD STE 200","WILMINGTON","DE",19803,"DENTAL","General Dentist"]
[null,510115735,1841467586,"ADAM C SYDELL","90 ATLANTIC AVE","OCEAN VIEW","DE",19970,"DENTAL","General Dentist"]
[null,520950189,1083726616,"KEVIN M MCKELVEY","1302 S DIVISION ST","SALISBURY","MD",21804,"DENTAL","General Dentist"]
[null,853220826,1487712196,"TODD S ROWEN","25 MILLTOWN RD","WILMINGTON","DE",19808,"DENTAL","General Dentist"]
[null,993270691,1811970700,"LOUIS K RAFETTO","3512 SILVERSIDE RD STE 12","WILMINGTON","DE",19810,"DENTAL","Oral Surgeon"]
[null,833598838,1194862276,"DEEPALI S GHAM","1229 QUINTILIO DR","BEAR","DE",19701,"DENTAL","General Dentist"]
[null,850849636,1346835196,"JULIANNA L KO","20785 PROFESSIONAL PARK BLVD","GEORGETOWN","DE",19947,"DENTAL","Periodontist"]
[null,832045481,1841859238,"MEGANN  ABEDINI","3301 LANCASTER PIKE STE 3F","WILMINGTON","DE",19805,"DENTAL","Pediatric Dentist"]
[null,510226238,1518167014,"EDWARD S YALISOVE","1111 N FRANKLIN ST","WILMINGTON","DE",19806,"DENTAL","General Dentist"]
[null,270417013,1992809685,"NEIL S WOLOSHIN","26670 CENTERVIEW DR UNT 19","MILLSBORO","DE",19966,"DENTAL","General Dentist"]
[null,510115735,1457747362,"GALEN A GIACCONE CULLEN","77 SAULSBURY RD","DOVER","DE",19904,"DENTAL","General Dentist"]
[null,934439827,1396716486,"RHONDA R ROHLOFF","314 FRANKLIN AVE STE 502","BERLIN","MD",21811,"DENTAL","Oral Surgeon"]
[null,510385541,1912351875,"SCOTT R TIBBETTS","3516 SILVERSIDE RD STE 17","WILMINGTON","DE",19810,"DENTAL","General Dentist"]
[null,522068704,1891045944,"DAVID E MASTROTA","2215 PENNSYLVANIA AVE","WILMINGTON","DE",19806,"DENTAL","General Dentist"]
[null,994989830,1003369448,"EKATERINA  SPIRINA","11349 SAMUEL BOWEN BLVD","BERLIN","MD",21811,"DENTAL","General Dentist"]
[null,510259653,1003916537,"DAVID B NIBOUAR","5317 LIMESTONE RD","WILMINGTON","DE",19808,"DENTAL","General Dentist"]
[null,134205050,1568478477,"CLYDE A MAXWELL","303 E LEA BLVD","WILMINGTON","DE",19802,"DENTAL","General Dentist"]
[null,830815396,1588927198,"LYNN  FEE","2500 GRUBB RD","WILMINGTON","DE",19810,"DENTAL","General Dentist"]
[null,261545477,1295736684,"CHRISTINE E FOX","32895 COASTAL HWY UNT 102","BETHANY BEACH","DE",19930,"DENTAL","General Dentist"]
[null,454782861,1932237385,"OSSOB  ABDILLAHI","101 CHESAPEAKE BLVD STE A","ELKTON","MD",21921,"DENTAL","Pediatric Dentist"]
[null,842019790,1326468513,"EDWARD  BAYLEY","900 FOULK RD STE 203","WILMINGTON","DE",19803,"DENTAL","General Dentist"]
[null,510232483,1326533209,"CHRISTINA WEAVER FARRELL","189 CHRISTIANA RD","NEW CASTLE","DE",19720,"DENTAL","General Dentist"]
[null,882298449,1033561113,"MARIA  TIBBS","20 MONTCHANIN RD STE 150","WILMINGTON","DE",19807,"DENTAL","General Dentist"]
[null,202934962,1669507612,"BETSY S MAY","850 LIBRARY AVE STE 102","NEWARK","DE",19711,"DENTAL","General Dentist"]
[null,510402578,1891003596,"EDWIN S KUIPERS","300 FOULK RD STE 101","WILMINGTON","DE",19803,"DENTAL","General Dentist"]
[null,522068704,1891045944,"DAVID E MASTROTA","2215 PENNSYLVANIA AVE","WILMINGTON","DE",19806,"DENTAL","General Dentist"]
[null,820740118,1720146160,"WILLIAM J RECKTENWALD","330 CHRISTIANA MEDICAL CTR","NEWARK","DE",19702,"DENTAL","General Dentist"]
[null,510115735,1134726896,"BRADLEY  ROGGE","77 SAULSBURY RD","DOVER","DE",19904,"DENTAL","General Dentist"]
[null,510117612,1508981309,"MARK R FISS","42 HIAWATHA LN","DOVER","DE",19904,"DENTAL","Orthodontist"]
[null,510321801,1487008397,"HABIB T ASMARO","114 SAINT ANNES CHURCH RD","MIDDLETOWN","DE",19709,"DENTAL","Oral Surgeon"]
[null,843059707,1740341882,"RICHARD J CARROCCIA","533 MAIN ST","WILMINGTON","DE",19804,"DENTAL","General Dentist"]
[null,271740902,1417382490,"NWANEKA C NWOKOLO","60 WOLF CREEK BLVD","DOVER","DE",19901,"DENTAL","General Dentist"]
[null,843059707,1871297861,"MADELINE  FOURNIER","533 MAIN ST","WILMINGTON","DE",19804,"DENTAL","General Dentist"]
[null,462158764,1306545827,"CHRISTY  YARMOSKY","18947 JOHN J WILLIAMS HWY UNIT 309","REHOBOTH BEACH","DE",19971,"DENTAL","General Dentist"]
[null,510115735,1609940980,"SEAN M MERCER","77 SAULSBURY RD","DOVER","DE",19904,"DENTAL","General Dentist"]
[null,521617825,1881018968,"CHRISTOPHER C MORROW","29276 ERICKSON DR","EASTON","MD",21601,"DENTAL","General Dentist"]
[null,521615851,1063580736,"JOHN D SOHONAGE","19643 BLUE BIRD LN UNT 1","REHOBOTH BEACH","DE",19971,"DENTAL","General Dentist"]
[null,934639371,1518152800,"SAMIR  DHRUVA","616 AVENUE OF THE STATES","CHESTER","PA",19013,"DENTAL","General Dentist"]
[null,510214005,1205561354,"JOHN  CLIVE","51 HUNTFIELD DR STE 201","SMYRNA","DE",19977,"DENTAL","General Dentist"]
[null,475411387,1417153750,"ELIZABETH A KUBASKO","139 E CHESTNUT HILL RD","NEWARK","DE",19713,"DENTAL","General Dentist"]
[null,992313638,1245562966,"MADHAVI R KARNAM","5500 SKYLINE DR STE 2","WILMINGTON","DE",19808,"DENTAL","General Dentist"]
[null,205822293,1447399035,"LEWIS  YU","5309 LIMESTONE RD","WILMINGTON","DE",19808,"DENTAL","General Dentist"]
[null,208643759,1407803398,"OTTO F TIDWELL","9096 RIVERSIDE DR","SEAFORD","DE",19973,"DENTAL","General Dentist"]
[null,993497133,1669039244,"TEDI  VATNIKA","4420 LIMESTONE RD STE 208","WILMINGTON","DE",19808,"DENTAL","Endodontist"]
[null,510321801,1972948198,"MICHAEL D D'AMICO","4133 OGLETOWN STANTON RD STE 200","NEWARK","DE",19713,"DENTAL","Oral Surgeon"]
[null,270417013,1205331840,"KRISTEN LEA HYLAND","26670 CENTERVIEW DR UNT 19","MILLSBORO","DE",19966,"DENTAL","General Dentist"]
[null,813248774,1134726896,"BRADLEY  ROGGE","92 READS WAY STE 200","NEW CASTLE","DE",19720,"DENTAL","General Dentist"]
[null,510395407,1629171095,"MARGARET M SCHMITT","720 YORKLYN RD STE 120","HOCKESSIN","DE",19707,"DENTAL","General Dentist"]
[null,841633540,1831293992,"PHILIP RANDALL ECKMAN","966 E BALTIMORE PIKE","KENNETT SQUARE","PA",19348,"DENTAL","General Dentist"]
[null,204943193,1528585569,"XING  ZHU","1004 S STATE ST STE 3","DOVER","DE",19901,"DENTAL","Orthodontist"]
[null,852622197,1477046472,"JACOB H URAM","232 DOVE RUN CENTRE DR","MIDDLETOWN","DE",19709,"DENTAL","General Dentist"]
[null,510398102,1609457001,"THERESA  TRAN","685 E CHESTNUT HILL RD","NEWARK","DE",19713,"DENTAL","General Dentist"]
[null,460565391,1578818472,"ROBERT S COLLINS","400 N BRIDGE ST","ELKTON","MD",21921,"DENTAL","General Dentist"]
[null,510266734,1053321307,"JUAN  CABRERA","543 N SHIPLEY ST STE E","SEAFORD","DE",19973,"DENTAL","General Dentist"]
[null,833725505,1821542051,"MATTHEW C GARBIN","687 UNIONVILLE RD","KENNETT SQUARE","PA",19348,"DENTAL","General Dentist"]
[null,204943193,1447516661,"CHARIS M O'CONNOR","17425 OCEAN ONE PLZ STE 3","LEWES","DE",19958,"DENTAL","Orthodontist"]
[null,204280393,1376941443,"VEENA M REDDY","537 STANTON CHRISTN RD STE 211","NEWARK","DE",19713,"DENTAL","General Dentist"]
[null,921243699,1417382490,"NWANEKA C NWOKOLO","124 SLEEPY HOLLOW DR STE 202","MIDDLETOWN","DE",19709,"DENTAL","General Dentist"]
[null,832203908,1447346580,"BENJAMIN F GILBERT","1 WINSTON AVE","WILMINGTON","DE",19804,"DENTAL","General Dentist"]
[null,"020647948",1578610747,"RACHEL A MAHER","2036 FOULK RD STE 200","WILMINGTON","DE",19810,"DENTAL","Pediatric Dentist"]
[null,842019790,1518257161,"AMANDA M BAYLEY MATTHEWS","900 FOULK RD STE 203","WILMINGTON","DE",19803,"DENTAL","General Dentist"]
[null,510395407,1790798478,"RAYMOND L PARA","720 YORKLYN RD STE 120","HOCKESSIN","DE",19707,"DENTAL","General Dentist"]
[null,824082988,1255790424,"MEHREEN  KASSOO","677 S SALISBURY BLVD","SALISBURY","MD",21801,"DENTAL","Pediatric Dentist"]
[null,510321801,1386699379,"EUGENE M DAMICO","114 SAINT ANNES CHURCH RD","MIDDLETOWN","DE",19709,"DENTAL","Oral Surgeon"]
[null,510321801,1548527104,"FADI N KOSA","114 SAINT ANNES CHURCH RD","MIDDLETOWN","DE",19709,"DENTAL","Oral Surgeon"]
[null,233051080,1003996034,"JORDAN K GRANT","5000 CHICHESTER AVE","ASTON","PA",19014,"DENTAL","General Dentist"]
[null,510398102,1760043079,"RODION  KRYZHANOVSKIY","685 E CHESTNUT HILL RD","NEWARK","DE",19713,"DENTAL","General Dentist"]
[null,463925307,1780972315,"KANWARJIT S BRAR","1101 HEALTHWAY DR","SALISBURY","MD",21804,"DENTAL","General Dentist"]
[null,510321801,1972948198,"MICHAEL D D'AMICO","114 SAINT ANNES CHURCH RD","MIDDLETOWN","DE",19709,"DENTAL","Oral Surgeon"]
[null,743038410,1982652053,"PAYAM  HARIRI","314 FRANKLIN AVE STE 303","BERLIN","MD",21811,"DENTAL","Endodontist"]
[null,834330867,1790004778,"BRIENNE  FLAGG","2444 PULASKI HWY STE 200","NEWARK","DE",19702,"DENTAL","Orthodontist"]
[null,392347605,1780264150,"DOMINIC  PRESTIPINO","19643 BLUE BIRD LANE SUITE 1","REHOBOTH BEACH","DE",19971,"DENTAL","General Dentist"]
[null,510122179,1396880894,"PAUL  BROWN","1601 MILLTOWN RD STE 19","WILMINGTON","DE",19808,"DENTAL","General Dentist"]
[null,521615851,1780264150,"DOMINIC  PRESTIPINO","19643 BLUE BIRD LN UNT 1","REHOBOTH BEACH","DE",19971,"DENTAL","General Dentist"]
[null,923660226,1609957067,"KEITH T NGUYEN","2323 PENNSYLVANIA AVE","WILMINGTON","DE",19806,"DENTAL","General Dentist"]
[null,510117612,1508981309,"MARK R FISS","4901 LIMESTONE RD","WILMINGTON","DE",19808,"DENTAL","Orthodontist"]
[null,510116710,1144316209,"CLIFFORD L ANZILOTTI","2101 FOULK RD","WILMINGTON","DE",19810,"DENTAL","Orthodontist"]
[null,463902394,1235373929,"JOHN ADAM PRICE","2269 PULASKI HWY","NORTH EAST","MD",21901,"DENTAL","General Dentist"]
[null,510271539,1902983414,"DANIEL E MATTHEWS","1403 SILVERSIDE RD STE A","WILMINGTON","DE",19810,"DENTAL","General Dentist"]
[null,812396174,1700102605,"ASWINI K JAGADEESH","13901 COASTAL HWY STE 4","OCEAN CITY","MD",21842,"DENTAL","General Dentist"]
[null,204380517,1134348121,"JOSEPH F ECKMAN","1 COMMERCE BLVD STE 101","WEST GROVE","PA",19390,"DENTAL","General Dentist"]
[null,271740902,1457519712,"SOBIA  CHOUDHRI","60 WOLF CREEK BLVD","DOVER","DE",19901,"DENTAL","General Dentist"]
[null,203455344,1104955160,"RICHARD J TANANIS","12000 OLD VINE BLVD UNIT 112","LEWES","DE",19958,"DENTAL","General Dentist"]
[null,834387741,1720329162,"MILAD  AZADI","404 MCFARLAN RD STE 302","KENNETT SQUARE","PA",19348,"DENTAL","Endodontist"]
[null,510252814,1770998213,"JAMES V TIGANI","4600 LINDEN HILL RD STE 202","WILMINGTON","DE",19808,"DENTAL","General Dentist"]
[null,833246828,1003109877,"JILL L GARRIDO","2000 FOULK RD STE C","WILMINGTON","DE",19810,"DENTAL","Pediatric Dentist"]
[null,510122179,1134283963,"CHRISTOPHER S BARAN","1601 MILLTOWN RD STE 19","WILMINGTON","DE",19808,"DENTAL","General Dentist"]
[null,522005525,1962527788,"GORDON C HONIG","2707 KIRKWOOD HWY","NEWARK","DE",19711,"DENTAL","Orthodontist"]
[null,223789579,1881760288,"MICHAEL D MATTHIAS","1815 W 13TH ST THE STATION STE 6","WILMINGTON","DE",19806,"DENTAL","General Dentist"]
[null,510321801,1972948198,"MICHAEL D D'AMICO","2005 CONCORD PIKE STE 200","WILMINGTON","DE",19803,"DENTAL","Oral Surgeon"]
[null,300523385,1417158189,"DONALD  LIU","31 OMEGA DR STE J-31","NEWARK","DE",19713,"DENTAL","Endodontist"]
[null,331020319,1235215468,"WILLIAM NELS CUMMINGS","8830 GAP NEWPORT PIKE","AVONDALE","PA",19311,"DENTAL","General Dentist"]
[null,510115735,1841467586,"ADAM C SYDELL","77 SAULSBURY RD","DOVER","DE",19904,"DENTAL","General Dentist"]
[null,270832063,1093923013,"DOUGLAS ANTHONY FILIDORE","600 TOWN CENTRE DR STE 22","GLEN MILLS","PA",19342,"DENTAL","General Dentist"]
[null,233013518,1437177623,"JAMES P DONAGHY","594 S NEW MIDDLETOWN RD","MEDIA","PA",19063,"DENTAL","General Dentist"]
[null,522047317,1801980396,"GLEN  GOLEBURN","1290 PEOPLES PLZ","NEWARK","DE",19702,"DENTAL","General Dentist"]
[null,521617825,1881018968,"CHRISTOPHER C MORROW","17 FRANKLIN ST","CAMBRIDGE","MD",21613,"DENTAL","General Dentist"]
[null,871205006,1326533472,"TRAVIS  JAEGER","122 SPEER RD STE 1","CHESTERTOWN","MD",21620,"DENTAL","General Dentist"]
[null,204067734,1194895268,"KAREN J ROSE","446A S NEW ST","DOVER","DE",19904,"DENTAL","General Dentist"]
[null,852708221,1396781662,"MARIA E CRUZ","31413 WINTERPLACE PKWY STE 101","SALISBURY","MD",21804,"DENTAL","General Dentist"]
[null,841633540,1609003284,"PHILIP R ECKMAN","966 E BALTIMORE PIKE","KENNETT SQUARE","PA",19348,"DENTAL","General Dentist"]
[null,510405187,1861400855,"ROBERT A PENNA","2710 CENTERVILLE RD STE 215","WILMINGTON","DE",19808,"DENTAL","Orthodontist"]
[null,274268649,1760634455,"RONALD B RAWLINS","5500 SKYLINE DR STE 1","WILMINGTON","DE",19808,"DENTAL","Orthodontist"]
[null,994406281,1396136099,"ALEXANDRA GARAM PARK","402 MCFARLAN ROAD SUITE 303","KENNETT SQUARE","PA",19348,"DENTAL","General Dentist"]
[null,550891901,1013132729,"ERRIN  DEPALMA","500 FRANKLIN AVE UNT 3","BERLIN","MD",21811,"DENTAL","General Dentist"]
[null,510376139,1154536464,"MICHAEL T ALOE","750 KINGS HWY","LEWES","DE",19958,"DENTAL","Endodontist"]
[null,522047317,1982736716,"DOUGLAS  DECOUTO","1290 PEOPLES PLZ","NEWARK","DE",19702,"DENTAL","General Dentist"]
[null,813948101,1982708426,"MARIE N JOHNSON","216 S MAIN ST","NORTH EAST","MD",21901,"DENTAL","General Dentist"]
[null,168528661,1881602837,"JAY B WARDIUS","3129 NAAMANS CREEK RD","UPPER CHICHESTER","PA",19061,"DENTAL","General Dentist"]
[null,273575643,1205579778,"SHIVANG  PATEL","201 CARTER DR STE A","MIDDLETOWN","DE",19709,"DENTAL","General Dentist"]
[null,884128297,1639625916,"MONIKA  PATEL","16 WILMINGTON W CHESTER PIKE","CHADDS FORD","PA",19317,"DENTAL","Pediatric Dentist"]
[null,833313083,1548948649,"SOPHIA  SAFFORD","1189 E PULASKI HWY","ELKTON","MD",21921,"DENTAL","General Dentist"]
[null,260627886,1194939595,"DIANE C HERNANDEZ","390 VINEYARD WAY STE 505","WEST GROVE","PA",19390,"DENTAL","General Dentist"]
[null,475265368,1942313978,"KATHY L REDDEN","125 GREENTREE DR STE 2","DOVER","DE",19904,"DENTAL","General Dentist"]
[null,813248774,1568024636,"ANG  LI","92 READS WAY STE 200","NEW CASTLE","DE",19720,"DENTAL","General Dentist"]
[null,850849636,1942723523,"JAHNE  BRISTOW","20785 PROFESSIONAL PARK BLVD","GEORGETOWN","DE",19947,"DENTAL","General Dentist"]
[null,832045481,1215215652,"ANTHONY  MONTEIRO","3301 LANCASTER PIKE STE 3F","WILMINGTON","DE",19805,"DENTAL","Pediatric Dentist"]
[null,392347605,1063580736,"JOHN D SOHONAGE","19643 BLUE BIRD LANE SUITE 1","REHOBOTH BEACH","DE",19971,"DENTAL","General Dentist"]
[null,334632910,1306932546,"CONNIE F CICORELLI","1401 SILVERSIDE RD STE A","WILMINGTON","DE",19810,"DENTAL","General Dentist"]
[null,463251811,1396880894,"PAUL  BROWN","703 HEALTH SERVICES DR","SEAFORD","DE",19973,"DENTAL","General Dentist"]
[null,232843937,1689077547,"KENNETH J YOST","1407 FOULK RD STE 202 Foulkstone Plaza","WILMINGTON","DE",19803,"DENTAL","General Dentist"]
[null,510266734,1205579737,"RACQUEL  ZOLPER","543 N SHIPLEY ST STE E","SEAFORD","DE",19973,"DENTAL","General Dentist"]
[null,991871464,1811397458,"LISA  UBERTI","2003 CONCORD PIKE","WILMINGTON","DE",19803,"DENTAL","General Dentist"]
[null,274016911,1417961400,"EMIL W TETZNER","804 S STATE STREET","DOVER","DE",19901,"DENTAL","Periodontist"]
[null,854220008,1669454633,"JAMES M CROUSE","1413 WESLEY DR","SALISBURY","MD",21801,"DENTAL","Orthodontist"]
[null,994583923,1891312039,"PRINCE B MOSES","302 KAY AVE STE B","SALISBURY","MD",21801,"DENTAL","General Dentist"]
[null,510376139,1346419546,"SUK-YOUNG Y CARR","750 KINGS HWY","LEWES","DE",19958,"DENTAL","Endodontist"]
[null,510562439,1790997195,"LOIS  JAMES","17 ATLANTIC AVE STE 4","OCEAN VIEW","DE",19970,"DENTAL","General Dentist"]
[null,992688252,1679621296,"MAURICE S MILES","104 MILFORD ST","SALISBURY","MD",21804,"DENTAL","General Dentist"]
[null,510398102,1184288581,"ELISE  DEDOMINICIS","5301 LIMESTONE RD STE 212","WILMINGTON","DE",19808,"DENTAL","General Dentist"]
[null,462832821,1326120569,"JESSICA  BAKER","142 W HIGH ST","ELKTON","MD",21921,"DENTAL","General Dentist"]
[null,510212559,1770041683,"MINSUNG B KIM","1601 MILLTOWN RD STE 17 Lindell Sq","WILMINGTON","DE",19808,"DENTAL","Oral Surgeon"]
[null,273575643,1194882761,"SOHAIB  USMANI","201 CARTER DR STE A","MIDDLETOWN","DE",19709,"DENTAL","General Dentist"]
[null,475265368,1023485612,"MARIA  FLETCHER","125 GREENTREE DR STE 2","DOVER","DE",19904,"DENTAL","General Dentist"]
[null,270417013,1154008704,"JONATHON WILLIAM COTTONE","26670 CENTERVIEW DR UNT 19","MILLSBORO","DE",19966,"DENTAL","General Dentist"]
[null,814041109,1427517002,"PHI  NGUYEN","106 MILFORD ST STE 502","SALISBURY","MD",21804,"DENTAL","General Dentist"]
[null,992688252,1497494603,"MYCHELLE  MCCREARY-GOCHETT","104 MILFORD ST","SALISBURY","MD",21804,"DENTAL","General Dentist"]
[null,475265368,1942313978,"KATHY L REDDEN","125 GREENTREE DR STE 2","DOVER","DE",19904,"DENTAL","General Dentist"]
[null,204879395,1467546556,"MARIEVE O RODRIGUEZ","2300 PENNSYLVANIA AVE STE 1D","WILMINGTON","DE",19806,"DENTAL","General Dentist"]
[null,270417013,1609320100,"SUSHAEN  RANGARAMANUJAM","26670 CENTERVIEW DR UNT 19","MILLSBORO","DE",19966,"DENTAL","General Dentist"]
[null,510233332,1538388335,"MARK C DELLOSE","1601 MILLTOWN RD STE 25","WILMINGTON","DE",19808,"DENTAL","General Dentist"]
[null,872616372,1437661709,"SITA  PATEL","100 S MAIN ST STE 310","SMYRNA","DE",19977,"DENTAL","Orthodontist"]
[null,510316687,1871690438,"MARGARET M MUNLEY","2004 FOULK RD STE 2","WILMINGTON","DE",19810,"DENTAL","Periodontist"]
[null,231731220,1184833410,"GEORGE  MARCANTONIS","227 W MINER ST","WEST CHESTER","PA",19382,"DENTAL","General Dentist"]
[null,991053411,1003109877,"JILL L GARRIDO","498 MIDDLETOWN WARWICK ROAD","MIDDLETOWN","DE",19709,"DENTAL","Pediatric Dentist"]
[null,881224580,1124582242,"VARUN  DHINGRA","145 BRINTON LAKE RD STE 300","GLEN MILLS","PA",19342,"DENTAL","General Dentist"]
[null,526002033,"NULL","MARYLAND DH MD","2353 PO Box","BALTIMORE","MD",21203,"DENTAL","General Dentist"]
[null,141918732,1891355848,"DAVID  LEWIS","410 FOULK RD STE 204","WILMINGTON","DE",19803,"DENTAL","General Dentist"]
[null,261304632,1295938769,"ZAHRA  ASHRAFI","129 S WEST ST","WILMINGTON","DE",19801,"DENTAL","General Dentist"]
[null,462752854,1871297861,"MADELINE  FOURNIER","4901 LIMESTONE RD","WILMINGTON","DE",19808,"DENTAL","General Dentist"]
[null,463251811,1134283963,"CHRISTOPHER S BARAN","703 HEALTH SERVICES DR","SEAFORD","DE",19973,"DENTAL","General Dentist"]
[null,472538503,1447399035,"LEWIS  YU","17 N MAIN ST","SMYRNA","DE",19977,"DENTAL","General Dentist"]
[null,510117612,1508981309,"MARK R FISS","2005 CONCORD PIKE STE 201","WILMINGTON","DE",19803,"DENTAL","Orthodontist"]
[null,205822293,1902012388,"I-YIN  LIU","5309 LIMESTONE RD","WILMINGTON","DE",19808,"DENTAL","General Dentist"]
[null,201218318,1336485416,"KEVIN Y MYINT","343 E PULASKI HWY","ELKTON","MD",21921,"DENTAL","General Dentist"]
[null,231352685,1821034588,"NAJEED  SALEH","240 S 40TH ST","PHILADELPHIA","PA",19104,"DENTAL","General Dentist"]
[null,510115735,1467032565,"MARK  CHARVAT","90 ATLANTIC AVE","OCEAN VIEW","DE",19970,"DENTAL","General Dentist"]
[null,270659686,1194916189,"MARGARET C MCGRATH","160 SALLITT DR STE 106","STEVENSVILLE","MD",21666,"DENTAL","Pediatric Dentist"]
[null,264076896,1356993869,"NEENA  JOLLY","102 SLEEPY HOLLOW DR STE 100","MIDDLETOWN","DE",19709,"DENTAL","General Dentist"]
[null,510115735,1932894425,"CHLOE  PHILIP","90 ATLANTIC AVE","OCEAN VIEW","DE",19970,"DENTAL","General Dentist"]
[null,260358675,1629120571,"ROBERT GEORGE TSAGANOS","331 WILMINGTON W CHESTER PIKE STE 7","GLEN MILLS","PA",19342,"DENTAL","General Dentist"]
[null,822854414,1073599957,"GIA K YI","4201 MILLER RD","WILMINGTON","DE",19802,"DENTAL","General Dentist"]
[null,464244840,1306100607,"WEIDONG  YANG","131 BECKS WOODS DR","BEAR","DE",19701,"DENTAL","General Dentist"]
[null,481255449,1659812345,"ROBERT M MCCREADY","835 SNOW HILL RD","SALISBURY","MD",21804,"DENTAL","General Dentist"]
[null,141850828,1285359794,"PATRICIA  FLECHA AMARANTE DYE","21444 CARMEAN WAY","GEORGETOWN","DE",19947,"DENTAL","General Dentist"]
[null,454782861,1891319638,"ONOYOM  ONYILE","101 CHESAPEAKE BLVD STE A","ELKTON","MD",21921,"DENTAL","Pediatric Dentist"]
[null,510109171,1396857884,"KEVIN F ROBERTS","344 E MAIN ST","NEWARK","DE",19711,"DENTAL","General Dentist"]
[null,830399007,1033735816,"ROHAN  SHAH","1250 S GOVERNORS AVE","DOVER","DE",19904,"DENTAL","General Dentist"]
[null,510321801,1134565963,"AHMAD  ELTEJAYE","2005 CONCORD PIKE STE 200","WILMINGTON","DE",19803,"DENTAL","Oral Surgeon"]
[null,873911810,1407516487,"SUKHBIR KAUR  DHALIWAL","314 FRANKLIN AVE STE 305","BERLIN","MD",21811,"DENTAL","General Dentist"]
[null,141850828,1508060575,"CHRISTINE  STINTON","21 W CLARKE AVE STE 1001","MILFORD","DE",19963,"DENTAL","General Dentist"]
[null,392347605,1548866932,"MATTHEW R YARMOSKY","19643 BLUE BIRD LANE SUITE 1","REHOBOTH BEACH","DE",19971,"DENTAL","General Dentist"]
[null,873866466,1720566581,"TYLER E AZEVEDO","102 CONNER RD","OXFORD","PA",19363,"DENTAL","General Dentist"]
[null,223696572,1932321767,"JOEL M RICHTERMAN","127 N BROADWAY","PENNSVILLE","NJ","08070","DENTAL","General Dentist"]
[null,463251811,1992020390,"ROBERT M BLITZER","703 HEALTH SERVICES DR","SEAFORD","DE",19973,"DENTAL","General Dentist"]
[null,881224580,1467939827,"MARZIYEH  KHODABAKHSH","145 BRINTON LAKE RD STE 300","GLEN MILLS","PA",19342,"DENTAL","General Dentist"]
[null,881224580,1861554065,"MICHAEL G MATKOV","145 BRINTON LAKE RD STE 300","GLEN MILLS","PA",19342,"DENTAL","General Dentist"]
[null,273333369,1760452890,"GREGORY S RUSSELL","11200 RACETRACK RD UNIT 204","BERLIN","MD",21811,"DENTAL","Endodontist"]
[null,550891901,1215152921,"MICHAEL  DEPALMA","500 FRANKLIN AVE UNT 3","BERLIN","MD",21811,"DENTAL","General Dentist"]
[null,922561704,1205419611,"DAVID  ALPERT","2018 NAAMANS RD","WILMINGTON","DE",19810,"DENTAL","General Dentist"]
[null,521400853,1740508613,"JEREMY K MASENIOR","1 PITTS ST","BERLIN","MD",21811,"DENTAL","General Dentist"]
[null,332839091,1225300460,"DREW CHRISTOPHER ECKMAN","301 N 3RD ST","OXFORD","PA",19363,"DENTAL","General Dentist"]
[null,472538503,1447399035,"LEWIS  YU","17 N MAIN ST","SMYRNA","DE",19977,"DENTAL","General Dentist"]
[null,521617825,1407945587,"RANDALL H HIERS","29276 ERICKSON DR","EASTON","MD",21601,"DENTAL","General Dentist"]
[null,770704150,1649306895,"STEFAN  SPECK","306 LIMESTONE RD","OXFORD","PA",19363,"DENTAL","General Dentist"]
[null,460748073,1508889387,"STEVEN R SIERAKOWSKI","1786 WILMINGTON W CHESTER PIKE STE 100B","GLEN MILLS","PA",19342,"DENTAL","General Dentist"]
[null,510321801,1972948198,"MICHAEL D D'AMICO","2005 CONCORD PIKE","WILMINGTON","DE",19803,"DENTAL","Oral Surgeon"]
[null,201902343,1871765735,"RICHARD  LAPALOMENTO","215 N HOOK RD","PENNSVILLE","NJ","08070","DENTAL","General Dentist"]
[null,994989830,1821828138,"BIANKA  AMIN","2412 N SALISBURY BLVD STE A","SALISBURY","MD",21801,"DENTAL","General Dentist"]
[null,208155241,1609281427,"CATHERINE C CAVANAUGH","1215 W BALTIMORE PIKE STE 12","MEDIA","PA",19063,"DENTAL","General Dentist"]
[null,522339689,1972717833,"ERIC A VAN VENROOY","121 W MAIN ST","CECILTON","MD",21913,"DENTAL","General Dentist"]
[null,991871464,1811397458,"LISA  UBERTI","2003 CONCORD PIKE","WILMINGTON","DE",19803,"DENTAL","General Dentist"]
[null,510361961,1205914652,"BRUCE G FAY","2004 FOULK RD STE 1","WILMINGTON","DE",19810,"DENTAL","General Dentist"]
[null,590634433,1700191608,"MARIA  VELASCO","1600 ROCKLAND RD","WILMINGTON","DE",19803,"DENTAL","Pediatric Dentist"]
[null,463251811,1396880894,"PAUL  BROWN","703 HEALTH SERVICES DR","SEAFORD","DE",19973,"DENTAL","General Dentist"]
[null,182488133,1013074178,"GREGORY P ECKMAN","301 N 3RD ST","OXFORD","PA",19363,"DENTAL","General Dentist"]
[null,474948787,1881946333,"NANCY  PANCKO","2300 PENNSYLVANIA AVE STE 5C","WILMINGTON","DE",19806,"DENTAL","Orthodontist"]
[null,871534276,1740625094,"JOSEPH T FACCIOLO","74 OMEGA DR","NEWARK","DE",19713,"DENTAL","Orthodontist"]
[null,833854506,1780023127,"HARSHIL R BOGHARA","1751 WILMINGTON PIKE STE F-2","GLEN MILLS","PA",19342,"DENTAL","General Dentist"]
[null,510321801,1487008397,"HABIB T ASMARO","2005 CONCORD PIKE STE 200","WILMINGTON","DE",19803,"DENTAL","Oral Surgeon"]
[null,232054483,1588866933,"MICHAEL D WALKER","721 E BALTIMORE PIKE STE 200","KENNETT SQUARE","PA",19348,"DENTAL","Oral Surgeon"]
[null,815079869,1619039625,"MAEDOT  SEMO","91 WILMINGTON W CHESTER PIKE STE 24","CHADDS FORD","PA",19317,"DENTAL","General Dentist"]
[null,521020618,1568543098,"ARA L STANTON","1346 S DIVISION ST STE 104","SALISBURY","MD",21804,"DENTAL","General Dentist"]
[null,841695172,1497719967,"MATTHEW F MILANO","900 W BALTIMORE PIKE STE 100","WEST GROVE","PA",19390,"DENTAL","General Dentist"]
[null,237047824,1144989344,"JUSTIN  BATCHELLER","601 NEW CASTLE AVE","WILMINGTON","DE",19801,"DENTAL","General Dentist"]
[null,510327835,1912351875,"SCOTT R TIBBETTS","1401 SILVERSIDE RD # 2A","WILMINGTON","DE",19810,"DENTAL","General Dentist"]
[null,510214005,1205395043,"ALEXIS  ESBITT","51 HUNTFIELD DR STE 201","SMYRNA","DE",19977,"DENTAL","General Dentist"]
[null,821754768,1609056845,"TOMASA A SANTANA","630 COPE RD STE A","KENNETT SQUARE","PA",19348,"DENTAL","General Dentist"]
[null,521400853,1861510653,"GERALD F OTT","1 PITTS ST","BERLIN","MD",21811,"DENTAL","General Dentist"]
[null,475265368,1023485612,"MARIA  FLETCHER","125 GREENTREE DR STE 2","DOVER","DE",19904,"DENTAL","General Dentist"]
[null,823050962,1134176316,"OLGA  KABOURIDOU","736 BALTIMORE PIKE STE 7","GLEN MILLS","PA",19342,"DENTAL","General Dentist"]
[null,510321801,1548527104,"FADI N KOSA","2005 CONCORD PIKE STE 200","WILMINGTON","DE",19803,"DENTAL","Oral Surgeon"]
[null,510255407,1639331077,"JAMES ROBERT FORSHEY","702 E BASIN RD STE 1","NEW CASTLE","DE",19720,"DENTAL","General Dentist"]
[null,831491002,1669569398,"CHRISTIE L HAGERT","415 WASHINGTON AVE STE 1","CHESTERTOWN","MD",21620,"DENTAL","General Dentist"]
[null,813248774,1598020539,"TARLAN  ARSHIAN","92 READS WAY STE 200","NEW CASTLE","DE",19720,"DENTAL","General Dentist"]
[null,262843884,1801427372,"NAM H KIM","406 N FRUITLAND BLVD","SALISBURY","MD",21801,"DENTAL","General Dentist"]
[null,993071625,1144870676,"RYAN  MARINER","11310 MANKLIN CREEK RD UNIT 5","OCEAN PINES","MD",21811,"DENTAL","General Dentist"]
[null,812539679,1568541498,"SAM B KHOURY","107 COMMONS CT","CHADDS FORD","PA",19317,"DENTAL","Periodontist"]
[null,991871464,1326738410,"SURAJ  PATEL","2003 CONCORD PIKE","WILMINGTON","DE",19803,"DENTAL","General Dentist"]
[null,841695172,1346914462,"MEGHAN M MARTIN","900 W BALTIMORE PIKE STE 100","WEST GROVE","PA",19390,"DENTAL","General Dentist"]
[null,521317104,1245965920,"IFUEKO  OBADIARU","1310 BELMONT AVE STE 301","SALISBURY","MD",21804,"DENTAL","General Dentist"]
[null,141918732,1154982387,"KRUNAL  SHAH","410 FOULK RD STE 204","WILMINGTON","DE",19803,"DENTAL","General Dentist"]
[null,261899835,1598845026,"KRAIG M STETZER","1412 S SALISBURY BLVD  STE 8","SALISBURY","MD",21801,"DENTAL","General Dentist"]
[null,462752854,1093150492,"KYLE D GREEN","4901 LIMESTONE RD","WILMINGTON","DE",19808,"DENTAL","General Dentist"]
[null,521576334,1871656769,"ROWLAND S HOLSINGER","10646 RIVER RD","DENTON","MD",21629,"DENTAL","General Dentist"]
[null,522321357,1295778454,"KELLY S KENNAN","1820 SWEETBAY DR STE 104","SALISBURY","MD",21804,"DENTAL","General Dentist"]
[null,833313083,1447147814,"NAFIS  HAQUE","1189 E PULASKI HWY","ELKTON","MD",21921,"DENTAL","General Dentist"]
[null,833313083,1538852868,"AARON JAMES HALEY","1189 E PULASKI HWY","ELKTON","MD",21921,"DENTAL","General Dentist"]
[null,843059707,1871297861,"MADELINE  FOURNIER","533 MAIN ST","WILMINGTON","DE",19804,"DENTAL","General Dentist"]
[null,521555528,1386751659,"LYNN F ASCHER","560 RIVERSIDE DR STE B201","SALISBURY","MD",21801,"DENTAL","General Dentist"]
[null,510398102,1730351172,"LAVINIA I WU","685 E CHESTNUT HILL RD","NEWARK","DE",19713,"DENTAL","General Dentist"]
[null,201572160,1972505089,"THOMAS F MULLER","195 S JENNERSVILLE RD","WEST GROVE","PA",19390,"DENTAL","General Dentist"]
[null,510232483,1073721387,"IGNACIO V GISPERT","189 CHRISTIANA RD","NEW CASTLE","DE",19720,"DENTAL","General Dentist"]
[null,472946954,1063563294,"HOPE D THOMAS-GLAVIN","3105 LIMESTONE RD STE 210","WILMINGTON","DE",19808,"DENTAL","General Dentist"]
[null,201687535,1932115185,"ANDREW J PRATT","6 DICKINSON DR STE 102","CHADDS FORD","PA",19317,"DENTAL","General Dentist"]
[null,813101020,1659589679,"CARLOS E GOMEZ","400 MCFARLAN RD STE 200","KENNETT SQUARE","PA",19348,"DENTAL","Pediatric Dentist"]
[null,521020618,1427474519,"JOSEPH ANDRE MERAI","1346 S DIVISION ST STE 104","SALISBURY","MD",21804,"DENTAL","General Dentist"]
[null,522341431,1811135791,"WILFRED M DYER","106 MILFORD ST STE 106","SALISBURY","MD",21804,"DENTAL","General Dentist"]
[null,825218380,1932489283,"JONATHAN T SOISTMAN","403 PURDY ST SUITE 201","EASTON","MD",21601,"DENTAL","General Dentist"]
[null,844806926,1043687759,"MICHAEL J HOGLUND","2 MARTIN CT STE 2","EASTON","MD",21601,"DENTAL","General Dentist"]
[null,481255449,1003937657,"RICK  DAWSON","835 SNOW HILL RD","SALISBURY","MD",21804,"DENTAL","General Dentist"]
[null,521912857,1982814661,"SHAWN C BRENNAN","9 S QUEEN ST","RISING SUN","MD",21911,"DENTAL","General Dentist"]
[null,832045481,1598375412,"ALYSE  O'KELLY","3301 LANCASTER PIKE STE 3F","WILMINGTON","DE",19805,"DENTAL","General Dentist"]
[null,462752854,1942819248,"JERRIN  JOHNSON","4901 LIMESTONE RD","WILMINGTON","DE",19808,"DENTAL","General Dentist"]
[null,845081038,1679615736,"CAN  NGUYEN","26670 CENTERVIEW DR UNIT 19","MILLSBORO","DE",19966,"DENTAL","Orthodontist"]
[null,510109171,1801459466,"ANGELA  CHOI","344 E MAIN ST","NEWARK","DE",19711,"DENTAL","General Dentist"]
[null,822854414,1811047962,"GEORGE T DERENZO","4201 MILLER RD","WILMINGTON","DE",19802,"DENTAL","Orthodontist"]
[null,521576334,1184787079,"PATRICA E HIGGINS","10646 RIVER RD","DENTON","MD",21629,"DENTAL","General Dentist"]
[null,205359179,1457411183,"JIAN YING CHEN LEMPER","207 N GUERNSEY RD","WEST GROVE","PA",19390,"DENTAL","General Dentist"]
[null,510562439,1265283618,"ERIK HANS PEDER HANSEN","28318 DUPONT BLVD UNIT 1","MILLSBORO","DE",19966,"DENTAL","General Dentist"]
[null,471088866,1831213917,"REENA K PATEL","3135 JOSEPH BIGGS MEMORIAL HWY STE 2B","NORTH EAST","MD",21901,"DENTAL","General Dentist"]
[null,821650959,1386783041,"JEFFREY M MELINI","1020 BALTIMORE PIKE STE 350","GLEN MILLS","PA",19342,"DENTAL","Pediatric Dentist"]
[null,270396194,1376667121,"HEMA R NAIR","1102 BALTIMORE PIKE STE 203","GLEN MILLS","PA",19342,"DENTAL","General Dentist"]
[null,842019790,1326468513,"EDWARD  BAYLEY","900 FOULK RD STE 203","WILMINGTON","DE",19803,"DENTAL","General Dentist"]
[null,590634433,1376679019,"ROSEMARY K CLAY","1600 ROCKLAND RD","WILMINGTON","DE",19803,"DENTAL","Pediatric Dentist"]
[null,590634433,1427406370,"MANALI  MURARKA","1600 ROCKLAND RD","WILMINGTON","DE",19803,"DENTAL","Pediatric Dentist"]
[null,274269434,1609073105,"HADEEL N ALREZ","11 REGENCY PLZ","GLEN MILLS","PA",19342,"DENTAL","General Dentist"]
[null,871534276,1740625094,"JOSEPH T FACCIOLO","1405 SILVERSIDE RD","WILMINGTON","DE",19810,"DENTAL","Orthodontist"]
[null,475555176,1114241452,"SAMAN  SOURI","677 E PULASKI HWY STE D","ELKTON","MD",21921,"DENTAL","Oral Surgeon"]
[null,571222438,1326133265,"RUBY  MIRZA","11042 NICHOLAS LN STE B101","OCEAN PINES","MD",21811,"DENTAL","General Dentist"]
[null,853193012,1871938290,"JOANNA  GREEN","620 CHURCHMANS RD STE 201","NEWARK","DE",19702,"DENTAL","General Dentist"]
[null,521617825,1407945587,"RANDALL H HIERS","17 FRANKLIN ST","CAMBRIDGE","MD",21613,"DENTAL","General Dentist"]
[null,510398102,1760655930,"HANS T LIU","685 E CHESTNUT HILL RD","NEWARK","DE",19713,"DENTAL","General Dentist"]
[null,522047317,1285753145,"ANNE P ANNONE","1290 PEOPLES PLZ","NEWARK","DE",19702,"DENTAL","General Dentist"]
[null,923660226,1538904404,"ANDRIY  LESHKIV","2323 PENNSYLVANIA AVE","WILMINGTON","DE",19806,"DENTAL","Periodontist"]
[null,510214005,1679625164,"ROBERT  CHRISTY","1200 PEOPLES PLZ STE 1260","NEWARK","DE",19702,"DENTAL","General Dentist"]
[null,994989830,1629417654,"BINDU M VEMARAJU","722 E PULASKI HWY STE 102","ELKTON","MD",21921,"DENTAL","General Dentist"]
[null,510321801,1134565963,"AHMAD  ELTEJAYE","2005 CONCORD PIKE","WILMINGTON","DE",19803,"DENTAL","Oral Surgeon"]
[null,473605243,1396136099,"ALEXANDRA GARAM PARK","402 MCFARLAN RD STE 303","KENNETT SQUARE","PA",19348,"DENTAL","General Dentist"]
[null,473260407,1275902454,"GURPREET  KAUR","100 PENNSYLVANIA AVE","CENTREVILLE","MD",21617,"DENTAL","General Dentist"]
[null,590634433,1629579735,"KATHERYN G GOLDMAN","1600 ROCKLAND RD","WILMINGTON","DE",19803,"DENTAL","Pediatric Dentist"]
[null,862675808,1760976591,"MORGAN NICOLE MORROW","818 KOHL AVE # 820","MIDDLETOWN","DE",19709,"DENTAL","General Dentist"]
[null,233051080,1992066054,"NATALIE  NASH","5000 CHICHESTER AVE","ASTON","PA",19014,"DENTAL","General Dentist"]
[null,510214005,1205395043,"ALEXIS  ESBITT","51 HUNTFIELD DR STE 201","SMYRNA","DE",19977,"DENTAL","General Dentist"]
[null,463251811,1134283963,"CHRISTOPHER S BARAN","703 HEALTH SERVICES DR","SEAFORD","DE",19973,"DENTAL","General Dentist"]
[null,833725505,1003996034,"JORDAN K GRANT","687 UNIONVILLE RD","KENNETT SQUARE","PA",19348,"DENTAL","General Dentist"]
[null,113701840,1144310467,"VINCENT  MONGIOVI","4 WOODLAND DR","GLEN MILLS","PA",19342,"DENTAL","Orthodontist"]
[null,260591645,1528258969,"LISA D PATRICK","601 E NAYLOR MILL RD","SALISBURY","MD",21804,"DENTAL","General Dentist"]
[null,"042566517",1174743199,"WILLIAM D MONCEVICZ","1110 N BANCROFT PKWY STE 1","WILMINGTON","DE",19805,"DENTAL","General Dentist"]
[null,510531771,1871506014,"KELLY A MCKNIGHT","1950 LAUREL MANOR DR SUITE 161","THE VILLAGES","FL",32162,"DENTAL","General Dentist"]
[null,461536386,1013021948,"KEITH L DUNOFF","1908 KINGS HWY","SWEDESBORO","NJ","08085","DENTAL","General Dentist"]
[null,201966967,1336356237,"SCOTT M NOVAK","505 KERR AVE","DENTON","MD",21629,"DENTAL","General Dentist"]
[null,201687535,1932115185,"ANDREW J PRATT","6 DICKINSON DR STE 102","CHADDS FORD","PA",19317,"DENTAL","General Dentist"]
[null,862675808,1194354712,"AESHA  AMIN","818 KOHL AVE # 820","MIDDLETOWN","DE",19709,"DENTAL","General Dentist"]
[null,833725505,1962059899,"JAMES S SLATTERY","687 UNIONVILLE RD","KENNETT SQUARE","PA",19348,"DENTAL","General Dentist"]
[null,821705340,1447475140,"FEREIDON W MANSSURI","134 COURSEVALL DR","CENTREVILLE","MD",21617,"DENTAL","General Dentist"]
[null,522340745,1073731048,"TAIWO M OSUNKOYA","414 N 6TH ST","DENTON","MD",21629,"DENTAL","General Dentist"]
[null,454782861,1487358594,"SAJA  SAID","101 CHESAPEAKE BLVD STE A","ELKTON","MD",21921,"DENTAL","Pediatric Dentist"]
[null,454782861,1366877250,"KOURTNEY  LEE","101 CHESAPEAKE BLVD STE A","ELKTON","MD",21921,"DENTAL","Pediatric Dentist"]
[null,522047317,1528226743,"COURTNEY G HERRING","1290 PEOPLES PLZ","NEWARK","DE",19702,"DENTAL","General Dentist"]
[null,923800762,1942748801,"JENNIFER  BROTZ","22 KENT TOWN MARKET","CHESTER","MD",21619,"DENTAL","General Dentist"]
[null,510214005,1609542000,"CHRISTOPHER  HAHN","51 HUNTFIELD DR STE 201","SMYRNA","DE",19977,"DENTAL","General Dentist"]
[null,510162936,1477306231,"JIGAR  PATEL","27 DEAK DR","SMYRNA","DE",19977,"DENTAL","General Dentist"]
[null,844388915,1477894103,"MARC E VIRTUE","589 WILMINGTON W CHESTER PIKE STE H02B","GLEN MILLS","PA",19342,"DENTAL","Pediatric Dentist"]
[null,522136775,1265674089,"T TODD  HICKMAN","202 S MAPLE AVE","CHESTERTOWN","MD",21620,"DENTAL","General Dentist"]
[null,183447303,1295843530,"ALBERT  TURK","127 WILMINGTON W CHESTER PIKE","CHADDS FORD","PA",19317,"DENTAL","General Dentist"]
[null,233051080,1841920618,"ANDREW  DOBERSTEIN","5000 CHICHESTER AVE","ASTON","PA",19014,"DENTAL","General Dentist"]
[null,522047317,1093844250,"MOON C CHA","1290 PEOPLES PLZ","NEWARK","DE",19702,"DENTAL","General Dentist"]
[null,882628436,1285767004,"UPINDER  SINGH","3019 MERRITT MILL RD","SALISBURY","MD",21804,"DENTAL","General Dentist"]
[null,454841500,1477720100,"BRADLEY P ADEY","120 LAFAYETTE ST","KENNETT SQUARE","PA",19348,"DENTAL","General Dentist"]
[null,820860187,1417211574,"BENJAMIN R STRAHL","201 BELT ST SUITE A","SNOW HILL","MD",21863,"DENTAL","General Dentist"]
[null,203455344,1619381878,"GREGORY S HUGHES","12000 OLD VINE BLVD UNIT 112","LEWES","DE",19958,"DENTAL","General Dentist"]
[null,201817051,1639336985,"RYAN S MAISEL","1231 SHOPPING CENTER RD","STEVENSVILLE","MD",21666,"DENTAL","General Dentist"]
[null,510321801,1548527104,"FADI N KOSA","2005 CONCORD PIKE","WILMINGTON","DE",19803,"DENTAL","Oral Surgeon"]
[null,881224580,1669528832,"ANDREW M ROSEN","1245 N PROVIDENCE ROAD","MEDIA","PA",19063,"DENTAL","General Dentist"]
[null,232717945,1174678205,"PETER PAUL PATELLIS","208 N UNION ST","KENNETT SQUARE","PA",19348,"DENTAL","General Dentist"]
[null,884102465,1295954006,"ROBERT G HAHN","3105 LIMESTONE ROAD","WILMINGTON","DE",19808,"DENTAL","General Dentist"]
[null,232872480,1659781185,"BENEDICT J PARENTI","162 PAINTERS XING STE 6","WEST CHESTER","PA",19382,"DENTAL","General Dentist"]
[null,451470106,1972655017,"JERRY J POPECK","133 N BROADWAY STE B","PENNSVILLE","NJ","08070","DENTAL","General Dentist"]
[null,222537706,1972775948,"WILLIAM M KOZUCH","520 BECKETT RD STE 100","LOGAN","NJ","08085","DENTAL","General Dentist"]
[null,221973440,1336270495,"JOHN  MCGLYNN","1117 HIGHWAY 77 STE B","BRIDGETON","NJ","08302","DENTAL","General Dentist"]
[null,201374594,1730276726,"KIM CHARLES SYKORA","709 E GAY ST STE 3","WEST CHESTER","PA",19380,"DENTAL","General Dentist"]
[null,922561704,1205419611,"DAVID  ALPERT","2018 NAAMANS RD","WILMINGTON","DE",19810,"DENTAL","General Dentist"]
[null,521020618,1326112160,"GREGORY S ALLEN","1346 S DIVISION ST STE 104","SALISBURY","MD",21804,"DENTAL","General Dentist"]
[null,208643759,1407803398,"OTTO F TIDWELL","1004 S STATE ST STE 1","DOVER","DE",19901,"DENTAL","General Dentist"]
[null,510275522,1538388335,"MARK C DELLOSE","3105 LIMESTONE RD STE 304","WILMINGTON","DE",19808,"DENTAL","General Dentist"]
[null,521466430,1619170065,"JAY H NAVE","325 CRUSADER RD","CAMBRIDGE","MD",21613,"DENTAL","General Dentist"]
[null,522136775,1881281830,"RACHEL  NOLAN","202 S MAPLE AVE","CHESTERTOWN","MD",21620,"DENTAL","General Dentist"]
[null,845081038,1679615736,"CAN  NGUYEN","125 GREENTREE DR STE 2","DOVER","DE",19904,"DENTAL","Orthodontist"]
[null,853088518,1629395264,"JAY W ALBANESE","300 OLD FORGE LN STE 301","KENNETT SQUARE","PA",19348,"DENTAL","Oral Surgeon"]
[null,883410060,1407574205,"DELAWARE FIRST HEALTH","3162 MOMENTUM PL","CHICAGO","IL",60689,"DENTAL","General Dentist"]
[null,521556536,1487791141,"DAVID H SCHIFF","11200 RACETRACK RD STE A","BERLIN","MD",21811,"DENTAL","General Dentist"]
[null,472184263,1629358023,"MIRETTE  KHALIL","10776 GRAYS CORNER RD UNIT 9","BERLIN","MD",21811,"DENTAL","General Dentist"]
[null,590634433,1285911222,"MARIELLA  DESTEFANO","1600 ROCKLAND RD","WILMINGTON","DE",19803,"DENTAL","Pediatric Dentist"]
[null,232939632,1417036914,"ROBERT M PAOLINO","15 REGENCY PLZ","GLEN MILLS","PA",19342,"DENTAL","Oral Surgeon"]
[null,510327835,1497496830,"LINDA  ASIAMAH","1401 SILVERSIDE RD # 2A","WILMINGTON","DE",19810,"DENTAL","General Dentist"]
[null,462752854,1992817407,"DAVID J KOPECKI","4901 LIMESTONE RD","WILMINGTON","DE",19808,"DENTAL","Prosthodontist"]
[null,510214005,1205561354,"JOHN  CLIVE","51 HUNTFIELD DR STE 201","SMYRNA","DE",19977,"DENTAL","General Dentist"]
[null,833246828,1003109877,"JILL L GARRIDO","2207 SILVERSIDE RD","WILMINGTON","DE",19810,"DENTAL","Pediatric Dentist"]
[null,521103997,1588224596,"KRISTIN  MAZZEI","12308 OCEAN GTWY STE 6","OCEAN CITY","MD",21842,"DENTAL","General Dentist"]
[null,874533714,1063941623,"LUKE  CAMAGNA","845 KEDRON AVE","MORTON","PA",19070,"DENTAL","General Dentist"]
[null,475265368,1518287143,"MARYCLARE  KUBASKO","125 GREENTREE DR STE 2","DOVER","DE",19904,"DENTAL","General Dentist"]
[null,851291207,1992087068,"LJILJANA  STANISIC","1 WHEATLEY BLVD","MULLICA HILL","NJ","08062","DENTAL","General Dentist"]
[null,222488654,1740840388,"JOSEPH A TEOLI","1802 W 4TH ST","WILMINGTON","DE",19805,"DENTAL","General Dentist"]
[null,510266734,1083596423,"ABIGAIL  ADAMS","543 N SHIPLEY ST STE E","SEAFORD","DE",19973,"DENTAL","General Dentist"]
[null,510214005,1609542000,"CHRISTOPHER  HAHN","51 HUNTFIELD DR STE 201","SMYRNA","DE",19977,"DENTAL","General Dentist"]
[null,814320869,1811151863,"ANNIE E CREATO","700 S CHESTER RD STE A","SWARTHMORE","PA",19081,"DENTAL","Pediatric Dentist"]
[null,260358675,1164623468,"TERESA  ADDIEGO","331 WILMINGTON W CHESTER PIKE STE 7","GLEN MILLS","PA",19342,"DENTAL","General Dentist"]
[null,510562439,1780745836,"MICHAEL J RYAN","28318 DUPONT BLVD UNIT 1","MILLSBORO","DE",19966,"DENTAL","General Dentist"]
[null,814419542,1689063687,"MI-YON  CHOI","46400 BENEDICT DR STE 101","STERLING","VA",20164,"DENTAL","General Dentist"]
[null,814419542,1093009052,"EDWARD J CHOI","46400 BENEDICT DR STE 101","STERLING","VA",20164,"DENTAL","General Dentist"]
[null,871534276,1447788955,"LEAH  YI","74 OMEGA DR","NEWARK","DE",19713,"DENTAL","Orthodontist"]
[null,842605748,1376821306,"STEVEN L GELBART","29 S 7TH ST","PHILADELPHIA","PA",19106,"DENTAL","General Dentist"]
[null,232054483,1326028317,"CYNTHIA D TRENTACOSTI","721 E BALTIMORE PIKE STE 200","KENNETT SQUARE","PA",19348,"DENTAL","Oral Surgeon"]
[null,851678369,1477689495,"JOSEPH F DESANTIS","358 W 1ST AVE","PARKESBURG","PA",19365,"DENTAL","General Dentist"]
[null,842136041,1639258965,"JOHN V LOUIS","304 DOGWOOD DR","SALISBURY","MD",21801,"DENTAL","General Dentist"]
[null,475265368,1760976591,"MORGAN NICOLE MORROW","125 GREENTREE DR STE 2","DOVER","DE",19904,"DENTAL","General Dentist"]
[null,881224580,1932425535,"MERLE R SALDIVAR","1244 WRIGHTS LN","WEST CHESTER","PA",19380,"DENTAL","General Dentist"]
[null,874458482,1891870853,"MYHANH  VU","2603 EASTBURN CTR","NEWARK","DE",19711,"DENTAL","General Dentist"]
[null,992398538,1528377546,"JOHN N DELLA CROCE","413 MCFARLAN RD","KENNETT SQUARE","PA",19348,"DENTAL","General Dentist"]
[null,273575643,1356547715,"SOPHIA  USMANI","201 CARTER DR STE A","MIDDLETOWN","DE",19709,"DENTAL","General Dentist"]
[null,472532794,1871088070,"HONG  YANG","2412 N SALISBURY BLVD STE A","SALISBURY","MD",21801,"DENTAL","General Dentist"]
[null,994989830,1023901881,"PRIYABEN S PATEL","2412 N SALISBURY BLVD STE A","SALISBURY","MD",21801,"DENTAL","General Dentist"]
[null,232995891,1003037979,"BRENDAN  MULLIGAN","208 W STATE ST","KENNETT SQUARE","PA",19348,"DENTAL","General Dentist"]
[null,232655227,1477603207,"CHRISTIAN C FRANCK","721 E BALTIMORE PIKE STE 301","KENNETT SQUARE","PA",19348,"DENTAL","General Dentist"]
[null,843504990,1144714247,"GREGORY S HAINES","1104 COOPER ST","DEPTFORD","NJ","08096","DENTAL","General Dentist"]
[null,994989830,1295577534,"JAMAAL  BROWN","11349 SAMUEL BOWEN BLVD","BERLIN","MD",21811,"DENTAL","General Dentist"]
[null,205584804,1306822796,"ALI  SOULATI","401 PURDY ST STE 101","EASTON","MD",21601,"DENTAL","General Dentist"]
[null,822856401,1528056702,"LANCE R PANARELLO","1580 MCDANIEL DR","WEST CHESTER","PA",19380,"DENTAL","General Dentist"]
[null,421594979,1336289206,"KRISTINE H MORRIS","508 CYNWOOD DR STE D","EASTON","MD",21601,"DENTAL","General Dentist"]
[null,334632910,1326468513,"EDWARD  BAYLEY","1401 SILVERSIDE RD STE A","WILMINGTON","DE",19810,"DENTAL","General Dentist"]
[null,200417122,1982702320,"JAY W DORGAN","127 W STREET RD STE 301","KENNETT SQUARE","PA",19348,"DENTAL","General Dentist"]
[null,232690847,1316371719,"JUDITH R SHAFFER","20 PROSPECT AVE","WEST GROVE","PA",19390,"DENTAL","General Dentist"]
[null,260358675,1982221404,"THANH  NGUYEN","331 WILMINGTON W CHESTER PIKE STE 7","GLEN MILLS","PA",19342,"DENTAL","General Dentist"]
[null,473260407,1932489283,"JONATHAN T SOISTMAN","100 PENNSYLVANIA AVE","CENTREVILLE","MD",21617,"DENTAL","General Dentist"]
[null,833246828,1285150003,"BLAIRE  STOVELD","2207 SILVERSIDE RD","WILMINGTON","DE",19810,"DENTAL","Pediatric Dentist"]
[null,412178409,1881036853,"JOHN H KWON","1180 W BALTIMORE PIKE","MEDIA","PA",19063,"DENTAL","Pediatric Dentist"]
[null,141850828,1508060575,"CHRISTINE  STINTON","21444 CARMEAN WAY","GEORGETOWN","DE",19947,"DENTAL","General Dentist"]
[null,237047824,1265961551,"MINYONG  CHEN","601 NEW CASTLE AVE","WILMINGTON","DE",19801,"DENTAL","General Dentist"]
[null,842409270,1255625950,"NICHOLAS F DIBENEDETTO","604 DUTCHMANS LN","EASTON","MD",21601,"DENTAL","General Dentist"]
[null,521615851,1548866932,"MATTHEW R YARMOSKY","19643 BLUE BIRD LN UNT 1","REHOBOTH BEACH","DE",19971,"DENTAL","General Dentist"]
[null,232054483,1720124746,"AMIN  KAZEMI","721 E BALTIMORE PIKE STE 200","KENNETT SQUARE","PA",19348,"DENTAL","Oral Surgeon"]
[null,845081038,1063611747,"ROBERT DONG PARK","26670 CENTERVIEW DR UNIT 19","MILLSBORO","DE",19966,"DENTAL","Orthodontist"]
[null,201594846,1922087543,"DEBORAH E BACKIEL","1500 JOHN F KENNEDY BLVD STE 300","PHILADELPHIA","PA",19102,"DENTAL","General Dentist"]
[null,300523387,1417158189,"DONALD  LIU","120 LAFAYETTE ST STE 1","KENNETT SQUARE","PA",19348,"DENTAL","Endodontist"]
[null,881224580,1215155569,"DAMIAN C MILILLO","1244 WRIGHTS LN","WEST CHESTER","PA",19380,"DENTAL","General Dentist"]
[null,200891967,1336192483,"DANIEL K MOENNING","522 E MARION AVE STE 31","PUNTA GORDA","FL",33950,"DENTAL","General Dentist"]
[null,216000928,"NULL","TREASURER STATE OF NJ","PO BOX 417754","BOSTON","MA","02241","DENTAL","General Dentist"]
[null,994989830,1750011094,"FRANSISCA  CASTILLO","213 MARLBORO AVE","EASTON","MD",21601,"DENTAL","General Dentist"]
[null,270191042,1154686228,"TONTESH S TAWADY","2107 LAUREL BUSH RD STE 203","BEL AIR","MD",21015,"DENTAL","Endodontist"]
[null,471821554,1992144802,"BRANDON M BERMAN","127 N WEST ST STE 1","EASTON","MD",21601,"DENTAL","General Dentist"]
[null,472532794,1194471359,"KEZIA  SOWAH","722 E PULASKI HWY STE 102","ELKTON","MD",21921,"DENTAL","General Dentist"]
[null,920833073,1194354712,"AESHA  AMIN","414 CAPITOL TRL","NEWARK","DE",19711,"DENTAL","General Dentist"]
[null,881224580,1609938828,"THERESA  CINIGLIO-SMITH","145 BRINTON LAKE RD STE 300","GLEN MILLS","PA",19342,"DENTAL","Periodontist"]
[null,850954908,1346730249,"ALEXIS J HERRING","29466 PINTAIL DR STE 16","EASTON","MD",21601,"DENTAL","Endodontist"]
[null,270868850,1730399007,"KRISTIE M PALUMBO","3213 EDGMONT AVE","BROOKHAVEN","PA",19015,"DENTAL","General Dentist"]
[null,222218302,1306884044,"DOUGLAS H SEEGER","213 N BROADWAY","PENNSVILLE","NJ","08070","DENTAL","Oral Surgeon"]
[null,521116591,1760970636,"MARCELA  FLORES AMADOR","316 RAILROAD AVE","GOLDSBORO","MD",21636,"DENTAL","General Dentist"]
[null,222218302,1215323944,"GINO A INVERSO","992 MANTUA PIKE STE 302","WOODBURY HEIGHTS","NJ","08097","DENTAL","Oral Surgeon"]
[null,320285314,1891913893,"JOHN C O BRIEN","729 FRANKLINVILLE RD","MULLICA HILL","NJ","08062","DENTAL","General Dentist"]
[null,821451293,1528056702,"LANCE R PANARELLO","100 CAMPBELL BLVD STE 102","EXTON","PA",19341,"DENTAL","General Dentist"]
[null,922059494,1083450787,"KANWER PAUL  SRAN","14203 COASTAL HWY STE 1","OCEAN CITY","MD",21842,"DENTAL","General Dentist"]
[null,920862580,1861410094,"ROSS E STAUFFER","415 PENNINGTON AVE STE 100","HAVRE DE GRACE","MD",21078,"DENTAL","General Dentist"]
[null,884280989,1760850176,"REEFAT  MALHOTRA","100 RIDGE RD STE 36","CHADDS FORD","PA",19317,"DENTAL","General Dentist"]
[null,992424569,1053765859,"ALICE  BASSANI","23 E SECOND ST","MEDIA","PA",19063,"DENTAL","General Dentist"]
[null,232173361,1255788998,"ALEX  ROSNER","990 CITY AVE","WYNNEWOOD","PA",19096,"DENTAL","Pediatric Dentist"]
[null,862675808,1760976591,"MORGAN NICOLE MORROW","818 KOHL AVE # 820","MIDDLETOWN","DE",19709,"DENTAL","General Dentist"]
[null,232321187,1720134596,"JAMES J GENTILE","120 E BALTIMORE PIKE","MEDIA","PA",19063,"DENTAL","Prosthodontist"]
[null,834309678,1245645696,"ADARSH  MODANI","364 WILMINGTON W CHESTER PIKE STE A1","GLEN MILLS","PA",19342,"DENTAL","General Dentist"]
[null,521229414,1104911080,"RICHARD V GRUBB","203 S WASHINGTON ST","HAVRE DE GRACE","MD",21078,"DENTAL","General Dentist"]
[null,814101497,1841488707,"ERIC  MORSE","325 BROAD ST","PERRYVILLE","MD",21903,"DENTAL","General Dentist"]
[null,274323343,1063689073,"EMILY F EILERMAN BILLS","1630 ROUTE 322","WOOLWICH TOWNSHIP","NJ","08085","DENTAL","Pediatric Dentist"]
[null,822396961,1770873622,"BOGDAN V LEVITSKY","7 MYERS DR","MULLICA HILL","NJ","08062","DENTAL","General Dentist"]
[null,872954303,1508387648,"DAVID M MACONI","810 DARBY RD","HAVERTOWN","PA",19083,"DENTAL","General Dentist"]
[null,521259065,1588876965,"DONALD M JACKSON","311 SAINT MARKS CHURCH RD","PERRYVILLE","MD",21903,"DENTAL","General Dentist"]
[null,201218318,1336485416,"KEVIN Y MYINT","343 E PULASKI HWY","ELKTON","MD",21921,"DENTAL","General Dentist"]
[null,992688252,1588828073,"MARY B ALEXANDER","104 MILFORD ST","SALISBURY","MD",21804,"DENTAL","General Dentist"]
[null,510266734,1205846565,"LOURDES L NUNEZ","543 N SHIPLEY ST STE E","SEAFORD","DE",19973,"DENTAL","General Dentist"]
[null,475265368,1518287143,"MARYCLARE  KUBASKO","125 GREENTREE DR STE 2","DOVER","DE",19904,"DENTAL","General Dentist"]
[null,520981077,1326189135,"JAMES M NANCE","551 RIVERSIDE DR","SALISBURY","MD",21801,"DENTAL","General Dentist"]
[null,203455344,1518168285,"JAIME  GREEN","12000 OLD VINE BLVD UNIT 112","LEWES","DE",19958,"DENTAL","General Dentist"]
[null,453458048,1346498581,"ISHBEL  NIEVES-REYES","26540 ACE AVE #G-105","LEESBURG","FL",34748,"DENTAL","General Dentist"]
[null,475265368,1760976591,"MORGAN NICOLE MORROW","125 GREENTREE DR STE 2","DOVER","DE",19904,"DENTAL","General Dentist"]
[null,994989830,1194471359,"KEZIA  SOWAH","722 E PULASKI HWY STE 102","ELKTON","MD",21921,"DENTAL","General Dentist"]
[null,862958838,1922356070,"LINDSAY M FREEDMAN","401 CHARLES ST","HURLOCK","MD",21643,"DENTAL","General Dentist"]
[null,261545477,1992020390,"ROBERT M BLITZER","32895 COASTAL HWY UNT 102","BETHANY BEACH","DE",19930,"DENTAL","General Dentist"]
[null,562405411,1023038049,"VALERIE L YANISZEWSKI","6237 CAROLINA COMMONS DR STE 330","INDIAN LAND","SC",29707,"DENTAL","General Dentist"]
[null,331483536,1164685459,"RICHARD M DELVECCHIO","5775 N. MAIN ST.","ROCK HALL","MD",21661,"DENTAL","General Dentist"]
[null,521116591,1144960683,"MORGAN  RHODES","316 RAILROAD AVE","GOLDSBORO","MD",21636,"DENTAL","General Dentist"]
[null,200853311,1578564290,"ALYSSA S BERNSTEIN","560 ST GEORGES AVE","RAHWAY","NJ","07065","DENTAL","General Dentist"]
[null,992688252,1417557851,"AISHA  SADAF","104 MILFORD ST","SALISBURY","MD",21804,"DENTAL","General Dentist"]
[null,510562439,1174684211,"IAN K BINNERSLEY","28318 DUPONT BLVD UNIT 1","MILLSBORO","DE",19966,"DENTAL","General Dentist"]
[null,233051080,1881325777,"DEENA  PAPADOPOULOS","5000 CHICHESTER AVE","ASTON","PA",19014,"DENTAL","General Dentist"]
[null,521020618,1477240406,"JANELL  HADID","1346 S DIVISION ST STE 104","SALISBURY","MD",21804,"DENTAL","General Dentist"]
[null,861055464,1457400798,"JAMES C POCHRON","116 S PINEY RD STE 202","CHESTER","MD",21619,"DENTAL","General Dentist"]
[null,994989830,1083134324,"RABECCA  VANEVENHOVEN","722 E PULASKI HWY STE 102","ELKTON","MD",21921,"DENTAL","Oral Surgeon"]
[null,232054483,1588866933,"MICHAEL D WALKER","600 E MARSHALL ST STE 106","WEST CHESTER","PA",19380,"DENTAL","Oral Surgeon"]
[null,884102465,1184150815,"DHEEREN  PADHIAR","3105 LIMESTONE ROAD","WILMINGTON","DE",19808,"DENTAL","General Dentist"]
[null,991860454,1508080813,"ANITA M MILICI","1 CRESCENT DR STE 300","PHILADELPHIA","PA",19112,"DENTAL","Periodontist"]
[null,200185918,1144661232,"JORDAN E TEDER","9011 DANIELS PKWY STE 105","FORT MYERS","FL",33912,"DENTAL","General Dentist"]
[null,834066015,1508221995,"MARK FRANCIS FORWOOD","107 RUTGERS AVE STE 2","SWARTHMORE","PA",19081,"DENTAL","General Dentist"]
[null,881224580,1285282087,"ISLEEN  WRIDE","550 FAIRVIEW RD","WOODLYN","PA",19094,"DENTAL","General Dentist"]
[null,921917009,1013962794,"KEITH E SILVERSTEIN","21 INDUSTRIAL BLVD STE 100","PAOLI","PA",19301,"DENTAL","Oral Surgeon"]
[null,510321801,1972948198,"MICHAEL D D'AMICO","2001 CONCORD PIKE STE 200","WILMINGTON","DE",19803,"DENTAL","Oral Surgeon"]
[null,815076123,1548606874,"XIMENA  VELASQUEZ-PIERCE","1872 TAMIAMI TRL S STE E","VENICE","FL",34293,"DENTAL","General Dentist"]
[null,992192088,1689854945,"HILDA  OWEISY","1515 SAVANNAH RD STE 101","LEWES","DE",19958,"DENTAL","Orthodontist"]
[null,204716788,1639258965,"JOHN V LOUIS","218 BAY ST","EASTON","MD",21601,"DENTAL","General Dentist"]
[null,991006354,1720569189,"ERIC D SAMSON","2327 FOREST DR Suite A","ANNAPOLIS","MD",21401,"DENTAL","General Dentist"]
[null,271473680,1043459514,"JON PAUL  JACQUET","25 E MAIN ST","MILLVILLE","NJ","08332","DENTAL","General Dentist"]
[null,994989830,1295577534,"JAMAAL  BROWN","2412 N SALISBURY BLVD STE A","SALISBURY","MD",21801,"DENTAL","General Dentist"]
[null,232054483,1528416732,"BRADLEY  BELOUS","600 E MARSHALL ST STE 106","WEST CHESTER","PA",19380,"DENTAL","Oral Surgeon"]
[null,521250067,1942590203,"JOHN F HEATON","556 CYNWOOD DR STE B","EASTON","MD",21601,"DENTAL","Endodontist"]
[null,842147850,1871960666,"NAVKARAN  BAKSHI","1050 BALTIMORE PIKE","SPRINGFIELD","PA",19064,"DENTAL","Endodontist"]
[null,934938595,1619603057,"MAHA  TAYEFEH","907 LINCOLN AVE","PROSPECT PARK","PA",19076,"DENTAL","General Dentist"]
[null,450540888,1265699565,"THOMAS T KIM","734 S US HIGHWAY 441","LADY LAKE","FL",32159,"DENTAL","General Dentist"]
[null,233024574,1629168026,"MING LUNG  YANG","606 E MARSHALL ST STE 204","WEST CHESTER","PA",19380,"DENTAL","Endodontist"]
[null,843365530,1396148490,"SAPNA  SRIVASTAVA","1300 MACDADE BLVD UNIT 5","WOODLYN","PA",19094,"DENTAL","General Dentist"]
[null,472532794,1821828138,"BIANKA  AMIN","2412 N SALISBURY BLVD STE A","SALISBURY","MD",21801,"DENTAL","General Dentist"]
[null,231412950,1932380284,"JEFFREY M SHORE","519 CHESTER PIKE","NORWOOD","PA",19074,"DENTAL","General Dentist"]
[null,592747313,1669512182,"STEVEN D REDDICK","440 S BUCKMOORE RD","LAKE WALES","FL",33853,"DENTAL","General Dentist"]
[null,200185918,1346972320,"CALEB  MARTIN","17840 TOLEDO BLADE BLVD UNIT A","PORT CHARLOTTE","FL",33948,"DENTAL","General Dentist"]
[null,232109545,1942249545,"RICHARD J CLARK","1050 BALTIMORE PIKE STE 1","SPRINGFIELD","PA",19064,"DENTAL","Oral Surgeon"]
[null,208050762,1316140478,"WALTER B FINGAR","247 MEAD RD","HARDEEVILLE","SC",29927,"DENTAL","General Dentist"]
[null,473041403,1578900924,"MELODY C MAFA","917 MACDADE BLVD","COLLINGDALE","PA",19023,"DENTAL","General Dentist"]
[null,233024574,1902947518,"KENNETH  LEE","606 E MARSHALL ST STE 204","WEST CHESTER","PA",19380,"DENTAL","Endodontist"]
[null,813855907,1346835196,"JULIANNA L KO","2300 PENNSYLVANIA AVE STE 5C","WILMINGTON","DE",19806,"DENTAL","Periodontist"]
[null,333560475,1023418225,"ANDREW D BARNES","5 CAULK LN STE 1","EASTON","MD",21601,"DENTAL","General Dentist"]
[null,881186055,1568020618,"MARCUS  LEIBOWITZ","141 TUCKAHOE RD STE 380","SEWELL","NJ","08080","DENTAL","General Dentist"]
[null,179722392,1760507214,"REHAN  SIBGATULLAH","28 FRIENDLY DR","QUARRYVILLE","PA",17566,"DENTAL","General Dentist"]
[null,813855907,1346835196,"JULIANNA L KO","2300 PENNSYLVANIA AVE STE 5C","WILMINGTON","DE",19806,"DENTAL","Periodontist"]
[null,521456103,1174814537,"GLENN  CANARES","650 W BALTIMORE ST STE 5201","BALTIMORE","MD",21201,"DENTAL","Pediatric Dentist"]
[null,472532794,1003369448,"EKATERINA  SPIRINA","11349 SAMUEL BOWEN BLVD","BERLIN","MD",21811,"DENTAL","General Dentist"]
[null,274323343,1063689073,"EMILY F EILERMAN BILLS","1304 LIBERTY PL","SICKLERVILLE","NJ","08081","DENTAL","Pediatric Dentist"]
[null,853206983,1336523570,"LANCE  MILLER","222 WILLOW VALLEY LAKES DR STE 1400","WILLOW STREET","PA",17584,"DENTAL","General Dentist"]
[null,474160760,1477763548,"MARC L ALBANO","4 BURTON LN STE 400","MULLICA HILL","NJ","08062","DENTAL","Pediatric Dentist"]
[null,562060670,1619043585,"MEAD  SLAGLE","PO BOX 967","BUXTON","NC",27920,"DENTAL","General Dentist"]
[null,862675808,1609320100,"SUSHAEN  RANGARAMANUJAM","818 KOHL AVE # 820","MIDDLETOWN","DE",19709,"DENTAL","General Dentist"]
[null,271170796,1528148384,"THOMAS C WATSON","39 N SPROUL RD","BROOMALL","PA",19008,"DENTAL","General Dentist"]
[null,232667416,1245380922,"THOMAS N VERNA","114 S STATE RD","SPRINGFIELD","PA",19064,"DENTAL","General Dentist"]
[null,231731220,1649477563,"ILIANA  TATI","227 W MINER ST","WEST CHESTER","PA",19382,"DENTAL","General Dentist"]
[null,473026714,1043320351,"SHAUNNA J SZABO","1070 HWY 501 BUSINESS","CONWAY","SC",29526,"DENTAL","General Dentist"]
[null,461409174,1205400736,"PATRICK  RUPERT","656 DOWNINGTOWN PIKE","WEST CHESTER","PA",19380,"DENTAL","General Dentist"]
[null,812070099,1679738892,"JAYALAKSHMI  SHRIPAD","230 S BRIDGE ST STE A","ELKTON","MD",21921,"DENTAL","General Dentist"]
[null,270246936,1255545281,"ROBERT D LESH","3495 WEDGEWOOD LN","THE VILLAGES","FL",32162,"DENTAL","General Dentist"]
[null,262231139,1245216985,"BYRDE L PETTIGREW","499 BECKETT RD STE 101","LOGAN","NJ","08085","DENTAL","Pediatric Dentist"]
[null,830630123,1962583245,"KIM-LINH L TRAN","2002 SPROUL RD STE 100","BROOMALL","PA",19008,"DENTAL","General Dentist"]
[null,275068668,1457581217,"CHRISTOPHER H RAE","131 VICTORIA COMMONS BLVD","DELAND","FL",32724,"DENTAL","General Dentist"]
[null,232708126,1912197120,"MEGAN  ESKRIDGE","330 W OREGON AVE STE H","PHILADELPHIA","PA",19148,"DENTAL","Pediatric Dentist"]
[null,862675808,1942313978,"KATHY L REDDEN","818 KOHL AVE # 820","MIDDLETOWN","DE",19709,"DENTAL","General Dentist"]
[null,510321801,1487008397,"HABIB T ASMARO","2005 CONCORD PIKE","WILMINGTON","DE",19803,"DENTAL","Oral Surgeon"]
[null,472532794,1629417654,"BINDU M VEMARAJU","722 E PULASKI HWY STE 102","ELKTON","MD",21921,"DENTAL","General Dentist"]
[null,590634433,1043831860,"AMANDA  MORGENTHAL","1600 ROCKLAND RD","WILMINGTON","DE",19803,"DENTAL","Pediatric Dentist"]
[null,592550950,1396863718,"JOHN C BYERS","605 17TH ST 1ST FL # 2","VERO BEACH","FL",32960,"DENTAL","General Dentist"]
[null,474252387,1326335910,"JASON S RAINES","4 BURTON LN STE 200","MULLICA HILL","NJ","08062","DENTAL","General Dentist"]
[null,822987704,1841588530,"JASON MATTHEW BERG","13590 S JOG RD STE 1","DELRAY BEACH","FL",33446,"DENTAL","General Dentist"]
[null,994989830,1689405755,"DIAMOND  HIGGIN","722 E PULASKI HWY STE 102","ELKTON","MD",21921,"DENTAL","General Dentist"]
[null,192401635,1093935884,"MARTIN J PASTUCKA","1430 BRIDGE ST","NEW CUMBERLAND","PA",17070,"DENTAL","General Dentist"]
[null,593038968,1568726347,"ALBERT  LEWICKI","1218 E VENICE AVE","VENICE","FL",34285,"DENTAL","General Dentist"]
[null,510398102,1982722617,"ALAN S NGUYEN","685 E CHESTNUT HILL RD","NEWARK","DE",19713,"DENTAL","General Dentist"]
[null,521544071,1023418225,"ANDREW D BARNES","5 CAULK LN","EASTON","MD",21601,"DENTAL","General Dentist"]
[null,222488654,1770337925,"ANNA KUJARUK KUJARUK","1802 W 4TH ST","WILMINGTON","DE",19805,"DENTAL","General Dentist"]
[null,222488654,1679263008,"HOLLEY  FOK","1802 W 4TH ST","WILMINGTON","DE",19805,"DENTAL","General Dentist"]
[null,200391063,1588794507,"JOSEPH B LAWSON","1502 KINGS HWY UNIT 100","PORT CHARLOTTE","FL",33980,"DENTAL","General Dentist"]
[null,510275522,1295954006,"ROBERT G HAHN","3105 LIMESTONE RD STE 304","WILMINGTON","DE",19808,"DENTAL","General Dentist"]
[null,232442788,1194094789,"GLENN J WOLFINGER","467 PENNSYLVANIA AVE STE 201","FORT WASHINGTON","PA",19034,"DENTAL","General Dentist"]
[null,833028013,1083131833,"JACOB  KLAMUT","3730 DEL PRADO BLVD S","CAPE CORAL","FL",33904,"DENTAL","General Dentist"]
[null,830697146,1023065315,"MARIO EDUARDO POLANCO","14731 N CLEVELAND AVE STE 1","NORTH FORT MYERS","FL",33903,"DENTAL","General Dentist"]
[null,474316619,1255788998,"ALEX  ROSNER","7847 OLD YORK RD 2ND FL","ELKINS PARK","PA",19027,"DENTAL","Pediatric Dentist"]
[null,231328672,1760603237,"STEPHEN P HOWARTH","105 N PROVIDENCE RD","WALLINGFORD","PA",19086,"DENTAL","General Dentist"]
[null,884125894,1083055511,"FAKHIRA  NAFEES","106 MILFORD ST STE 304","SALISBURY","MD",21804,"DENTAL","General Dentist"]
[null,251441205,1851443824,"JOSEPH J HAWKINS","1141 S MICHAEL ST","SAINT MARYS","PA",15857,"DENTAL","General Dentist"]
[null,822987704,1841588530,"JASON MATTHEW BERG","13590 S JOG RD STE 7","DELRAY BEACH","FL",33446,"DENTAL","General Dentist"]
[null,873220400,1326428319,"MICHELLE Q CHU","1202 FOULK RD","WILMINGTON","DE",19803,"DENTAL","General Dentist"]
[null,205961509,1114120805,"CHARLES A EVANS","7 BENSON AVE","PENNSVILLE","NJ","08070","DENTAL","General Dentist"]
[null,205269936,1043306806,"STEPHEN DANIEL SCOTT","4771 MAIN ST","MILLBROOK","AL",36054,"DENTAL","General Dentist"]
[null,203589894,1134174162,"PATRICK  PIRKLE","621 SEBASTIAN BLVD STE A","SEBASTIAN","FL",32958,"DENTAL","General Dentist"]
[null,183447303,1295843530,"ALBERT  TURK","127 WILMINGTON W CHESTER PIKE","CHADDS FORD","PA",19317,"DENTAL","General Dentist"]
[null,232869062,1336523141,"ANTHONY J RAPOZA","1319 LINCOLN AVE","PROSPECT PARK","PA",19076,"DENTAL","General Dentist"]
[null,352728506,1336304229,"AVATAR HOLDINGS LLC","PO BOX 201132","DALLAS","TX",75320,"DENTAL","General Dentist"]
[null,822854414,1740625094,"JOSEPH T FACCIOLO","4201 MILLER RD","WILMINGTON","DE",19802,"DENTAL","Orthodontist"]
[null,822272495,1154704658,"STEFANIE  FETTERS","320 EVESBORO MEDFORD RD UNIT 101","MARLTON","NJ","08053","DENTAL","General Dentist"]
[null,264792089,1982898482,"MARIANNA  EVANS","3855 WEST CHESTER PIKE STE 225","NEWTOWN SQUARE","PA",19073,"DENTAL","General Dentist"]
[null,454782861,1538791116,"NICHOLAS  BRANSON","101 CHESAPEAKE BLVD STE A","ELKTON","MD",21921,"DENTAL","Orthodontist"]
[null,813973072,1174932552,"ROBERT  PELLOSIE","110 WATERMAN AVE","MOUNT DORA","FL",32757,"DENTAL","General Dentist"]
[null,262646682,1376223297,"CORY  BOND","160 S BROADWAY","PENNSVILLE","NJ","08070","DENTAL","General Dentist"]
[null,510321801,1487008397,"HABIB T ASMARO","4133 OGLETOWN STANTON RD","NEWARK","DE",19713,"DENTAL","Oral Surgeon"]
[null,462406749,1003912791,"JEROME  TUMMILLO","1429 WALNUT ST FL 6","PHILADELPHIA","PA",19102,"DENTAL","General Dentist"]
[null,473739063,1346310620,"MARK R SIMEONE","3105 C G ZINN RD","THORNDALE","PA",19372,"DENTAL","General Dentist"]
[null,871534276,1447788955,"LEAH  YI","1405 SILVERSIDE RD","WILMINGTON","DE",19810,"DENTAL","Orthodontist"]
[null,332808664,1962059899,"JAMES S SLATTERY","23 REGENCY PLZ","GLEN MILLS","PA",19342,"DENTAL","General Dentist"]
[null,232911630,1720240138,"ALICIA  STOUTLAND","3920 PYLE RD","CHADDS FORD","PA",19317,"DENTAL","Orthodontist"]
[null,462753484,1265710248,"SAMIA A HARDAN","1450 E BOOT RD STE 200D","WEST CHESTER","PA",19380,"DENTAL","Periodontist"]
[null,843979612,1083032742,"JAD  JAFFAL","1950 LAUREL MANOR DR STE 174","THE VILLAGES","FL",32162,"DENTAL","Oral Surgeon"]
[null,232181884,1780608620,"JAY B LAUDENBACH","1520 LOCUST ST STE 600","PHILADELPHIA","PA",19102,"DENTAL","General Dentist"]
[null,651178634,1366468647,"ANDREA  CAMERON","1008 GOODLETTE-FRANK RD N STE 100","NAPLES","FL",34102,"DENTAL","General Dentist"]
[null,850954908,1881605293,"RONALD C TAYLOR","29466 PINTAIL DR STE 16","EASTON","MD",21601,"DENTAL","Endodontist"]
[null,232732126,1700825056,"NEAL E BOZENTKA","700 S CHESTER RD","SWARTHMORE","PA",19081,"DENTAL","Oral Surgeon"]
[null,474057957,1073960282,"REBECCA  NG","1025 N PROVIDENCE RD","MEDIA","PA",19063,"DENTAL","General Dentist"]
[null,233057842,1225119670,"JOHN  CIMINI","3397 SCRANTON CARBONDALE HWY","BLAKELY","PA",18447,"DENTAL","General Dentist"]
[null,231731220,1912171091,"CARL H VOSS","227 W MINER ST","WEST CHESTER","PA",19382,"DENTAL","General Dentist"]
[null,510321801,1386699379,"EUGENE M DAMICO","4133 OGLETOWN STANTON RD","NEWARK","DE",19713,"DENTAL","Oral Surgeon"]
[null,998887777,"NULL","OUT OF COUNTRY","NULL","NULL","NULL","NULL","DENTAL","General Dentist"]
[null,232815882,1013403963,"JORDAN  BLUMENTHAL","6 ORIOLE AVE","MEDIA","PA",19063,"DENTAL","General Dentist"]
[null,451266532,1972099976,"MARK A RAINWATER","1417 FOLLY RD STE 402","CHARLESTON","SC",29412,"DENTAL","General Dentist"]
[null,861759357,1649831512,"ANH  DUONG","100 S MACDADE BLVD","GLENOLDEN","PA",19036,"DENTAL","General Dentist"]
[null,824787461,1538289293,"CHRISTOPHER  CARLE","2020 TOWN CENTER BLVD","KNOXVILLE","TN",37922,"DENTAL","General Dentist"]
[null,520960590,1336245810,"WADE P DRESSLER","503 DUTCHMANS LN STE A","EASTON","MD",21601,"DENTAL","General Dentist"]
[null,223479818,1043546963,"DAVID S RAPONE","294 HARDING HWY","CARNEYS POINT","NJ","08069","DENTAL","General Dentist"]
[null,264692745,1033371653,"BRADLEY PAUL DILLING","16400 HEALTHPARK COMMONS DR","FORT MYERS","FL",33908,"DENTAL","General Dentist"]
[null,994989830,1871088070,"HONG  YANG","722 E PULASKI HWY STE 102","ELKTON","MD",21921,"DENTAL","General Dentist"]
[null,650700946,1972704377,"JANIS JOANNE JEFFERS","81990 OVERSEAS HWY STE 103","ISLAMORADA","FL",33036,"DENTAL","General Dentist"]
[null,223410948,1679165237,"ALEESHA  KAPOOR","209 S MAIN ST","CAPE MAY COURT HOUSE","NJ","08210","DENTAL","General Dentist"]
[null,"020654757",1770695280,"JONATHAN  SCHARF","101 JOHN ROBERT THOMAS DR","EXTON","PA",19341,"DENTAL","General Dentist"]
[null,231352685,1750437885,"DANA  GRAVES","3737 MARKET ST Suite 1000","PHILADELPHIA","PA",19104,"DENTAL","General Dentist"]
[null,611418060,1376662155,"WILLIAM J GRIFFIN","13596 HIGHWAY 231 431 N STE 6","HAZEL GREEN","AL",35750,"DENTAL","General Dentist"]
[null,822269989,1700227923,"DHIREN J AGRAWAL","8640 E COUNTY ROAD 466","THE VILLAGES","FL",32162,"DENTAL","General Dentist"]
[null,510375044,1497875397,"ESSAM K TAHA","21 REGENCY PLZ","GLEN MILLS","PA",19342,"DENTAL","Endodontist"]
[null,830736220,1518022383,"DAVID S CHO","1800 HADDONFIELD-BERLIN RD","CHERRY HILL","NJ","08003","DENTAL","General Dentist"]
[null,454303966,1710917992,"LINDA IULIA GHERMAN","602 S ATWOOD RD STE 101C","BEL AIR","MD",21014,"DENTAL","General Dentist"]
[null,474868273,1043403777,"MARK B HOANG","624 S BROAD ST","PHILADELPHIA","PA",19146,"DENTAL","General Dentist"]
[null,200185918,1538684410,"MONIQUE P ALVES","6019 US HIGHWAY 17 92 N","DAVENPORT","FL",33896,"DENTAL","General Dentist"]
[null,223773644,1912166133,"RUSSELL  SINGLETON","1450 E CHESTNUT AVE STE 3C","VINELAND","NJ","08361","DENTAL","General Dentist"]
[null,872230791,1386133452,"DUY  NGUYEN","422 TEAGUE TRL","LADY LAKE","FL",32159,"DENTAL","General Dentist"]
[null,921064705,1336633833,"KIRTI  CHOPRA","255 S 17TH ST STE 2507","PHILADELPHIA","PA",19103,"DENTAL","General Dentist"]
[null,205765240,1346314184,"TONIANN  CONTE","8899 TIMBERWILDE DR STE 1","BONITA SPRINGS","FL",34135,"DENTAL","General Dentist"]
[null,844806926,1043687759,"MICHAEL J HOGLUND","2 MARTIN CT STE 2","EASTON","MD",21601,"DENTAL","General Dentist"]
[null,233024574,1285017418,"JOHN  RUCH","606 E MARSHALL ST STE 204","WEST CHESTER","PA",19380,"DENTAL","Endodontist"]
[null,863970018,1295003093,"STEVEN L ATLAS","664 EXTON CMNS","EXTON","PA",19341,"DENTAL","General Dentist"]
[null,873886038,1598992638,"RITU  MANCHANDA","4750 TOWNSHIP LINE RD","DREXEL HILL","PA",19026,"DENTAL","Endodontist"]
[null,465613930,1255536546,"JACLYN  WERTHEIMER","610 E BALTIMORE PK","MEDIA","PA",19063,"DENTAL","General Dentist"]
[null,331488529,1538168794,"JEFFREY J MARTELLO","4376 BLUFFTON PARKWAY STE 103","BLUFFTON","SC",29910,"DENTAL","General Dentist"]
[null,203810326,1477650455,"JOHN C BLACK","2600 WILLOW STREET PIKE S","WILLOW STREET","PA",17584,"DENTAL","General Dentist"]
[null,510321801,1972948198,"MICHAEL D D'AMICO","4133 OGLETOWN STANTON RD","NEWARK","DE",19713,"DENTAL","Oral Surgeon"]
[null,454553325,1417243411,"CARRIEANN R BRODERICK","104 SCHUBERT DR","DOWNINGTOWN","PA",19335,"DENTAL","General Dentist"]
[null,270868763,1790983112,"ROHINI K BHATIA","1217 W CHESTER PIKE","WEST CHESTER","PA",19382,"DENTAL","General Dentist"]
[null,232965967,1366537789,"ROBERT K LEARDI","690 UNIONVILLE RD","KENNETT SQUARE","PA",19348,"DENTAL","General Dentist"]
[null,815079869,1619039625,"MAEDOT  SEMO","100 MARIS GROVE WAY","GLEN MILLS","PA",19342,"DENTAL","General Dentist"]
[null,834309678,1679959753,"SANJEEDA I HAKIM","364 WILMINGTON W CHESTER PIKE STE A1","GLEN MILLS","PA",19342,"DENTAL","General Dentist"]
[null,842464644,1881349587,"TYRELL  FRIDIE","620 S UNION AVE","HAVRE DE GRACE","MD",21078,"DENTAL","General Dentist"]
[null,275525225,1427219880,"JOSEPH A PIPESH","730 DURKEE ST","NASHVILLE","MI",49073,"DENTAL","General Dentist"]
[null,814812718,1295240646,"ADAM B GREENBERG","13474 ATLANTIC BLVD STE 109","JACKSONVILLE","FL",32225,"DENTAL","General Dentist"]
[null,852834473,1063132470,"NIKOLAUS J CASSIDY","1 CHESTER RD","WALLINGFORD","PA",19086,"DENTAL","General Dentist"]
[null,881158209,1588979835,"DIVYA R MUCHINTAL","1440 POTTSTOWN PIKE","WEST CHESTER","PA",19380,"DENTAL","General Dentist"]
[null,823529393,1437462314,"MADHURI  BATTULA","607 STATION AVE","HADDON HEIGHTS","NJ","08035","DENTAL","General Dentist"]
[null,475329713,1376702563,"CAMMIE T MORRIS","4704 MAIN ST","SHALLOTTE","NC",28470,"DENTAL","General Dentist"]
[null,232001063,1376595157,"BRAD T PIROK","3700 MARKET ST STE 101","PHILADELPHIA","PA",19104,"DENTAL","General Dentist"]
[null,994989830,1295577534,"JAMAAL  BROWN","213 MARLBORO AVE","EASTON","MD",21601,"DENTAL","General Dentist"]
[null,831489230,1518170810,"TIMOTHY  BONNER","316 W 4TH ST","QUARRYVILLE","PA",17566,"DENTAL","General Dentist"]
[null,921730310,1063893071,"MICHAEL IMAD ALHARIR","398 WEST LANCASTER AVE","WAYNE","PA",19087,"DENTAL","General Dentist"]
[null,882298449,1982198958,"VICTORIA A BLACKHURST","20 MONTCHANIN RD STE 150","WILMINGTON","DE",19807,"DENTAL","General Dentist"]
[null,232156206,1124236583,"ROBERT J SPENNATO","601 WILLIAMSBURG DR","BROOMALL","PA",19008,"DENTAL","General Dentist"]
[null,851611741,1982959755,"ARTHUR SCOTT VANDERWAAL","28030 STOCKDICK RD, STE 3","KATY","TX",77493,"DENTAL","General Dentist"]
[null,510562439,1831171701,"RICHARD D BOND","1304 N BROOM ST","WILMINGTON","DE",19806,"DENTAL","General Dentist"]
[null,141850828,1194577783,"LORAINE DE LAS MERCEDES  CEREJIDO MARQUEZ","21444 CARMEAN WAY","GEORGETOWN","DE",19947,"DENTAL","General Dentist"]
[null,522349842,1629067475,"MARY N TEDDY-WRAY","2111 LAUREL BUSH RD STE E","BEL AIR","MD",21015,"DENTAL","General Dentist"]
[null,475577858,1265115539,"SUMERA  ALI","333 GREEN ST","HAVRE DE GRACE","MD",21078,"DENTAL","General Dentist"]
[null,811912432,1346620812,"ERIC ROBERT JENSEN","13713 LINDEN DR","SPRING HILL","FL",34609,"DENTAL","General Dentist"]
[null,232967495,1437373529,"GREGORY A HILLYARD","47 STATE RD","MEDIA","PA",19063,"DENTAL","General Dentist"]
[null,232815882,1629101878,"MITCHEL J BLUMENTHAL","6 ORIOLE AVE","MEDIA","PA",19063,"DENTAL","General Dentist"]
[null,232708126,1811424013,"ALEXIS L GINNANE","330 W OREGON AVE STE H","PHILADELPHIA","PA",19148,"DENTAL","Pediatric Dentist"]
[null,833095905,1053159806,"SABITHA  THIPPALURU","600 E MARSHALL ST STE 204","WEST CHESTER","PA",19380,"DENTAL","General Dentist"]
[null,872669519,1922413442,"DEEPAK P MEHTA","2 SPLIT ROCK DR STE 10","CHERRY HILL","NJ","08003","DENTAL","General Dentist"]
[null,271554700,1821213406,"PAUL H JAWORSKI","3990 CLARK RD","SARASOTA","FL",34233,"DENTAL","General Dentist"]
[null,542088309,1427101062,"JAMES J SUSACK","151 N BROADWAY","PENNSVILLE","NJ","08070","DENTAL","General Dentist"]
[null,231981313,1255075610,"VIHANI  PATEL","491 ALLENDALE RD STE 306","KING OF PRUSSIA","PA",19406,"DENTAL","General Dentist"]
[null,260610687,1437366457,"JAY  LACKMAN","200 MONUMENT RD STE 4","BALA CYNWYD","PA",19004,"DENTAL","General Dentist"]
[null,510562439,1669039244,"TEDI  VATNIKA","1415 FOULK RD STE 200","WILMINGTON","DE",19803,"DENTAL","General Dentist"]
[null,208935457,1023110442,"STEVEN R FREEMAN","3043 INTERNATIONAL GOLF PKWY","SAINT AUGUSTINE","FL",32092,"DENTAL","General Dentist"]
[null,472532794,1295577534,"JAMAAL  BROWN","11349 SAMUEL BOWEN BLVD","BERLIN","MD",21811,"DENTAL","General Dentist"]
[null,862675808,1942313978,"KATHY L REDDEN","818 KOHL AVE # 820","MIDDLETOWN","DE",19709,"DENTAL","General Dentist"]
[null,232152294,1558495119,"BART M GRAFF","100 DEERFIELD LN STE 290","MALVERN","PA",19355,"DENTAL","General Dentist"]
[null,451266532,1740229863,"RONALD J BARTH","1004 SEA MOUNTAIN HIGHWAY","NORTH MYRTLE BEACH","SC",29582,"DENTAL","General Dentist"]
[null,200927903,1255853446,"NAM  HOANG","720 MACDADE BLVD","FOLSOM","PA",19033,"DENTAL","Oral Surgeon"]
[null,815264600,1134458334,"ROBERT B ARTHUR","54 EAST AVE","WOODSTOWN","NJ","08098","DENTAL","General Dentist"]
[null,222414878,1033264593,"CHARLES J RICCIARDI","1930 MARLTON PIKE E STE K-53","CHERRY HILL","NJ","08003","DENTAL","General Dentist"]
[null,451266532,1316529340,"AMANDA M BARRETT","1417 FOLLY RD STE 402","CHARLESTON","SC",29412,"DENTAL","General Dentist"]
[null,521116591,1942901459,"DAVID A MARTIN","320 HARGRAVES DR","FEDERALSBURG","MD",21632,"DENTAL","General Dentist"]
[null,753025758,1316189293,"JAMES MYONGWON KANG","7600 OSLER DR STE 410","BALTIMORE","MD",21204,"DENTAL","General Dentist"]
[null,275189608,1205892387,"MARY M FRARE","2301 E EVESHAM RD STE 308","VOORHEES","NJ","08043","DENTAL","General Dentist"]
[null,271383787,1598851362,"DAVID G CARLTON","15650 SAN CARLOS BLVD","FORT MYERS","FL",33908,"DENTAL","General Dentist"]
[null,510398102,1205914652,"BRUCE G FAY","42 OMEGA DR BLDG H","NEWARK","DE",19713,"DENTAL","General Dentist"]
[null,862974213,1669967162,"WILLIAM  BOROWSKI","212 WILLOW VALLEY LAKES DRIVE Suite 209","WILLOW STREET","PA",17584,"DENTAL","General Dentist"]
[null,364367122,1245345164,"JENNIFER S WILLIAMS","8580 RIVER RD SE","SOUTHPORT","NC",28461,"DENTAL","General Dentist"]
[null,842619904,1841729282,"SOFIA  MENDEZ CARDENAS","1605 TOWN CENTER BLVD STE B","WESTON","FL",33326,"DENTAL","General Dentist"]
[null,200891967,1750334207,"MICHELLE W MOENNING","522 E MARION AVE STE 31","PUNTA GORDA","FL",33950,"DENTAL","General Dentist"]
[null,232667416,1245592567,"GREGORY A BEGGS","114 S STATE RD","SPRINGFIELD","PA",19064,"DENTAL","General Dentist"]
[null,831489230,1962663104,"MATTHEW J COSTA","316 W 4TH ST","QUARRYVILLE","PA",17566,"DENTAL","General Dentist"]
[null,251897995,1316175227,"LIN  QIU","2010 W CHESTER PIKE STE 420","HAVERTOWN","PA",19083,"DENTAL","General Dentist"]
[null,844919448,1336161595,"CHANDEEV R WEERASOORIYA","1861 PLACIDA RD STE 105","ENGLEWOOD","FL",34223,"DENTAL","General Dentist"]
[null,510413028,1912640442,"ASHLEY  BANKS","31381 DOGWOOD ACRES DR","DAGSBORO","DE",19939,"DENTAL","General Dentist"]
[null,232264147,1194307520,"GENNA  VEGH","102 W HIGH ST","ELIZABETHTOWN","PA",17022,"DENTAL","General Dentist"]
[null,261408737,1871701243,"JEFFREY J PRICE","23 BISHOP HOLLOW RD","NEWTOWN SQUARE","PA",19073,"DENTAL","General Dentist"]
[null,270347123,1225121478,"HEATHER J OLSON","204 TOWN BANK RD","CAPE MAY","NJ","08204","DENTAL","General Dentist"]
[null,421583627,1568672442,"KENNETH J BOSCH","630 COPE RD STE D","KENNETT SQUARE","PA",19348,"DENTAL","General Dentist"]
[null,232860692,1336273036,"STEVEN  MELMAN","147 MONTGOMERY AVE","BALA CYNWYD","PA",19004,"DENTAL","General Dentist"]
[null,832045481,1598375412,"ALYSE  O'KELLY","3301 LANCASTER PIKE STE 3F","WILMINGTON","DE",19805,"DENTAL","Pediatric Dentist"]
[null,271663061,1861594244,"NEIL G MCANENY","625 BARKSDALE RD STE 115-117","NEWARK","DE",19711,"DENTAL","General Dentist"]
[null,814320869,1467019240,"SABINA  KORMAN","700 S CHESTER RD STE A","SWARTHMORE","PA",19081,"DENTAL","Pediatric Dentist"]
[null,273699988,1013133750,"GILBERT B LAM","2136 N DINUBA BLVD STE A","VISALIA","CA",93291,"DENTAL","General Dentist"]
[null,520972012,1184612319,"FREDERICK N WYMAN","111 SPRING AVE","CHESTERTOWN","MD",21620,"DENTAL","General Dentist"]
[null,822854414,1427567379,"MID-ATLANTIC DENTAL PARTNERS DELAWARE II PA","4201 MILLER RD","WILMINGTON","DE",19802,"DENTAL","General Dentist"]
[null,843365530,1801202338,"JORDAN T KLINKNER","1300 MACDADE BLVD UNIT 5","WOODLYN","PA",19094,"DENTAL","General Dentist"]
[null,881224580,1619038940,"BRUCE H GODICK","550 FAIRVIEW RD","WOODLYN","PA",19094,"DENTAL","Endodontist"]
[null,884125108,1265729776,"RAJAN D FALDU","23 REGENCY PLZ","GLEN MILLS","PA",19342,"DENTAL","General Dentist"]
[null,465287073,1558626481,"DANIEL R SEGER","4720 PENNELL RD","ASTON","PA",19014,"DENTAL","General Dentist"]
[null,462406749,1205404456,"CARLOS J HUERGO","1429 WALNUT ST FL 6","PHILADELPHIA","PA",19102,"DENTAL","General Dentist"]
[null,591264801,1942650007,"CARY  BERDY","1511 STOCKTON ST","JACKSONVILLE","FL",32204,"DENTAL","General Dentist"]
[null,994989830,1912216854,"JAE H KIM","11349 SAMUEL BOWEN BLVD","BERLIN","MD",21811,"DENTAL","Oral Surgeon"]
[null,932749066,1215347620,"KIMMIE A PATEL","1601 WALNUT ST STE 1217","PHILADELPHIA","PA",19102,"DENTAL","General Dentist"]
[null,521162190,1457792459,"RACHEL  BAYLIN","3655A OLD COURT RD","BALTIMORE","MD",21208,"DENTAL","General Dentist"]
[null,611556845,1043428667,"KIMBERLY G PACKER","1500 BLENHIEM LN STE D","HAVRE DE GRACE","MD",21078,"DENTAL","General Dentist"]
[null,167629303,1720302490,"MAX  LAI","1 HIBBERDS PL","BROOMALL","PA",19008,"DENTAL","General Dentist"]
[null,474662090,1326223793,"ARCHIE  COOK","251 KEISLER DR STE 200","CARY","NC",27518,"DENTAL","General Dentist"]
[null,271388317,1821005299,"KEVIN J MAZUR","10317 PERRY HWY","WEXFORD","PA",15090,"DENTAL","General Dentist"]
[null,200185918,1134349269,"CLAUDIE  DELGADO","24940 S TAMIAMI TRL STE 202","BONITA SPRINGS","FL",34134,"DENTAL","General Dentist"]
[null,845081038,1437287935,"SONAL  DAVE","2304 CONCORD PIKE","WILMINGTON","DE",19803,"DENTAL","General Dentist"]
[null,208131053,1023039864,"FRED C HADDAD","477 GREENTREE RD STE C","SEWELL","NJ","08080","DENTAL","General Dentist"]
[null,233051080,1750439758,"DANIEL  CHEN","5000 CHICHESTER AVE","ASTON","PA",19014,"DENTAL","General Dentist"]
[null,272664236,1518263300,"IAN S THOMAS","30 N BROOKSIDE RD","SPRINGFIELD","PA",19064,"DENTAL","Orthodontist"]
[null,510257229,1861144453,"SARAH  CATANIA","100 W ROCKLAND RD # P 1","MONTCHANIN","DE",19710,"DENTAL","General Dentist"]
[null,453608325,1942468590,"KHALFANI D WALKER","11175 GEORGIA AVE STE A","WHEATON","MD",20902,"DENTAL","General Dentist"]
[null,510321801,1134565963,"AHMAD  ELTEJAYE","4133 OGLETOWN STANTON RD","NEWARK","DE",19713,"DENTAL","Oral Surgeon"]
[null,920663270,1215598412,"NEHAL  MALIK","104 BALTIMORE PIKE","SPRINGFIELD","PA",19064,"DENTAL","General Dentist"]
[null,822173399,1447301106,"M CONSTANCE C GREELEY","400 OLD FORGE LN STE 406","KENNETT SQUARE","PA",19348,"DENTAL","General Dentist"]
[null,844852718,1669766978,"QUINTA IDIARE DAVIS","4110 E STATE ROAD 44 STE 503","WILDWOOD","FL",34785,"DENTAL","General Dentist"]
[null,200163809,1912064049,"MICHAEL I WOLLOCK","604 TIMES BLDG SUBURBAN SQ","ARDMORE","PA",19003,"DENTAL","General Dentist"]
[null,462931351,1073002697,"KHUSHALI  RAM","2140 VOORHEES TOWN CTR","VOORHEES","NJ","08043","DENTAL","Pediatric Dentist"]
[null,275068734,1639212525,"MICHELLE F KLINE","703 E LANCASTER AVE","DOWNINGTOWN","PA",19335,"DENTAL","General Dentist"]
[null,450902164,1609921105,"JULIANNE M WYMAN","236 S BRIDGE ST","ELKTON","MD",21921,"DENTAL","Orthodontist"]
[null,871547614,1275636151,"JEFFREY M HENDRIX","695 W BALTIMORE PIKE","WEST GROVE","PA",19390,"DENTAL","Orthodontist"]
[null,260358675,1982221404,"THANH  NGUYEN","331 WILMINGTON W CHESTER PIKE STE 7","GLEN MILLS","PA",19342,"DENTAL","General Dentist"]
[null,231352685,1336355122,"CHUN-HSI H CHUNG","240 S 40TH ST","PHILADELPHIA","PA",19104,"DENTAL","Orthodontist"]
[null,463778054,1285725648,"JEFFREY A HAMEROFF","7320 FOREST OAKS BLVD","SPRING HILL","FL",34606,"DENTAL","Periodontist"]
[null,451533965,1043378169,"GHASSAN G SINADA","6569 N CHARLES ST STE 601PPW","BALTIMORE","MD",21204,"DENTAL","Prosthodontist"]
[null,933698747,1770945339,"ANGELA  AVERILL","9929 REA RD STE 100","WAXHAW","NC",28173,"DENTAL","General Dentist"]
[null,932752733,1750056008,"KATHERINE  NI","2207 OREGON PIKE STE 201","LANCASTER","PA",17601,"DENTAL","General Dentist"]
[null,232114872,1861445678,"SANDER I WHITE","2193 W CHESTER PIKE","BROOMALL","PA",19008,"DENTAL","General Dentist"]
[null,472157654,1356182034,"MICHAEL  CLEMENS","511 N PROVIDENCE RD","MEDIA","PA",19063,"DENTAL","General Dentist"]
[null,272227984,1740445360,"SCOTT J HARRIS","2600 N MILITARY TRL STE 348","BOCA RATON","FL",33431,"DENTAL","General Dentist"]
[null,814805611,1649460718,"SCOTT  LEVY","1215 W BALTIMORE PIKE Suite 9","MEDIA","PA",19063,"DENTAL","Endodontist"]
[null,932248897,1417237876,"WILLIAM H TEMPLE","900 HIGHWAY 17 STE E","NORTH MYRTLE BEACH","SC",29582,"DENTAL","Oral Surgeon"]
[null,872669794,1780684134,"C DAREN  CARLILE","6901 S PIERCE ST STE 335","LITTLETON","CO",80128,"DENTAL","General Dentist"]
[null,862424391,1790272904,"TAYLOR N SNIDER","25 EAST MAIN STREET","GEORGETOWN","MA","01833","DENTAL","General Dentist"]
[null,270191042,1063604718,"JUDY Y MELAMED","2107 LAUREL BUSH RD STE 203","BEL AIR","MD",21015,"DENTAL","Endodontist"]
[null,822985653,1306286877,"NIPA R THAKKAR","1595 MCDANIEL DR","WEST CHESTER","PA",19380,"DENTAL","General Dentist"]
[null,743149047,1366587651,"GREGORY  DEARING","5360 SUMMIT BRIDGE RD STE 1","MIDDLETOWN","DE",19709,"DENTAL","Endodontist"]
[null,851570210,1306364112,"NATHAN L BECK","7405 MORRO RD","ATASCADERO","CA",93422,"DENTAL","General Dentist"]
[null,851570499,1225768864,"SALONI N MANSURI","4605 STATE RD","DREXEL HILL","PA",19026,"DENTAL","General Dentist"]
[null,203296691,1194839472,"SILVANA  CUMANI","2675 E CUMBERLAND ST","PHILADELPHIA","PA",19125,"DENTAL","General Dentist"]
[null,204116177,1275688095,"ANTHONY M GACITA","100 SHEPPARD RD","VOORHEES","NJ","08043","DENTAL","General Dentist"]
[null,232173361,1750442687,"STEVEN J SOLOW","990 CITY AVE","WYNNEWOOD","PA",19096,"DENTAL","Pediatric Dentist"]
[null,274345139,1255532057,"JAMES A GODORECCI","91 CHESTNUT RD","PAOLI","PA",19301,"DENTAL","General Dentist"]
[null,263791482,1710991831,"JONATHAN D STONE","123 W LANCASTER AVE","WAYNE","PA",19087,"DENTAL","General Dentist"]
[null,383835860,1003044173,"STEPHEN  WAGNER","102 8TH ST","POCOMOKE CITY","MD",21851,"DENTAL","General Dentist"]
[null,812610575,1679658934,"JAIME S DAVENPORT","1729 HERITAGE TRL STE 904","NAPLES","FL",34112,"DENTAL","General Dentist"]
[null,871295281,1932368610,"JOHN A SCHEHL","6711 WHITTIER AVE STE 201","MCLEAN","VA",22101,"DENTAL","General Dentist"]
[null,232815882,1235262601,"EDAN  BLUMENTHAL","6 ORIOLE AVE","MEDIA","PA",19063,"DENTAL","General Dentist"]
[null,814250628,1386765154,"TIMOTHY J BROSNAN","1990 SPROUL RD","BROOMALL","PA",19008,"DENTAL","General Dentist"]
[null,471956856,1639662174,"WEI YIN  VUONG","3790 7TH TER STE 201","VERO BEACH","FL",32960,"DENTAL","General Dentist"]
[null,200185918,1548580673,"NESTOR E VILLARREAL","8921 IMMOKALEE RD","NAPLES","FL",34120,"DENTAL","General Dentist"]
[null,921553040,1831873868,"SCOTT EDWARD HOWERTON","1880 37TH ST STE 3","VERO BEACH","FL",32960,"DENTAL","General Dentist"]
[null,383626714,1790866622,"STEVEN R OUWINGA","2515 5TH AVE S","ESCANABA","MI",49829,"DENTAL","Orthodontist"]
[null,264488416,1932307667,"ANNE E EUNSON","131 COMMONS CT","CHADDS FORD","PA",19317,"DENTAL","General Dentist"]
[null,208131053,1104674142,"ALLISON  YU","477 GREENTREE RD STE C","SEWELL","NJ","08080","DENTAL","General Dentist"]
[null,881224580,1184920456,"SCOTT M SILVERMAN","10101 ACADEMY RD FL 2","PHILADELPHIA","PA",19114,"DENTAL","General Dentist"]
[null,922570045,1922488295,"STACEY  STEVENS","2467 ATLANTIC HWY","WARREN","ME","04864","DENTAL","General Dentist"]
[null,842498689,1952717233,"POOJA  DESAI","488 CONCHESTER HWY STE 5","ASTON","PA",19014,"DENTAL","General Dentist"]
[null,208935457,1265273866,"BROOKE E CARPENTER","3043 INTERNATIONAL GOLF PKWY","SAINT AUGUSTINE","FL",32092,"DENTAL","General Dentist"]
[null,200185918,1780425181,"REINEL  REQUEIRO TORRES","42031 CYPRESS PKWY UNIT 6","PUNTA GORDA","FL",33982,"DENTAL","General Dentist"]
[null,453052945,1396467791,"MELVIN A ABRAHAM","7350 E SPEEDWAY BLVD STE 201","TUCSON","AZ",85710,"DENTAL","General Dentist"]
[null,232223141,1760674824,"ROBERT T BAYLEY","1129 W CHESTER PIKE","WEST CHESTER","PA",19382,"DENTAL","General Dentist"]
[null,204116177,1093185266,"JAY  APHALE","100 SHEPPARD RD","VOORHEES","NJ","08043","DENTAL","General Dentist"]
[null,922310786,1316468028,"VINCENT  CORONA","8282 BEE RIDGE RD","SARASOTA","FL",34241,"DENTAL","General Dentist"]
[null,201980715,1659374148,"GARY A KOPESKY","RTE 191","HAMLIN","PA",18427,"DENTAL","General Dentist"]
[null,451579074,1518129998,"CLETUS A FONMEDIG","1709 CHESACO AVE","ROSEDALE","MD",21237,"DENTAL","General Dentist"]
[null,814805611,1649460718,"SCOTT  LEVY","1215 W BALTIMORE PIKE STE 9","MEDIA","PA",19063,"DENTAL","Endodontist"]
[null,233002324,1770612624,"THOMAS J DEFINNIS","300 E LANCASTER AVE STE 101","WYNNEWOOD","PA",19096,"DENTAL","General Dentist"]
[null,222269410,1376185181,"ROBERT J BRAY","620 SHORE RD","SOMERS POINT","NJ","08244","DENTAL","Orthodontist"]
[null,203445368,1407995590,"TRACIE L VAUGHAN","100 HEALTH PARK DR STE 105","GARNER","NC",27529,"DENTAL","General Dentist"]
[null,223783216,1326200353,"NICOLE RENEE NIEBUDEK","951 RT 73 N STE A","MARLTON","NJ","08053","DENTAL","General Dentist"]
[null,232470527,1073635769,"RICHARD L POWERS","525 HIGH ST","LOCK HAVEN","PA",17745,"DENTAL","General Dentist"]
[null,274593882,1487793451,"MUKUNDA N DOGIPARTHI","505 WEST HOLLIS ST #113","NASHUA","NH","03062","DENTAL","General Dentist"]
[null,510315927,1972703874,"FRANK S LUXL","3510 SILVERSIDE RD STE 1","WILMINGTON","DE",19810,"DENTAL","General Dentist"]
[null,921968957,1508279506,"RYAN M BARRETT","900 HIGHWAY 17 STE E","NORTH MYRTLE BEACH","SC",29582,"DENTAL","General Dentist"]
[null,273183584,1083848964,"MARY JOSEPHINE MASSARO","1552 MCDANIEL DR","WEST CHESTER","PA",19380,"DENTAL","General Dentist"]
[null,851291207,1164075008,"KEKUL  BHARUCHA","1 WHEATLEY BLVD","MULLICA HILL","NJ","08062","DENTAL","General Dentist"]
[null,201755669,1316151764,"CARLOS E VELEZ","309 MARKET ST","PHILADELPHIA","PA",19106,"DENTAL","General Dentist"]
[null,474663030,1184985640,"KATERINA  SIOUTIS","415 E BALTIMORE AVE STE 2","MEDIA","PA",19063,"DENTAL","General Dentist"]
[null,262231139,1962654459,"CHRISTINE R BIONDI","499 BECKETT RD STE 101","LOGAN","NJ","08085","DENTAL","Pediatric Dentist"]
[null,932728305,1649808346,"SUJI  CHA","5710 BELLONA AVE STE 101","BALTIMORE","MD",21212,"DENTAL","General Dentist"]
[null,205108340,1700813300,"BENNIE H BRITT","7780 BRIER CREEK PKWY STE 120","RALEIGH","NC",27617,"DENTAL","General Dentist"]
[null,222488654,1821782269,"SHAILI  SHAH","1802 W 4TH ST","WILMINGTON","DE",19805,"DENTAL","General Dentist"]
[null,201380662,1831119916,"YOOSUNG  SUH","1040 DEKALB PIKE STE 100","BLUE BELL","PA",19422,"DENTAL","Pediatric Dentist"]
[null,831489230,1184286064,"KATHERINE  HABBEL","316 W 4TH ST","QUARRYVILLE","PA",17566,"DENTAL","General Dentist"]
[null,262740690,1811050917,"HELENE P TA","1503 BUENOS AIRES BLVD STE 125","THE VILLAGES","FL",32159,"DENTAL","General Dentist"]
[null,232076688,1548606643,"SCOTT W GARRISON","422 MANCHESTER AVE","MEDIA","PA",19063,"DENTAL","General Dentist"]
[null,473605243,1528130093,"BRIAN D SOWATSKY","1575 HIGHLANDS DR STE 100","LITITZ","PA",17543,"DENTAL","General Dentist"]
[null,465730761,1316205651,"MEREDITH B TODD","402 MUSE ST","CAMBRIDGE","MD",21613,"DENTAL","General Dentist"]
[null,134334999,1003072638,"RICHARD L BALLENTINE","14884 TAMIAMI TRL","NORTH PORT","FL",34287,"DENTAL","General Dentist"]
[null,845081038,1437287935,"SONAL  DAVE","818 KOHL AVE # 820","MIDDLETOWN","DE",19709,"DENTAL","General Dentist"]
[null,822021511,1447690136,"OM G CHAINANI","65 RUES LN","EAST BRUNSWICK","NJ","08816","DENTAL","General Dentist"]
[null,992459836,1366224032,"VICTORIA YUKA CHANG TAMURA","6412 FRANKFORD AVE 10","PHILADELPHIA","PA",19135,"DENTAL","General Dentist"]
[null,934655192,1629636097,"DEREK C METTENBRINK","1039 STONERIDGE DR STE 1","BOZEMAN","MT",59718,"DENTAL","Pediatric Dentist"]
[null,474486868,1679644009,"THOMAS M ZACCARIA","4749 W LINCOLN HWY","PARKESBURG","PA",19365,"DENTAL","General Dentist"]
[null,232762853,1639307549,"PREETHA P THILAK","2002 SPROUL RD STE 302","BROOMALL","PA",19008,"DENTAL","General Dentist"]
[null,814084049,1710396197,"ROBERT E WOOLERY","3318 SIMPSON AVE","OCEAN CITY","NJ","08226","DENTAL","General Dentist"]
[null,231365971,1902949449,"ANDREW STEVEN EPSTEIN","3223 N BROAD ST","PHILADELPHIA","PA",19140,"DENTAL","General Dentist"]
[null,593038968,1790855575,"CHARLES H DAVIS","1218 E VENICE AVE","VENICE","FL",34285,"DENTAL","General Dentist"]
[null,454219770,1285848309,"CARL D JACKSON","3200 CONCORD RD STE 200","ASTON","PA",19014,"DENTAL","General Dentist"]
[null,221906385,1750577227,"ANTHONY  KASH","400 GREENTREE RD","SEWELL","NJ","08080","DENTAL","Pediatric Dentist"]
[null,232223141,1528035011,"AKIL A PATEL","1129 W CHESTER PIKE","WEST CHESTER","PA",19382,"DENTAL","General Dentist"]
[null,870820168,1609223544,"JESSICA A CHIMA","3651 GREEN LEVEL WEST RD STE 202","APEX","NC",27523,"DENTAL","General Dentist"]
[null,271383787,1598851362,"DAVID G CARLTON","15650 SAN CARLOS BLVD","FORT MYERS","FL",33908,"DENTAL","General Dentist"]
[null,455245077,1457615668,"AMANDA  NEWCITY","5710 US HIGHWAY 98 N","LAKELAND","FL",33809,"DENTAL","Pediatric Dentist"]
[null,232438115,1932407962,"FELIPE S ROLA","834 CHESTNUT ST STE 415","PHILADELPHIA","PA",19107,"DENTAL","General Dentist"]
[null,542053554,1972664738,"WILLIAM H TURNER","34490 LANKFORD HWY","PAINTER","VA",23420,"DENTAL","General Dentist"]
[null,822752549,1790197267,"JEFFREY  MUSZYNSKI","2601 E ELMS RD","KILLEEN","TX",76542,"DENTAL","General Dentist"]
[null,842499546,1912432790,"NOLAN  BODAH","2029 STONECROP DR","WILMINGTON","NC",28412,"DENTAL","General Dentist"]
[null,815282711,1336418151,"JOHN B FONTANA","18912 JOHN J WILLIAMS HWY","REHOBOTH BEACH","DE",19971,"DENTAL","General Dentist"]
[null,232054483,1720124746,"AMIN  KAZEMI","600 E MARSHALL ST STE 106","WEST CHESTER","PA",19380,"DENTAL","Oral Surgeon"]
[null,562354305,1316029747,"WILLIAM T DAVIS","3702 SEA MOUNTAIN HWY","LITTLE RIVER","SC",29566,"DENTAL","General Dentist"]
[null,200185918,1326608662,"SHEREF  GADALLA","12152 MERCADO DR","VENICE","FL",34293,"DENTAL","General Dentist"]
[null,232347052,1578084893,"MURPHY R ZIESEL PANSULLA","1581 MCDANIEL DR","WEST CHESTER","PA",19380,"DENTAL","General Dentist"]
[null,852834473,1528056702,"LANCE R PANARELLO","1 CHESTER RD","WALLINGFORD","PA",19086,"DENTAL","General Dentist"]
[null,833313083,1447147814,"NAFIS  HAQUE","1189 E PULASKI HWY","ELKTON","MD",21921,"DENTAL","General Dentist"]
[null,582600367,1033221684,"ZACHARY J POWELL","288 REDFERN VLG","SAINT SIMONS ISLAND","GA",31522,"DENTAL","General Dentist"]
[null,813332782,1508299561,"KATHERINE E ABELL","40 OKATIE CENTER BLVD SOUTH SUITE 302","OKATIE","SC",29909,"DENTAL","General Dentist"]
[null,832041051,1487269056,"ROBINSON C VEGA","100 SUSSEX AVE","MILFORD","DE",19963,"DENTAL","General Dentist"]
[null,831741561,1144483728,"HOLLY E MANGUM TROXELL","4004 BAYBORO ST","LORIS","SC",29569,"DENTAL","General Dentist"]
[null,852328980,1730569450,"EMILY  AYOKI-OTIENO","7516 CITY AVE STE 15","PHILADELPHIA","PA",19151,"DENTAL","General Dentist"]
[null,874276890,1346624566,"VICTORIA  CROW","4809 EDGMONT AVE","BROOKHAVEN","PA",19015,"DENTAL","General Dentist"]
[null,331404023,1508410143,"CAMERON R WOODWARD","560 RIVERSIDE DR STE B205","SALISBURY","MD",21801,"DENTAL","General Dentist"]
[null,232335877,1437217411,"DENNIS J CERASOLI","60 MARCHWOOD RD","EXTON","PA",19341,"DENTAL","General Dentist"]
[null,251916591,1689961443,"GREGORY  LEHNES","1001 LAUREL OAK RD STE C1","VOORHEES","NJ","08043","DENTAL","Prosthodontist"]
[null,200927903,1780715029,"BRAD E RICHMAN","720 MACDADE BLVD","FOLSOM","PA",19033,"DENTAL","Oral Surgeon"]
[null,843810614,1952643363,"ALEX A PLANES","4755 FLORIDA A1A","VERO BEACH","FL",32963,"DENTAL","General Dentist"]
[null,222488654,1770337925,"ANNA KUJARUK KUJARUK","1802 W 4TH ST","WILMINGTON","DE",19805,"DENTAL","General Dentist"]
[null,232148593,1932245073,"JOHN V SARDELLA","1810 E LINCOLN HWY","COATESVILLE","PA",19320,"DENTAL","General Dentist"]
[null,862974213,1073009718,"TIFFANY  NGAN","212 WILLOW VALLEY LAKES DRIVE Suite 209","WILLOW STREET","PA",17584,"DENTAL","General Dentist"]
[null,208626151,1740488501,"SAMUEL J DEANGELO","1142 EXECUTIVE CIR STE B","CARY","NC",27511,"DENTAL","Periodontist"]
[null,813114414,1366757718,"AKASH M AGHERA","16928 LANCASTER HWY STE 101","CHARLOTTE","NC",28277,"DENTAL","General Dentist"]
[null,844919448,1780247197,"PATRICIA  HOSTYN","180 PINNACLES DR STE 101","PALM COAST","FL",32164,"DENTAL","General Dentist"]
[null,852328980,1790385581,"SAMIR  ZAHEDPASHA","7516 CITY AVE STE 15","PHILADELPHIA","PA",19151,"DENTAL","General Dentist"]
[null,815099214,1639914963,"STEPHANIA M ZUNIGA BERNABE","1050 MANTUA PIKE","WENONAH","NJ","08090","DENTAL","General Dentist"]
[null,521932597,1790788768,"ARMAN  DAVOUDIAN","5225 WISCONSIN AVE NW","WASHINGTON","DC",20015,"DENTAL","General Dentist"]
[null,521116591,1922218577,"ADRIENNE  WEBB","320 HARGRAVES DR","FEDERALSBURG","MD",21632,"DENTAL","General Dentist"]
[null,260251245,1639100209,"JEFFREY T ROOT","123 E MAIN ST STE 300","BREVARD","NC",28712,"DENTAL","General Dentist"]
[null,814626707,1811372477,"PETER  KRUMBHAAR","1 WINDING DR STE 105","PHILADELPHIA","PA",19131,"DENTAL","General Dentist"]
[null,522194586,1174733844,"ROBERT M DALY","2391 BRANDERMILL BLVD","GAMBRILLS","MD",21054,"DENTAL","General Dentist"]
[null,831433343,1821432162,"DAMIAN  ACOSTA","625 N DUPONT BLVD","MILFORD","DE",19963,"DENTAL","General Dentist"]
[null,822396961,1528358462,"CHRISTINA M LEVITSKY","7 MYERS DR","MULLICA HILL","NJ","08062","DENTAL","General Dentist"]
[null,203095625,1235220161,"CHRISTEN A MITCHELL","2828 S MCCALL RD STE 24","ENGLEWOOD","FL",34224,"DENTAL","General Dentist"]
[null,462747141,1801969282,"JERRY TODD MCCLARAN","2002 DEL PRADO BLVD S STE 202","CAPE CORAL","FL",33990,"DENTAL","General Dentist"]
[null,932410407,1841860145,"COREY M SMIGEL","2438 BROWN ST","PHILADELPHIA","PA",19130,"DENTAL","General Dentist"]
[null,222053401,1932291754,"GERALD  RAAB","600 WEST AVE","OCEAN CITY","NJ","08226","DENTAL","General Dentist"]
[null,510212559,1770041683,"MINSUNG B KIM","1601 MILLTOWN RD STE 17 Lindell Sq","WILMINGTON","DE",19808,"DENTAL","General Dentist"]
[null,570737664,1962531285,"RAY A LANGSTON","24 BOZARD ST","MANNING","SC",29102,"DENTAL","General Dentist"]
[null,921914241,1023405305,"GRACE E KIM","1301 MOUNT HERMON RD","SALISBURY","MD",21804,"DENTAL","General Dentist"]
[null,810875970,1699801605,"SRINIVAS  GHANTA","608 N PARROTT AVE","OKEECHOBEE","FL",34972,"DENTAL","General Dentist"]
[null,201481137,1245546258,"CHRISTOPHER D RAMSEY","500 UNIVERSITY BLVD STE 109","JUPITER","FL",33458,"DENTAL","General Dentist"]
[null,920862580,1376161927,"COLE  CHESTER","415 PENNINGTON AVE STE 100","HAVRE DE GRACE","MD",21078,"DENTAL","General Dentist"]
[null,832664040,1942640495,"JULIA M WHITE","8642 FOREST RD","GOODE","VA",24556,"DENTAL","General Dentist"]
[null,881224580,1144830134,"CHARLES  TOLLIFERREO JR","550 FAIRVIEW RD","WOODLYN","PA",19094,"DENTAL","General Dentist"]
[null,863768615,1346778651,"LOREN  GENETTI","160 N POINTE BLVD STE 203","LANCASTER","PA",17601,"DENTAL","General Dentist"]
[null,200185918,1871281808,"RENEE  MARIN GOMEZ","2450 53RD ST","VERO BEACH","FL",32967,"DENTAL","General Dentist"]
[null,270280442,1689774465,"SARAH J PHILLIPS","26415 CARL BOYER DR STE 200","SANTA CLARITA","CA",91350,"DENTAL","General Dentist"]
[null,821698300,1588065163,"MICHAEL  KOPA","5100 TOWNSHIP LINE RD","DREXEL HILL","PA",19026,"DENTAL","General Dentist"]
[null,861564060,1861873218,"JOSHUA S ZUKERMAN","110 PERKINS DR","CHAPEL HILL","NC",27514,"DENTAL","General Dentist"]
[null,590634433,1427406370,"MANALI  MURARKA","1600 ROCKLAND RD","WILMINGTON","DE",19803,"DENTAL","Pediatric Dentist"]
[null,510630731,1790788768,"ARMAN  DAVOUDIAN","4115 CONNECTICUT AVE NW","WASHINGTON","DC",20008,"DENTAL","General Dentist"]
[null,880746126,1245384270,"LEO V TRAIL","2021B EMMORTON RD STE 118","BEL AIR","MD",21015,"DENTAL","General Dentist"]
[null,463279591,1336309152,"RAJSEKHAR  MUKKAMALA","3030 US HIGHWAY 301 N","ELLENTON","FL",34222,"DENTAL","General Dentist"]
[null,223382270,1952507584,"JARED L JOHNSON","159 DELAWARE ST","WOODBURY","NJ","08096","DENTAL","General Dentist"]
[null,834157288,1053779793,"ZACHARY D FIELDS","617 HARTSVILLE PIKE","GALLATIN","TN",37066,"DENTAL","General Dentist"]
[null,273333369,1760452890,"GREGORY S RUSSELL","11200 RACETRACK RD UNIT 204","BERLIN","MD",21811,"DENTAL","Endodontist"]
[null,382333602,1962522482,"FREDERIC N LEAVITT","1120 W HURON ST","ANN ARBOR","MI",48103,"DENTAL","General Dentist"]
[null,200185918,1043482326,"JENNIFER A PFEIFFER","5210 CREEKWOOD BLVD E","BRADENTON","FL",34203,"DENTAL","General Dentist"]
[null,272671925,1376703637,"BRIAN  HUNTER","100 EILEEN DONDERO FOLEY AVE STE 320","PORTSMOUTH","NH","03801","DENTAL","General Dentist"]
[null,995095501,1932227469,"ELIZABETH  KILPATRICK-FOX","1507 KINGS HWY","SWEDESBORO","NJ","08085","DENTAL","General Dentist"]
[null,854281974,1295143642,"KANE W RAMSEY","23B SHELTER COVE LN STE 200","HILTON HEAD ISLAND","SC",29928,"DENTAL","Periodontist"]
[null,204722033,1053515916,"EDGAR A RALFF","4210 S BROAD ST","TRENTON","NJ","08620","DENTAL","General Dentist"]
[null,934938595,1386382034,"ADITI  VERMA","907 LINCOLN AVE","PROSPECT PARK","PA",19076,"DENTAL","General Dentist"]
[null,562405411,1821510892,"BRANDI  MAGANA","6237 CAROLINA COMMONS DR STE 330","INDIAN LAND","SC",29707,"DENTAL","General Dentist"]
[null,833725505,1528056702,"LANCE R PANARELLO","687 UNIONVILLE RD","KENNETT SQUARE","PA",19348,"DENTAL","General Dentist"]
[null,992536050,1134740228,"MICHAEL  CALTABIANO","659 EXTON CMNS Exton","EXTON","PA",19341,"DENTAL","General Dentist"]
[null,471062216,1497946982,"JULIE A CROMER","1225 US HIGHWAY 1 UNT 3","VERO BEACH","FL",32960,"DENTAL","General Dentist"]
[null,872230791,1841784238,"KYLE K HOUSTON","422 TEAGUE TRL","LADY LAKE","FL",32159,"DENTAL","General Dentist"]
[null,461409174,1760779276,"STEVEN J CASELLA","656 DOWNINGTOWN PIKE","WEST CHESTER","PA",19380,"DENTAL","General Dentist"]
[null,873221493,1194801829,"GREGORY  WHEELER","852 W LIBERTY ST","SUMTER","SC",29150,"DENTAL","General Dentist"]
[null,200185918,1407580038,"GABRIELA A PEREZ PEDRIANES","9430 BUFFALO RD","PALMETTO","FL",34221,"DENTAL","General Dentist"]
[null,922791149,1104230804,"KYLE M BOSK","1103 DELTA AVE","GLADSTONE","MI",49837,"DENTAL","General Dentist"]
[null,264712679,1760782536,"BRIAN S YOON","1180 W GRANADA BLVD STE A","ORMOND BEACH","FL",32174,"DENTAL","General Dentist"]
[null,231889724,1508602368,"MELODY A DEMATTEIS","116 SEYMOUR ST","BLOSSBURG","PA",16912,"DENTAL","General Dentist"]
[null,232831916,1972683696,"JODI S SMITH","760 NEWTOWN YARDLEY RD","NEWTOWN","PA",18940,"DENTAL","General Dentist"]
[null,200120892,1043984099,"EVELYN  SULAIMAN","900 W BALTIMORE PIKE STE 203","WEST GROVE","PA",19390,"DENTAL","Pediatric Dentist"]
[null,231995431,1316328339,"SARA  DWORKIN","5629 VINE ST STE C9","PHILADELPHIA","PA",19139,"DENTAL","Pediatric Dentist"]
[null,843059707,1548486830,"ARNOLD E WEINSTEIN","533 MAIN ST","WILMINGTON","DE",19804,"DENTAL","General Dentist"]
[null,452340555,1497087746,"VIDHIMA  DAVAR","1 BARRINGTON PL STE 100","BEL AIR","MD",21014,"DENTAL","Pediatric Dentist"]
[null,880746126,1831702133,"HIRSCHEL  WOHL","2021B EMMORTON RD STE 118","BEL AIR","MD",21015,"DENTAL","General Dentist"]
[null,200417612,1942373006,"PAUL E WOHLGEMUTH","13400 SUTTON PARK DR S STE 1301","JACKSONVILLE","FL",32224,"DENTAL","General Dentist"]
[null,331073368,1265514418,"FADY I FAKHOURY","10911 BONITA BEACH RD SE STE 105","BONITA SPRINGS","FL",34135,"DENTAL","General Dentist"]
[null,521162190,1982808267,"MICHAEL A BAYLIN","3655A OLD COURT RD","BALTIMORE","MD",21208,"DENTAL","General Dentist"]
[null,832212913,1790901023,"IVELYN  SANTINI","7423 SPRING HILL DR","SPRING HILL","FL",34606,"DENTAL","General Dentist"]
[null,991441084,1053837039,"JONG  LEE","1001 SOUTH FORT HOOD STREET SUITE 1001B","KILLEEN","TX",76541,"DENTAL","General Dentist"]
[null,203079132,1114145281,"HERB L BENNETT","120 E DIXIE AVE","LEESBURG","FL",34748,"DENTAL","General Dentist"]
[null,863611905,1851516975,"NICHOLAS DAVID JOHNSON","7768 CUMMING HWY STE 100","CANTON","GA",30115,"DENTAL","General Dentist"]
[null,421613231,1992087365,"STEPHANIE  ADKINS","122 SANDHILL DR STE 101","MIDDLETOWN","DE",19709,"DENTAL","General Dentist"]
[null,571080590,1609082734,"DANIEL W MILLER","1616 AZALEA DR","SURFSIDE BEACH","SC",29575,"DENTAL","General Dentist"]
[null,231365971,1366090094,"NICHOLAS  BIZZARO","3223 N BROAD ST","PHILADELPHIA","PA",19140,"DENTAL","General Dentist"]
[null,232152294,1437852928,"BROOKE M GRAFF","100 DEERFIELD LN STE 290","MALVERN","PA",19355,"DENTAL","General Dentist"]
[null,842507175,1750799904,"TIGURA SANKAR REDDY","723 CR 466","LADY LAKE","FL",32159,"DENTAL","Periodontist"]
[null,201548932,1750322020,"DOUGLAS J WASSON","4016 CORTEZ RD W Ste 1101","BRADENTON","FL",34210,"DENTAL","Prosthodontist"]
[null,822015114,1942558861,"DAVEN H PATEL","10969 SE 175TH PL STE 100","SUMMERFIELD","FL",34491,"DENTAL","General Dentist"]
[null,541556402,1053890855,"MARCUS O EMAD","14018-F SULLYFIELD CIRCLE","CHANTILLY","VA",20151,"DENTAL","General Dentist"]
[null,208714522,1437281862,"GLORIA  LEE","12328 TOWNCENTER PLZ","STERLING","VA",20164,"DENTAL","General Dentist"]
[null,200408488,1598904591,"BRYAN M GOLDESBERRY","1366 E MAIN ST","CARBONDALE","IL",62901,"DENTAL","General Dentist"]
[null,474914482,1184033284,"ERIK M BIANCHI","211 PENDLETON RD","CLEMSON","SC",29631,"DENTAL","General Dentist"]
[null,200185918,1073513172,"JAVON ARME WINSETT","3037 SW PORT ST LUCIE BLVD","PORT SAINT LUCIE","FL",34953,"DENTAL","General Dentist"]
[null,760310755,1467768051,"CAROL L PRICE","306 W 20TH ST","HOUSTON","TX",77008,"DENTAL","General Dentist"]
[null,204489246,1740299585,"HUBERT W HAWKINS","209 COTTAGE ST","LITTLETON","NH","03561","DENTAL","General Dentist"]
[null,"020803044",1679689053,"DAVID A CAUBLE","910 SW SIMPSON AVE","BEND","OR",97702,"DENTAL","General Dentist"]
[null,833892260,1982036489,"BRITTANY W BERGERON","515 E JOPPA RD STE 200","TOWSON","MD",21286,"DENTAL","General Dentist"]
[null,562034743,1184846115,"JOHN M WILLIAMS","600 ERWIN RD","DUNN","NC",28334,"DENTAL","General Dentist"]
[null,201543822,1356964050,"MOHIL  PARAKHIYA","240 MIDDLETOWN BLVD STE 100","LANGHORNE","PA",19047,"DENTAL","General Dentist"]
[null,470892484,1881691251,"HERBERT B FRIEDMAN","201 S UNION AVE","HAVRE DE GRACE","MD",21078,"DENTAL","General Dentist"]
[null,752993175,1619035250,"GREGG R MELFI","1719 GRAND ARMY HIGHWAY","SWANSEA","MA","02777","DENTAL","General Dentist"]
[null,272204963,1801818737,"DENNIS  CHEW","10000 LINCOLN DR E STE 106","MARLTON","NJ","08053","DENTAL","General Dentist"]
[null,831670256,1790067460,"BENJAMIN WON SONG","1765 DUNLAWTON AVE STE 103","PORT ORANGE","FL",32127,"DENTAL","General Dentist"]
[null,611515885,1154546315,"TAO  GAO","5318 NC HIGHWAY 55 STE 204","DURHAM","NC",27713,"DENTAL","General Dentist"]
[null,200185918,1467013854,"CHRISTINE  KERRIGAN","12106 US HIGHWAY 301 N","PARRISH","FL",34219,"DENTAL","General Dentist"]
[null,231744883,1427261833,"JOYCE C KIM","1501 WASHINGTON BLVD","WILLIAMSPORT","PA",17701,"DENTAL","General Dentist"]
[null,650815153,1477690816,"BRIGGITTE  MARTIN","3555 N HIGHWAY 19A","MOUNT DORA","FL",32757,"DENTAL","General Dentist"]
[null,465754304,1629483169,"STEVEN D LITWIN","48 ELM ST STE 3","WORCESTER","MA","01609","DENTAL","Periodontist"]
[null,863686320,1114445616,"ADAM  TAEE","1751 WILMINGTON W CHESTER PIKE STE F2","GLEN MILLS","PA",19342,"DENTAL","Orthodontist"]
[null,201805347,1801817002,"MARYBETH  FASANO","984 FIRST COLONIAL RD STE 200","VIRGINIA BEACH","VA",23454,"DENTAL","General Dentist"]
[null,921644492,1225443336,"SHANE P DREW","1821 N TREKELL RD STE 9","CASA GRANDE","AZ",85122,"DENTAL","General Dentist"]
[null,844823826,1306285671,"NICHOLAS P JENSEN","770 BROADMOOR BLVD NE","RIO RANCHO","NM",87124,"DENTAL","General Dentist"]
[null,200185918,1093384240,"DAKOTA WILLIAM POTTLE","2301 OLD CANOE CREEK ROAD","SAINT CLOUD","FL",34772,"DENTAL","General Dentist"]
[null,821253404,1629450234,"YANG  HUA","3300 CANOE CREEK RD STE 1","SAINT CLOUD","FL",34772,"DENTAL","General Dentist"]
[null,832906272,1053411256,"PAMELA K STOVER","1522 INSURANCE LN # B","CHARLOTTESVILLE","VA",22911,"DENTAL","General Dentist"]
[null,871534276,1427725225,"MYORTHOS DELAWARE ORTHODONTICS PA","74 OMEGA DR","NEWARK","DE",19713,"DENTAL","General Dentist"]
[null,273084043,1992856124,"ARASH  QADEER","6215 BEADNELL WAY","SAN DIEGO","CA",92117,"DENTAL","General Dentist"]
[null,871534276,1427725225,"MYORTHOS DELAWARE ORTHODONTICS PA","1405 SILVERSIDE RD","WILMINGTON","DE",19810,"DENTAL","General Dentist"]
[null,521101366,1952400244,"JOHN  STAMAS","8647 BELAIR RD","BALTIMORE","MD",21236,"DENTAL","General Dentist"]
[null,462655997,1982900817,"RYAN JEFFERY COX","23 JOHN MADDOX DR NW","ROME","GA",30165,"DENTAL","General Dentist"]
[null,471706456,1992313894,"OMEED  BEHMARDI","379 KINGS HWY # 300","PUNTA GORDA","FL",33983,"DENTAL","General Dentist"]
[null,844552096,1134510241,"CATHARINE M ALGER","905 W SPROUL RD STE 108","SPRINGFIELD","PA",19064,"DENTAL","General Dentist"]
[null,813497208,1649619057,"HITESH  SACHDEVA","214 STATE RD STE A","MEDIA","PA",19063,"DENTAL","General Dentist"]
[null,231932666,1235359563,"ROBERT J BRETT","1390 FITZWATERTOWN RD","ROSLYN","PA",19001,"DENTAL","General Dentist"]
[null,274176629,1467772541,"DEREK C EGO-OSUALA","7700 OLD BRANCH AVE STE A204","CLINTON","MD",20735,"DENTAL","Endodontist"]
[null,"094481753",1568535680,"STEVEN EDWARD CROSS","532 BALTIMORE PIKE","SPRINGFIELD","PA",19064,"DENTAL","General Dentist"]
[null,920886663,1770079113,"CLAUDEL P GIGGEY","8015 CREEDMOOR RD STE 202","RALEIGH","NC",27613,"DENTAL","General Dentist"]
[null,991862907,1972159655,"BRYAN O VARGAS","670 ROCKHILL DR","BENSALEM","PA",19020,"DENTAL","General Dentist"]
[null,272984902,1285675470,"JEFFREY  ALVARADO","3103 CENTER POINT DR","EDINBURG","TX",78539,"DENTAL","General Dentist"]
[null,200185918,1467070201,"SHERLEY  RIVERA LOPEZ","765 STATE RD 559","AUBURNDALE","FL",33823,"DENTAL","General Dentist"]
[null,263020975,1477745388,"JAE W KIM","403 N 5 POINTS RD","WEST CHESTER","PA",19380,"DENTAL","General Dentist"]
[null,455402141,1801380134,"RYAN C SHUCK","2142 GREAT NECK SQ","VIRGINIA BEACH","VA",23454,"DENTAL","General Dentist"]
[null,883620006,1659951077,"CHEMIKA  ST JUSTE","2631 E ATLANTIC BLVD","POMPANO BEACH","FL",33062,"DENTAL","General Dentist"]
[null,204943358,1568485282,"RONALD MICHAEL ACHONG","5742 HAMLIN GROVES TRL STE 130","WINTER GARDEN","FL",34787,"DENTAL","Oral Surgeon"]
[null,825311570,1114057593,"DERRICK J TURNER","1601 WALNUT ST STE 720","PHILADELPHIA","PA",19102,"DENTAL","General Dentist"]
[null,651035483,1407596885,"ROBERTO  RAMIREZ DE LA CRUZ","1500 SE 17TH ST STE 400","OCALA","FL",34471,"DENTAL","General Dentist"]
[null,991612519,1265161038,"JOSHUA  ENGLANDER","522 ROCK SPRING RD","BEL AIR","MD",21014,"DENTAL","General Dentist"]
[null,454361286,1750693024,"ANVARALI  MOHAMMADH","4 W BROOKHAVEN RD","BROOKHAVEN","PA",19015,"DENTAL","General Dentist"]
[null,263800267,1528298908,"VINAYAK P PATIL","9859 PATRIOT HWY","FREDERICKSBURG","VA",22407,"DENTAL","General Dentist"]
[null,451625948,1942374582,"CHRISTOPHER M DONALD","1281 MAIN ST","DAPHNE","AL",36526,"DENTAL","General Dentist"]
[null,205839860,1306859574,"FREDERICK J MARRA","100 MAIN ST","COHOES","NY",12047,"DENTAL","General Dentist"]
[null,202590983,1609909126,"MAHNAZ N MOJAVER","450 A ST STE 300","SAN DIEGO","CA",92101,"DENTAL","General Dentist"]
[null,200185918,1972166155,"MALIK  ALTOOS","13851 N US HIGHWAY 441","LADY LAKE","FL",32159,"DENTAL","General Dentist"]
[null,923355022,1912439480,"FRANCESCA  CATIBOG","9613 ANDERSON LAKES PKWY","EDEN PRAIRIE","MN",55344,"DENTAL","General Dentist"]
[null,200185918,1477112704,"CHARLOTTE  HAUGHT","2393 E VENICE AVE","VENICE","FL",34292,"DENTAL","General Dentist"]
[null,931867550,1235482241,"JOHN M MOULTON","2001 AUGUST HIGHWAY SUITE B","LEXINGTON","SC",29072,"DENTAL","General Dentist"]
[null,921658355,1114248846,"ERIN A OGRODNICK","126 MAIN ST","LEBANON","NJ","08833","DENTAL","General Dentist"]
[null,200185918,1952035891,"MARIA  MONSERRAT","8225 CHAMPIONS GATE BLVD","CHAMPIONS GATE","FL",33896,"DENTAL","General Dentist"]
[null,113642528,1033355714,"MARY  VALENTINE","125 TURNER LN","WEST CHESTER","PA",19380,"DENTAL","General Dentist"]
[null,364851480,1700012036,"BRIAN T BURKE","211 W 4TH ST","QUARRYVILLE","PA",17566,"DENTAL","General Dentist"]
[null,521069011,1821161191,"J ALEXANDER A SMITH","136 E BROADWAY","BEL AIR","MD",21014,"DENTAL","Oral Surgeon"]
[null,742768009,1689881286,"MICHAEL J COONEY","506 N HEWITT DR","HEWITT","TX",76643,"DENTAL","General Dentist"]
[null,873891039,1295056570,"LU C DINH","144 PROFESSIONAL PARK DR","CONWAY","SC",29526,"DENTAL","General Dentist"]
[null,932410407,1508432618,"STIVEN  MITA","2438 BROWN ST","PHILADELPHIA","PA",19130,"DENTAL","General Dentist"]
[null,882985450,1992327456,"NINA  BUBALO","306 WALNUT AVE STE 24","SAN DIEGO","CA",92103,"DENTAL","General Dentist"]
[null,232566605,1548293533,"SALVATORE J INFANTINO","795 S TOWNSHIP BLVD","JENKINS TOWNSHIP","PA",18640,"DENTAL","General Dentist"]
[null,223801035,1982810545,"JOSEPH M MANERI","67 LACEY RD STE 1","WHITING","NJ","08759","DENTAL","General Dentist"]
[null,831861901,1851763031,"URVISHKUMAR  BHALALA","252 W SWAMP RD STE 52","DOYLESTOWN","PA",18901,"DENTAL","General Dentist"]
[null,200185918,1952089609,"CORDARYL  WHITEHEAD","12517 YELLOW BLUFF RD","JACKSONVILLE","FL",32226,"DENTAL","General Dentist"]
[null,992541401,1023743119,"SCOTTIE A REAGAN","1205 GEORGE AVE","JEFFERSON CITY","TN",37760,"DENTAL","General Dentist"]
[null,561865336,1780045112,"TIMOTHY B CALLAHAN","2435 PLANTATION CENTER DR #100","MATTHEWS","NC",28105,"DENTAL","General Dentist"]
[null,541922305,1528100047,"DANIEL R KELLY","905 RIO EAST COURT #B","CHARLOTTESVILLE","VA",22901,"DENTAL","Periodontist"]
[null,465615891,1245416890,"RAKSHA  MIRCHANDANI","5092 DORSEY HALL DR STE 103","ELLICOTT CITY","MD",21042,"DENTAL","Endodontist"]
[null,273152881,1891829727,"ERIC C SEIDEL","353 YORK ST FRNT","GETTYSBURG","PA",17325,"DENTAL","General Dentist"]
[null,811234407,1861248080,"CHRISTOPHER  CHUONG","2326 S 3RD ST","PHILADELPHIA","PA",19148,"DENTAL","General Dentist"]
[null,542072703,1669087318,"MATTHEW  MOREE","200 12TH ST W STE A","TIFTON","GA",31794,"DENTAL","General Dentist"]
[null,812750812,1093061400,"JIGNESH DINESH PATEL","6144 GAZEBO PARK PL S STE 210","JACKSONVILLE","FL",32257,"DENTAL","General Dentist"]
[null,874528215,1407586274,"CHRISTIAN A BLACK","4610 OLEANDER DR STE 201","MYRTLE BEACH","SC",29572,"DENTAL","Endodontist"]
[null,881039835,1417035783,"DAN  ELLIS","1233 CRABB RIVER RD","RICHMOND","TX",77469,"DENTAL","General Dentist"]
[null,921946686,1326568411,"AMIR  ARYAAN","622 S TAMIAMI TRL","OSPREY","FL",34229,"DENTAL","General Dentist"]
[null,522023260,1093736357,"TOMMY D UPCHURCH","2021 EASTCHESTER DR STE 101","HIGH POINT","NC",27265,"DENTAL","General Dentist"]
[null,200185918,1326690736,"DIMITRIOS  GATIS","12759 BONITA BEACH RD SE","BONITA SPRINGS","FL",34135,"DENTAL","General Dentist"]
[null,870820168,1386238616,"ALI  HERNANDEZ","3651 GREEN LEVEL WEST RD STE 202","APEX","NC",27523,"DENTAL","General Dentist"]
[null,814805611,1447841135,"ARIA  SHARMA","1215 W BALTIMORE PIKE STE 9","MEDIA","PA",19063,"DENTAL","Endodontist"]
[null,261915717,1467553610,"ALBERT  CHOW","315 S MOORPARK RD","THOUSAND OAKS","CA",91361,"DENTAL","General Dentist"]
[null,921218592,1396090874,"MARK J PAYNE","22500 SE 64TH PL STE 120","ISSAQUAH","WA",98027,"DENTAL","General Dentist"]
[null,200927903,1780715029,"BRAD E RICHMAN","2546 S BROAD ST","PHILADELPHIA","PA",19145,"DENTAL","Oral Surgeon"]
[null,251793143,1578538708,"GLENN C SEITZ","5525 LOCUST LN","HARRISBURG","PA",17109,"DENTAL","General Dentist"]
[null,853211765,1548795347,"JOSETTA  DEFRANCISCO","2875 CENTER RD STE 1","BRUNSWICK","OH",44212,"DENTAL","General Dentist"]
[null,421583627,1568672442,"KENNETH J BOSCH","1050 BALTIMORE PIKE STE 4","SPRINGFIELD","PA",19064,"DENTAL","Periodontist"]
[null,273733788,1215037742,"JENNIFER N KOTTENSTETTE","1207 PASEO DEL NORTE","PUEBLO","CO",81008,"DENTAL","General Dentist"]
[null,201990392,1316351851,"CHRISTOPHER P FITZGERALD","1909 LANDSTOWN CENTRE WAY STE 100","VIRGINIA BEACH","VA",23456,"DENTAL","General Dentist"]
[null,352504956,1083908479,"ZACHARY  MACE","250 VENTURE DR","MORGANTOWN","WV",26508,"DENTAL","General Dentist"]
[null,611764181,1679914337,"ANTHONY G MIAOULIS","11015 N SCOTTSDALE RD STE 101","SCOTTSDALE","AZ",85254,"DENTAL","General Dentist"]
[null,561996271,1780691337,"GERARD  NAZZIOLA","5501 ADAMS FARM LN","GREENSBORO","NC",27407,"DENTAL","Periodontist"]
[null,260249927,1063618304,"ARASH  AZARBAL","826 E UNION ST","PASADENA","CA",91101,"DENTAL","General Dentist"]
[null,811826349,1750588844,"ERIC ALAN TOBLER","308 E CROSSROADS BLVD","SARATOGA SPRINGS","UT",84045,"DENTAL","General Dentist"]
[null,862778577,1720514458,"JOSHUA F WINNEBERGER","1301 PHYSICIANS DR","WILMINGTON","NC",28401,"DENTAL","General Dentist"]
[null,843502240,1770076507,"LUIS  FRANCESCHI","555 N CONGRESS AVE STE 303","BOYNTON BEACH","FL",33426,"DENTAL","General Dentist"]
[null,651190150,1336276799,"LISA J CURRY","312-H LIGHTFOOT RD","WILLIAMSBURG","VA",23188,"DENTAL","General Dentist"]
[null,332550614,1265574503,"RICHARD A ALTMAN","744 GALLOPING HILL RD","ROSELLE PARK","NJ","07204","DENTAL","General Dentist"]
[null,208168257,1053463323,"EDSON  MARTINEZ-RUIZ","1121 AVENUE E","DEL RIO","TX",78840,"DENTAL","General Dentist"]
[null,463205460,1376561712,"HORACE K WOOD","508 CYNWOOD DR STE C","EASTON","MD",21601,"DENTAL","Oral Surgeon"]
[null,993501473,1154807964,"DAVID  WEBER","18660 US HIGHWAY 441 SUITE 106","MOUNT DORA","FL",32757,"DENTAL","General Dentist"]
[null,471057097,1457764185,"PHILIP A BATSON","2516 FORUM BLVD STE 200","COLUMBIA","MO",65203,"DENTAL","General Dentist"]
[null,872420882,1700435393,"JOHN D VREDENBURG III","8878 E TANQUE VERDE RD","TUCSON","AZ",85749,"DENTAL","General Dentist"]
[null,334825068,1528598158,"JESSICA M JOSEPH","54055 COUNTY ROAD 653","PAW PAW","MI",49079,"DENTAL","General Dentist"]
[null,431052623,1265860233,"SEAN W ERICSON","2727 ST MARYS AVE","HANNIBAL","MO",63401,"DENTAL","General Dentist"]
[null,562038352,1750494894,"BRIAN K ARMSTRONG","1571 HIGHWAY 544","CONWAY","SC",29526,"DENTAL","General Dentist"]
[null,541970894,1639345739,"RICHARD D GRUNTZ","3030 POTOMAC AVE STE 405","ALEXANDRIA","VA",22305,"DENTAL","General Dentist"]
[null,810850276,1043436579,"IRAJ  SHAFAGH","100 SOUTH EAGLE RD","HAVERTOWN","PA",19083,"DENTAL","Prosthodontist"]
[null,510103684,1740232263,"BARRY  BOYD","501 W 14TH ST STE 2W02","WILMINGTON","DE",19801,"DENTAL","Oral Surgeon"]
[null,141693054,1134213564,"KIT ELLEN BURKICH","366 AVIATION RD","QUEENSBURY","NY",12804,"DENTAL","General Dentist"]
[null,200928537,1194874156,"KELLYN W HODGES","1 BELMONT AVE STE 414","BALA CYNWYD","PA",19004,"DENTAL","Orthodontist"]
[null,273803146,1043740897,"DAVID C PYLE","555 W UWCHLAN AVE STE 100","EXTON","PA",19341,"DENTAL","General Dentist"]
[null,650665173,1528709847,"SUSANA  TRECU BENCOMO","900 N SUNCOAST BLVD","CRYSTAL RIVER","FL",34429,"DENTAL","General Dentist"]
[null,471602667,1740471150,"SEAN J KIM","10861 TIDEWATER TRAIL","FREDERICKSBURG","VA",22408,"DENTAL","General Dentist"]
[null,883354305,1912437567,"ALEXIS  DEL ROSARIO","5215 MANATEE AVE W","BRADENTON","FL",34209,"DENTAL","General Dentist"]
[null,141538322,1770141376,"BRANDEN  MARCUS","93 MONTCALM ST","LAKE GEORGE","NY",12845,"DENTAL","General Dentist"]
[null,272757055,1902024433,"JEFFREY M COLLURA","7 BURNHAM ST","TURNERS FALLS","MA","01376","DENTAL","General Dentist"]
[null,221996104,1134192784,"MICHAEL E STERN","213 SUMMERHILL ROAD","EAST BRUNSWICK","NJ","08816","DENTAL","Oral Surgeon"]
[null,200185918,1063641652,"MARK ANDREW MALTBY","1100 PINEHURST RD","DUNEDIN","FL",34698,"DENTAL","General Dentist"]
[null,133957165,1669834503,"DANIEL  BERNSTEIN","30 CENTRAL PARK S RM 11C","NEW YORK","NY",10019,"DENTAL","General Dentist"]
[null,853045823,1154841500,"SUKYONG  JUNG","1628 SPRUCE ST UNIT 1","PHILADELPHIA","PA",19103,"DENTAL","General Dentist"]
[null,200322891,1427008846,"DONALD J MACINA","1536 CRESCENT RD STE 8","CLIFTON PARK","NY",12065,"DENTAL","General Dentist"]
[null,844035200,1831353028,"KATHERINE L DIVELY","6460 JONESTOWN RD","HARRISBURG","PA",17112,"DENTAL","General Dentist"]
[null,812006359,1104258417,"DR. DOMENICK A CERULLO","10150 HAGEN RANCH RD STE 202","BOYNTON BEACH","FL",33437,"DENTAL","General Dentist"]
[null,455621844,1982867412,"SCOTT S NAKAMURA","424 EXTON CMNS","EXTON","PA",19341,"DENTAL","Periodontist"]
[null,274400565,1649391814,"DAWN M ARENA","3400 TAMIAMI TRL N STE 301","NAPLES","FL",34103,"DENTAL","General Dentist"]
[null,271429619,1588863427,"ADAM J BARR","980 MOUNT HOMER RD","EUSTIS","FL",32726,"DENTAL","General Dentist"]
[null,821346047,1891795761,"MARK L WALTZER","1930 MARLTON PIKE E STE X114","CHERRY HILL","NJ","08003","DENTAL","General Dentist"]
[null,920350752,1306465877,"CHASE  SMITH","PO BOX 264 30 S MAIN ST","THORNVILLE","OH",43076,"DENTAL","General Dentist"]
[null,471570401,1023193448,"CHULHWAN J KIM","69 BRIDGE ST","NORTHAMPTON","MA","01060","DENTAL","General Dentist"]
[null,273700110,1255593992,"JOSEPH PAUL WAREHAM","13431 FISHHAWK BLVD","LITHIA","FL",33547,"DENTAL","General Dentist"]
[null,270243670,1164450276,"SUZANNE R SNOW","90 COLUMBIA POINT DR","RICHLAND","WA",99352,"DENTAL","General Dentist"]
[null,541186353,1184938854,"STEPHANIE C VOTH","12040 W BROAD ST","HENRICO","VA",23233,"DENTAL","Periodontist"]
[null,205521257,1912054412,"DANIEL A BILLS","1306 LIBERTY PL","SICKLERVILLE","NJ","08081","DENTAL","Orthodontist"]
[null,263230694,1649384306,"AMANDA L SCARBOROUGH","900 CORSICANA HWY","HILLSBORO","TX",76645,"DENTAL","General Dentist"]
[null,831322782,1508980764,"RICHARD E KLEIN","350 MARY ST STE E","PUNTA GORDA","FL",33950,"DENTAL","General Dentist"]
[null,208004083,1033557780,"SCOTT G THEWS","2611 PROMENADE PKWY","MIDLOTHIAN","VA",23113,"DENTAL","General Dentist"]
[null,873215474,1639424245,"NICHOLAS  BUTTON","6182 N US HIGHWAY 41 UNIT A","APOLLO BEACH","FL",33572,"DENTAL","General Dentist"]
[null,522259263,1992733059,"ZIAD E BATROUNI","2401 BRANDERMILL BLVD STE 320","GAMBRILLS","MD",21054,"DENTAL","Oral Surgeon"]
[null,232854687,1326199613,"THERESA M DEVINE","580 REED RD STE 7A","BROOMALL","PA",19008,"DENTAL","General Dentist"]
[null,650949544,1164540407,"DAVID M SKOPP","2560 RCA BLVD STE 105","PALM BEACH GARDENS","FL",33410,"DENTAL","Prosthodontist"]
[null,814466761,1689160483,"THIEN V LE","17365 US HIGHWAY 441","MOUNT DORA","FL",32757,"DENTAL","General Dentist"]
[null,832025842,1508063272,"JACQUELINE M CASH","410 SOUTH MAIN ST","CONCORD","NH","03301","DENTAL","Periodontist"]
[null,834457593,1639536980,"BROOKE A BERSON","5 MYERS DRIVE SUITE 106","MULLICA HILL","NJ","08062","DENTAL","Endodontist"]
[null,223560207,1386808418,"BILAL  CHAUDHRY","THE 601 OFFICE PLAZA 1050 MANTUA PIKE","WENONAH","NJ","08090","DENTAL","Endodontist"]
[null,920266534,1144881673,"ALI M MOHAMMADIZADEH","1725 ELECTRIC AVE STE 138","WATKINSVILLE","GA",30677,"DENTAL","General Dentist"]
[null,472455645,1699035444,"MARY ANNE S BAYSAC","4200 CALIFORNIA ST. STE 210","SAN FRANCISCO","CA",94118,"DENTAL","General Dentist"]
[null,880474720,1063528016,"GUY L CHISTECKOFF","8940 S MARYLAND PKWY STE 100","LAS VEGAS","NV",89123,"DENTAL","General Dentist"]
[null,920571007,1861914962,"KATHERINE  POWELL","13860 RAISED ANTLER CIR STE B","MIDLOTHIAN","VA",23112,"DENTAL","General Dentist"]
[null,880950035,1841453107,"ROBERT P MASSIE","2004 CALLIE WAY STE 101","UNION","KY",41091,"DENTAL","General Dentist"]
[null,233024574,1285017418,"JOHN  RUCH","1460 RUSSELL RD STE 203","PAOLI","PA",19301,"DENTAL","Endodontist"]
[null,232521756,1598753972,"LOREN J GROSSMAN","375 PIERCE ST","KINGSTON","PA",18704,"DENTAL","General Dentist"]
[null,811129786,1912572306,"ANGELIQUE  SWEENEY","1845 WALNUT ST STE 950","PHILADELPHIA","PA",19103,"DENTAL","General Dentist"]
[null,452401116,1619132248,"NERMEEN A RIFAI","420 N BLACK HORSE PIKE","WILLIAMSTOWN","NJ","08094","DENTAL","General Dentist"]
[null,813543210,1316980469,"RAHIM  HARIRI","312 BALTIMORE PIKE","BEL AIR","MD",21014,"DENTAL","General Dentist"]
[null,592234013,1912257973,"PUSHPAK  NARAYANA","121 GRIFFIN VIEW DR","LADY LAKE","FL",32159,"DENTAL","Endodontist"]
[null,222802674,1225200249,"JOHN J MCCARTY","379 EGG HARBOR RD","TURNERSVILLE","NJ","08012","DENTAL","General Dentist"]
[null,864003745,1700308855,"NEIL  SEAVER","19240 QUESADA AVE","PORT CHARLOTTE","FL",33948,"DENTAL","General Dentist"]
[null,270191042,1164541892,"JOHN G MULLALLY","2107 LAUREL BUSH RD STE 203","BEL AIR","MD",21015,"DENTAL","Endodontist"]
[null,464377563,1013680255,"SARAH  PICARD","5200 E FARNESS DR # 102","TUCSON","AZ",85712,"DENTAL","General Dentist"]
[null,821658715,1548233810,"DAVID N WILSON","2025 35TH AVE STE B","VERO BEACH","FL",32960,"DENTAL","Endodontist"]
[null,874306976,1225584535,"JOANA  HALILAJ","11938 COUNTY ROAD 101 STE 110","THE VILLAGES","FL",32162,"DENTAL","General Dentist"]
[null,320224252,1568641447,"GABRIEL T WOODRUFF","6500 N SCOTTSDALE RD STE B-200","SCOTTSDALE","AZ",85253,"DENTAL","General Dentist"]
[null,463884978,1710993829,"SUZANNE E COHEN","6282 ROUTE 25A","WADING RIVER","NY",11792,"DENTAL","General Dentist"]
[null,432099769,1285798306,"STANLEY J PARK","10025 GOVERNOR WARFIELD PKWY","COLUMBIA","MD",21044,"DENTAL","General Dentist"]
[null,200273093,1013220524,"TASSOS J SFONDOURIS","7830 OLD GEORGETOWN RD","BETHESDA","MD",20814,"DENTAL","General Dentist"]
[null,232001063,1376856690,"CANA E PASIERB","1740 SOUTH ST STE 504","PHILADELPHIA","PA",19146,"DENTAL","General Dentist"]
[null,841036289,1356635387,"ALISON W HOOVER","7889 S LINCOLN CT STE 202","LITTLETON","CO",80122,"DENTAL","General Dentist"]
[null,991321518,1548822497,"KATHERINE  UNES","112 CLIFFORD AVE","SYLVANIA","GA",30467,"DENTAL","General Dentist"]
[null,571112922,1578639613,"JAMIE  GOMEZ","139 WHITEFORD WAY","LEXINGTON","SC",29072,"DENTAL","General Dentist"]
[null,873137217,1922257047,"ROBERT H CARLSON","435 W LANDIS AVE","VINELAND","NJ","08360","DENTAL","General Dentist"]
[null,833201335,1164966727,"MARC  RASMUSSEN","6836 S FLORIDA AVE","LAKELAND","FL",33813,"DENTAL","General Dentist"]
[null,834496228,1376779488,"JENNIFER LINN BUSH","796 W LINCOLN HWY","EXTON","PA",19341,"DENTAL","General Dentist"]
[null,522047317,1811397458,"LISA  UBERTI","1290 PEOPLES PLZ","NEWARK","DE",19702,"DENTAL","General Dentist"]
[null,472730515,1518252527,"ATHENA A VU","400 S TRYON ST STE M4","CHARLOTTE","NC",28285,"DENTAL","Prosthodontist"]
[null,475669595,1720426935,"CURTIS  DEAN","2575 EVELYN BYRD AVE","HARRISONBURG","VA",22801,"DENTAL","General Dentist"]
[null,471706456,1407749054,"ALVARO ANDRES MARTINEZ","379 KINGS HWY # 300","PUNTA GORDA","FL",33983,"DENTAL","General Dentist"]
[null,273149805,1437109840,"JEFFREY  WACHTEL","3801 MAIN ST","HILTON HEAD ISLAND","SC",29926,"DENTAL","General Dentist"]
[null,845054169,1962714980,"SWETA  SHAH-SAINI","102 SCHUBERT DR","DOWNINGTOWN","PA",19335,"DENTAL","Endodontist"]
[null,542022806,1326180787,"GREGORY L WHITMER","2202 N BERKSHIRE RD STE 203","CHARLOTTESVILLE","VA",22901,"DENTAL","General Dentist"]
[null,270233866,1841482080,"DAVID J KWON","74-5620 PALANI RD STE 104","KAILUA KONA","HI",96740,"DENTAL","General Dentist"]
[null,874334983,1609163773,"MORGAN  MCCLELLAN","202 TOWNE VILLAGE DR","CARY","NC",27513,"DENTAL","General Dentist"]
[null,522292227,1831310127,"SHERWIN B ESFANDIARI","4321 COLLINGTON RD STE 210","BOWIE","MD",20716,"DENTAL","General Dentist"]
[null,842537815,1104199355,"PATRICK E DEFORNO","340 N POTTSTOWN PIKE","EXTON","PA",19341,"DENTAL","General Dentist"]
[null,562348277,1750493193,"WILLIAM  CARVAJAL","101 ARCHWAY CT","LYNCHBURG","VA",24502,"DENTAL","Oral Surgeon"]
[null,200185918,1154539963,"CHU N LEE","12106 US HIGHWAY 301 N","PARRISH","FL",34219,"DENTAL","General Dentist"]
[null,330930077,1306894498,"RENAE L WILSON","275 W MADISON AVE STE B","EL CAJON","CA",92020,"DENTAL","General Dentist"]
[null,331490918,1811630833,"JOSHUA  GORDON","900 RIO COURT EAST STE B","CHARLOTTESVILLE","VA",22901,"DENTAL","General Dentist"]
[null,454151494,1346462488,"MICHAEL  SOUTAS","8390 CHAMPIONS GATE BLVD STE 314","CHAMPIONS GATE","FL",33896,"DENTAL","General Dentist"]
[null,834088725,1881047132,"TIM TIEN VAN","4125 RACE TRACK RD UNIT 109","SAINT JOHNS","FL",32259,"DENTAL","General Dentist"]
[null,471755519,1215945308,"ALEXANDER J RAKOS","710 SUNSET BLVD N STE B","SUNSET BEACH","NC",28468,"DENTAL","General Dentist"]
[null,263030279,1932341633,"RONALD S KOVAC","2000 CLEMENTS BRIDGE RD STE 117 A","DEPTFORD","NJ","08096","DENTAL","General Dentist"]
[null,221931711,1407944341,"WEI-LUN  WANG","4 VILLAGE DR","CAPE MAY CH","NJ","08210","DENTAL","Endodontist"]
[null,920441543,1477652154,"ROBERT  MORABITO","200 FORBES ST STE 301","ANNAPOLIS","MD",21401,"DENTAL","General Dentist"]
[null,233056351,1821011719,"JONI R MARCUS","7215 W. PASSYUNK AVE","PHILADELPHIA","PA",19142,"DENTAL","General Dentist"]
[null,871253120,1396326187,"POONAM  KALARIA","2405 SATELLITE BLVD STE 115","DULUTH","GA",30096,"DENTAL","General Dentist"]
[null,202760195,1295934263,"ANU  KAREEM","1001 BALTIMORE PIKE STE 110","SPRINGFIELD","PA",19064,"DENTAL","General Dentist"]
[null,274061040,1063669398,"RYAN K TAMBURRINO","688 UNIONVILLE RD STE 101","KENNETT SQUARE","PA",19348,"DENTAL","Orthodontist"]
[null,844852412,1386721942,"PAUL HENRY ULIASZ","428 E OLYMPIA AVE","PUNTA GORDA","FL",33950,"DENTAL","General Dentist"]
[null,233095309,1962605980,"SETH A ROSEN","1008 FAYETTE ST","CONSHOHOCKEN","PA",19428,"DENTAL","General Dentist"]
[null,"061401784",1568501427,"JOHN  CROCAMO","1000 BRIDGEPORT AVE","SHELTON","CT","06484","DENTAL","General Dentist"]
[null,823541893,1508431016,"BAILEY  FISHER","2182 SANDY DR STE 102","STATE COLLEGE","PA",16803,"DENTAL","General Dentist"]
[null,301045413,1528275849,"ANDREW B SMITH","2110 N FOUNTAIN GREEN RD","BEL AIR","MD",21015,"DENTAL","General Dentist"]
[null,743094945,1518089234,"SIMONE  KIM","3601 FREMONT AVE N STE 400","SEATTLE","WA",98103,"DENTAL","General Dentist"]
[null,232037426,1083011159,"JOHN P ROEDER","45 DARBY RD","PAOLI","PA",19301,"DENTAL","General Dentist"]
[null,474357748,1841356318,"MICHELLE L AITKEN","301 W CHESTER PIKE STE 202-203","HAVERTOWN","PA",19083,"DENTAL","General Dentist"]
[null,823656592,1871890731,"STEPHEN PAUL BARKER","9803 HIGHWAY 242 STE 700 700","CONROE","TX",77385,"DENTAL","General Dentist"]
[null,271444790,1811125651,"ELISHA WAZEERUD DIN BUCKLEY","540 E CROSSVILLE RD STE 200","ROSWELL","GA",30075,"DENTAL","General Dentist"]
[null,463696669,1881842656,"MICHAEL G SCHUT","1319 NC HIGHWAY 210","SNEADS FERRY","NC",28460,"DENTAL","General Dentist"]
[null,200185918,1366850018,"VALERIE K LIGEON","321 W COUNTY ROAD 419","OVIEDO","FL",32766,"DENTAL","General Dentist"]
[null,461210469,1982828232,"GREGG  TAORMINA","6250 ROUTE 209","STROUDSBURG","PA",18360,"DENTAL","General Dentist"]
[null,881224859,1609492610,"KEVIN B HOLLEY","107 OAKMONT DR","GREENVILLE","NC",27858,"DENTAL","General Dentist"]
[null,933316144,1568504660,"THOMAS M KOHLER","255 S 17TH ST STE 1206","PHILADELPHIA","PA",19103,"DENTAL","Periodontist"]
[null,200185918,1235231242,"ROGER  PRIETO","3775 ROSCOMMON DR","ORMOND BEACH","FL",32174,"DENTAL","General Dentist"]
[null,260375508,1689415671,"KAILEY  SHIELDS","206 FIELDALE RD","MEBANE","NC",27302,"DENTAL","General Dentist"]
[null,562060256,1700800497,"SOHEE K PARK","3527 BUSH RIVER RD","COLUMBIA","SC",29210,"DENTAL","Periodontist"]
[null,582412427,1083671507,"WILLIAM F RINEHART","1729 N FRASER ST","GEORGETOWN","SC",29440,"DENTAL","Oral Surgeon"]
[null,200185918,1043864168,"NIYATI  PATEL","7811 SW HIGHWAY 200","OCALA","FL",34476,"DENTAL","General Dentist"]
[null,271226915,1619536091,"SANJEEV  JOSHI","1954 FRUITVILLE PIKE","LANCASTER","PA",17601,"DENTAL","General Dentist"]
[null,871912395,1275989220,"JAE YEON  JANG","9601 BLACKWELL RD STE 310","ROCKVILLE","MD",20850,"DENTAL","Prosthodontist"]
[null,474334095,1790089860,"DAVID CRESTON JACKSON","900 SE OCEAN BLVD STE 110B","STUART","FL",34994,"DENTAL","General Dentist"]
[null,843576532,1336637198,"BRIDGET E SWOPE","3415 ROGERS RD STE 100","WAKE FOREST","NC",27587,"DENTAL","General Dentist"]
[null,922310786,1316468028,"VINCENT  CORONA","8282 BEE RIDGE RD","SARASOTA","FL",34241,"DENTAL","General Dentist"]
[null,462833818,1821202714,"NISRINE W CABANI","4371 S HIGHWAY 27 STE C15","CLERMONT","FL",34711,"DENTAL","General Dentist"]
[null,593685450,1386640449,"STEPHEN  DURRETT","13728 OFFICE PARK CT","BAYONET POINT","FL",34667,"DENTAL","General Dentist"]
[null,593365515,1225525272,"SIMON A BRODSKY","5021 NW 34TH BLVD STE A","GAINESVILLE","FL",32605,"DENTAL","General Dentist"]
[null,451266532,1023258746,"SHRUTHI  BANNENAHALLY","213 N MAIN ST","BLYTHEWOOD","SC",29016,"DENTAL","General Dentist"]
[null,823440641,1982835641,"SUBHA C YERABOLLU","24805 PINEBROOK RD STE 316","CHANTILLY","VA",20152,"DENTAL","General Dentist"]
[null,263640742,1104096247,"SHURONG  CAO","4 SMEDLEY LANE","NEWTOWN SQUARE","PA",19073,"DENTAL","Pediatric Dentist"]
[null,882395503,1063024370,"KEGAN J BRENNER","1169 HILLTOP PKWY UNIT 203","STEAMBOAT SPRINGS","CO",80487,"DENTAL","General Dentist"]
[null,200185918,1881114825,"RACHEL LEE FRANZ","2701 E COUNTY LINE RD","LUTZ","FL",33559,"DENTAL","General Dentist"]
[null,320019298,1053337774,"MICHAEL C CORDORA","236 9TH AVENUE DR NE","HICKORY","NC",28601,"DENTAL","General Dentist"]
[null,873947207,1700032158,"DANIEL  WOLTER","14940 W INDIAN SCHOOL RD STE 450","GOODYEAR","AZ",85395,"DENTAL","General Dentist"]
[null,880950035,1528550498,"TYLER R LINCOLN","2004 CALLIE WAY STE 101","UNION","KY",41091,"DENTAL","General Dentist"]
[null,460657263,1891937470,"TIMOTHY D WENTZLOFF","876 E FRONT ST","TRAVERSE CITY","MI",49686,"DENTAL","General Dentist"]
[null,863831146,1700136645,"STEPHEN W GEORGE","606 W MAGNOLIA ST","LEESBURG","FL",34748,"DENTAL","General Dentist"]
[null,541746259,1427094721,"HEIDI A SHERMAN","106 MCLAUGHLIN ST","LEXINGTON","VA",24450,"DENTAL","General Dentist"]
[null,481266986,1992880546,"JEROME J RIDDLE","7010 E CHAUNCEY LN STE 140","PHOENIX","AZ",85054,"DENTAL","General Dentist"]
[null,860828480,1891718953,"MATTHEW E WESSEL","10615 W THUNDERBIRD BLVD STE B500","SUN CITY","AZ",85351,"DENTAL","General Dentist"]
[null,853857035,1952839854,"TOREY J VANDE WALLE","1800 STATE ROAD 16","LA CROSSE","WI",54601,"DENTAL","General Dentist"]
[null,844018824,1356469043,"FARSHID  SANAVI","7814 OLD YORK RD","ELKINS PARK","PA",19027,"DENTAL","Periodontist"]
[null,270602568,1801054911,"TARA L WIGGINS","5050 KENTWORTH DR","HOLLY SPRINGS","NC",27540,"DENTAL","General Dentist"]
[null,474499632,1871652495,"SANGHEE  YUN","108 E EDGEWOOD DR","FRIENDSWOOD","TX",77546,"DENTAL","General Dentist"]
[null,201254551,1477719524,"DAVID ANTHONY DOBBINS","716 BETHLEHEM PIKE","ERDENHEIM","PA",19038,"DENTAL","General Dentist"]
[null,464593914,1578131991,"BROOKE A DOLIN","9550 ROCKY RIVER RD STE 202","CHARLOTTE","NC",28215,"DENTAL","General Dentist"]
[null,454671466,1093976383,"WILLIAM ROBERT SAMSON","3997 VALLEY COMMONS DR STE A","BOZEMAN","MT",59718,"DENTAL","General Dentist"]
[null,463375669,1255324315,"JORGE  PELAEZ","1805 COLONIAL MEDICAL COURT","VIRGINIA BEACH","VA",23454,"DENTAL","General Dentist"]
[null,844919448,1225067440,"ELIZABETH  PATINO","180 PINNACLES DR STE 101","PALM COAST","FL",32164,"DENTAL","General Dentist"]
[null,232771678,1134338312,"MARSHA M KIRSCHNER","4660 HORSESHOE PIKE # 406","HONEY BROOK","PA",19344,"DENTAL","General Dentist"]
[null,273741647,1982267324,"RYAN  PERRO","1630 ROUTE 322 STE F","SWEDESBORO","NJ","08085","DENTAL","General Dentist"]
[null,270411887,1609564103,"SHANNON M THIBODEAU","29292 SW TOWN CENTER LOOP E STE A","WILSONVILLE","OR",97070,"DENTAL","General Dentist"]
[null,861369854,1346376860,"LAUREN A FRANCIS","2660 NC HIGHWAY 210 E STE 103","HAMPSTEAD","NC",28443,"DENTAL","General Dentist"]
[null,474665148,1609967462,"ROBERT L PENROD","11206 SW 93RD COURT RD STE 200","OCALA","FL",34481,"DENTAL","General Dentist"]
[null,990735358,1538835988,"REED S CHIAPPETTI","25229 S SUN LAKES BLVD STE 102","SUN LAKES","AZ",85248,"DENTAL","General Dentist"]
[null,475608415,1629547070,"LIHSIN  WU","501B SPRINGFIELD AVE","BERKELEY HEIGHTS","NJ","07922","DENTAL","Orthodontist"]
[null,591226840,1558340232,"ROGER RANGARAJAN THAYER","549 HEALTH BLVD","DAYTONA BEACH","FL",32114,"DENTAL","Oral Surgeon"]
[null,650733482,1346339611,"CHRISTOPHER J WIGLEY","914 NE JENSEN BEACH BLVD","JENSEN BEACH","FL",34957,"DENTAL","General Dentist"]
[null,202999173,1487770194,"ROBERT  SCHERRER","160 S BROAD ST","RIDGEWOOD","NJ","07450","DENTAL","General Dentist"]
[null,862999541,1144774365,"ZACHARY D DANOWIT","16600 NE 8TH AVE","NORTH MIAMI BEACH","FL",33162,"DENTAL","Prosthodontist"]
[null,541970894,1073867222,"RICHARD D GRUNTZ","3030 POTOMAC AVE STE 405","ALEXANDRIA","VA",22305,"DENTAL","General Dentist"]
[null,873145016,1528321718,"REENA  PATEL","2137 WELSH RD STE 3A","PHILADELPHIA","PA",19115,"DENTAL","Endodontist"]
[null,851103309,1356733000,"STEPHANIE BRUE VINOKUR","1010 N NARCOOSSEE RD","SAINT CLOUD","FL",34771,"DENTAL","General Dentist"]
[null,825209288,1235754300,"NICOLE R CARON","56 NEW DRIFTWAY STE 303","SCITUATE","MA","02066","DENTAL","General Dentist"]
[null,823813275,1083710933,"BRADLEY R WELSH","231 PARKVIEW DR","MILLERSBURG","OH",44654,"DENTAL","General Dentist"]
[null,843810614,1952643363,"ALEX A PLANES","11200 SW VILLAGE PKWY STE 106","PORT ST LUCIE","FL",34987,"DENTAL","General Dentist"]
[null,301045413,1457917767,"ERIC  CLARK","2110 N FOUNTAIN GREEN RD","BEL AIR","MD",21015,"DENTAL","General Dentist"]
[null,820529870,1528139201,"TAD E HANCOCK","485 W CHUBBUCK RD STE A","CHUBBUCK","ID",83202,"DENTAL","General Dentist"]
[null,432055285,1275596082,"JONATHAN E BURKE","1630 ROUTE 322 STE A","SWEDESBORO","NJ","08085","DENTAL","Oral Surgeon"]
[null,320285736,1417052556,"WILLIAM  COSTELLO","544 WASHINGTON AVE","PHILADELPHIA","PA",19147,"DENTAL","General Dentist"]
[null,650608364,1487769832,"PAUL A TWARGOSKI","1258 JACARANDA BLVD # 8","VENICE","FL",34292,"DENTAL","General Dentist"]
[null,232998362,1073610580,"MATTHEW J SWIATEK","331 WILMINGTON W CHESTER PIKE STE 5","GLEN MILLS","PA",19342,"DENTAL","Orthodontist"]
[null,465570092,1013204627,"JEREMY B JORGENSON","3033 BRISTOL ST UNIT 103","COSTA MESA","CA",92626,"DENTAL","General Dentist"]
[null,522388452,1720102189,"RICHARD M LENNON","16562 N DALE MABRY HWY","TAMPA","FL",33618,"DENTAL","General Dentist"]
[null,233101899,1417123654,"ANDREW D MILLER","1601 WALNUT ST STE 215","PHILADELPHIA","PA",19102,"DENTAL","Oral Surgeon"]
[null,270524892,1548499445,"JARED T FORD","7630 CAMBRIDGE MANOR PL","FORT MYERS","FL",33907,"DENTAL","General Dentist"]
[null,271321399,1851307813,"MARK  GOODMAN","801 E TAMARACK RD","ALTUS","OK",73521,"DENTAL","General Dentist"]
[null,205603293,1992910095,"MAX R PITEL","545 BECKETT RD STE 201","SWEDESBORO","NJ","08085","DENTAL","General Dentist"]
[null,592907861,1770642787,"JOHN A FERULLO","200 CENTRAL AVE STE 830","SAINT PETERSBURG","FL",33701,"DENTAL","General Dentist"]
[null,741675660,1578747325,"EUCILD N MCLEOD","1 CITIZENS PLAZA","GEORGETOWN","TX",78626,"DENTAL","General Dentist"]
[null,822683940,1255505749,"JULIE R HOLLOBAUGH","140 UNION RD","BELLEFONTE","PA",16823,"DENTAL","General Dentist"]
[null,474665148,1003602079,"TRENTON  GINTER","11206 SW 93RD COURT RD STE 200","OCALA","FL",34481,"DENTAL","General Dentist"]
[null,465159381,1851689913,"JARED B BUNKER","10175 RANCHO CARMEL DR STE 126","SAN DIEGO","CA",92128,"DENTAL","General Dentist"]
[null,200185918,1073199634,"ANA CAROLINA  MACHADO PEREZ","205 VILLAGE COMMONS DR","ST AUGUSTINE","FL",32092,"DENTAL","General Dentist"]
[null,330902067,1275677221,"GREY J CUNNINGHAM","7300 GIRARD AVE STE 206","LA JOLLA","CA",92037,"DENTAL","General Dentist"]
[null,274792309,1669537163,"YANG  RUAN","1910 MARLTON PIKE E STE 3","CHERRY HILL","NJ","08003","DENTAL","General Dentist"]
[null,813990005,1831451988,"ANISHA D PATEL","2448 OLD BRICK RD","GLEN ALLEN","VA",23060,"DENTAL","General Dentist"]
[null,274168793,1528227444,"MICHAELA  MCCORMICK-GRAVEL","2215 BALTIMORE PIKE","OXFORD","PA",19363,"DENTAL","Orthodontist"]
[null,222326278,1295942902,"JOHN D SAVON","40 E ATLANTIC AVE","AUDUBON","NJ","08106","DENTAL","General Dentist"]
[null,541005001,1992968259,"REBECCA A CLOUDT","403 BOULEVARD","SALEM","VA",24153,"DENTAL","General Dentist"]
[null,474233197,1467632786,"KATHARINE  MILLER","145 N NARBERTH AVE","NARBERTH","PA",19072,"DENTAL","General Dentist"]
[null,472532794,1750011094,"FRANSISCA  CASTILLO","213 MARLBORO AVE","EASTON","MD",21601,"DENTAL","General Dentist"]
[null,900074728,1063584829,"MATTHEW L HEAPHY","712 KENSINGTON AVE","MISSOULA","MT",59801,"DENTAL","General Dentist"]
[null,454879929,1962621847,"ROBERT BOHMAN LESLIE","902 KITTY HAWK RD STE 100","UNIVERSAL CITY","TX",78148,"DENTAL","General Dentist"]
[null,223451281,1184788846,"RICHARD  MACFEETERS","410 N BROADWAY","PITMAN","NJ","08071","DENTAL","General Dentist"]
[null,920833073,1093844250,"MOON C CHA","414 CAPITOL TRL","NEWARK","DE",19711,"DENTAL","General Dentist"]
[null,991701788,1881784940,"ROBERT S DAYSE","7500 HANOVER PKWY STE 106","GREENBELT","MD",20770,"DENTAL","Oral Surgeon"]
[null,922612283,1811344534,"STEPHEN ROSS  RIDDEL","9815 E 51ST ST","TULSA","OK",74146,"DENTAL","General Dentist"]
[null,863673628,1346452356,"MARC B MCKEE","1830 PROSPECTOR AVE","PARK CITY","UT",84060,"DENTAL","General Dentist"]
[null,223560207,1578769535,"BENEDICT J BACHSTEIN","THE 601 OFFICE PLAZA 1050 MANTUA PIKE","WENONAH","NJ","08090","DENTAL","Endodontist"]
[null,474057957,1215462221,"TUSHAR  PATEL","1025 N PROVIDENCE RD","MEDIA","PA",19063,"DENTAL","General Dentist"]
[null,871396870,1760641609,"KEVIN JESS KRAUSE","7208 BENEVA RD","SARASOTA","FL",34238,"DENTAL","General Dentist"]
[null,371834882,1093201212,"NICHOLAS  GABLE","329 CYPRESS GARDENS BLVD","WINTER HAVEN","FL",33880,"DENTAL","General Dentist"]
[null,271874344,1386721942,"PAUL HENRY ULIASZ","3436 CLEVELAND AVE","FORT MYERS","FL",33901,"DENTAL","General Dentist"]
[null,920698335,1417964289,"CHRISTOPHER M DUMAS","4575 POST ROAD","EAST GREENWICH","RI","02818","DENTAL","General Dentist"]
[null,461589468,1215214952,"TIA C KENNEDY","3502 CLOVERDALE RD","FLORENCE","AL",35633,"DENTAL","General Dentist"]
[null,811659342,1174818298,"ANDREW B HINKLE","6711 WHITTIER AVE, #103","MCLEAN","VA",22101,"DENTAL","General Dentist"]
[null,232054483,1497282768,"DANIEL  SIERRA-VASQUEZ","721 E BALTIMORE PIKE STE 200","KENNETT SQUARE","PA",19348,"DENTAL","General Dentist"]
[null,753246657,1215948385,"MICHAEL S MATHEWS","2005 THONOTOSASSA RD STE A","PLANT CITY","FL",33563,"DENTAL","General Dentist"]
[null,852869564,1124490206,"HUNTER  BENNETT","8899 TIMBERWILDE DR STE 3","BONITA SPRINGS","FL",34135,"DENTAL","General Dentist"]
[null,834164016,1376758318,"ROBERT BENJAMIN ALLRED","26A E MAIN ST N","HAMPTON","GA",30228,"DENTAL","General Dentist"]
[null,822076649,1881795672,"EMMA  GALVAN","3904 E JOPPA RD","NOTTINGHAM","MD",21236,"DENTAL","General Dentist"]
[null,521116591,1073129268,"HADEEL  ALHASSANI","503 MUIR ST STE A","CAMBRIDGE","MD",21613,"DENTAL","General Dentist"]
[null,465715285,1952736555,"BRENDEN  BELL","1824 CASCADE AVE","HOOD RIVER","OR",97031,"DENTAL","General Dentist"]
[null,881224580,1215155569,"DAMIAN C MILILLO","1244 WRIGHTS LN","WEST CHESTER","PA",19380,"DENTAL","General Dentist"]
[null,236236637,1114094927,"MARK A KIRK","1051 MAIN ST E","WHITE SULPHUR SPRINGS","WV",24986,"DENTAL","General Dentist"]
[null,461180484,1568449726,"LOKEN  PATEL","70 THOMAS JOHNSON DR STE 123","FREDERICK","MD",21702,"DENTAL","Endodontist"]
[null,861013396,1033102207,"MICHAEL  RECUBER","8877 W UNION HILLS DR # E500","PEORIA","AZ",85382,"DENTAL","General Dentist"]
[null,203856197,1558536326,"EDWARD  CHUN","1313 DOLLEY MADISON BLVD STE 307","MCLEAN","VA",22101,"DENTAL","Endodontist"]
[null,752997270,1356865398,"JENNA MARIE JARVIS","4165 OLD MILTON PKWY STE 270","ALPHARETTA","GA",30005,"DENTAL","General Dentist"]
[null,273497535,1790746311,"JOSHUA A MONDLICK","8671 W UNION HILLS DR STE 501","PEORIA","AZ",85382,"DENTAL","Periodontist"]
[null,900742664,1902098817,"MICHAEL C SHUCK","1480 QUARTERPATH RD STE 2A","WILLIAMSBURG","VA",23185,"DENTAL","General Dentist"]
[null,800487462,1205169612,"RANDY A CASTLE","2350 SW MULTNOMAH BLVD STE I","PORTLAND","OR",97219,"DENTAL","General Dentist"]
[null,843576392,1508109521,"BRIAN N LEECH","1460 KELLY RD STE 200","APEX","NC",27502,"DENTAL","General Dentist"]
[null,576113942,1396903639,"EDWIN M TJAN","20353 LAKE CHABOT RD STE 104","CASTRO VALLEY","CA",94546,"DENTAL","General Dentist"]
[null,453458048,1033542832,"POONAM V POPAT","26540 ACE AVE #G-105","LEESBURG","FL",34748,"DENTAL","General Dentist"]
[null,464377563,1639374838,"KATHERINE V HICKS","5200 E FARNESS DR # 102","TUCSON","AZ",85712,"DENTAL","General Dentist"]
[null,262871529,1063617363,"NATASHA M LEE","1613 HIGHWAY 20 W","MCDONOUGH","GA",30253,"DENTAL","General Dentist"]
[null,621661220,1548523434,"JASON M BOWMAN","800 MULBERRY ST","LOUDON","TN",37774,"DENTAL","General Dentist"]
[null,233024574,1548490451,"LINDI  ORLIN","135 S BRYN MAWR AVE STE 340","BRYN MAWR","PA",19010,"DENTAL","Endodontist"]
[null,651266581,1851490429,"DOUGLAS B SMAIL","500 FEDERAL ST STE 202","TROY","NY",12180,"DENTAL","Oral Surgeon"]
[null,251820025,1972942688,"STEVEN E WYLIE","161 OLD SCHOOLHOUSE LN","MECHANICSBURG","PA",17055,"DENTAL","General Dentist"]
[null,474861416,1194206862,"COURTNEY E LAFORTE","6707 HIGHWAY 431 S STE 103","OWENS CROSS ROADS","AL",35763,"DENTAL","General Dentist"]
[null,831788337,1578058103,"BRYANT D ASH","11 MEADOW BRANCH AVE","WINCHESTER","VA",22601,"DENTAL","General Dentist"]
[null,272516487,1972764926,"JESSANNA E SMITH","1018 US HIGHWAY 80","TYBEE ISLAND","GA",31328,"DENTAL","General Dentist"]
[null,832897176,1326124769,"ALLA  DORFMAN","552 BROADWAY STE 505","NEW YORK","NY",10012,"DENTAL","General Dentist"]
[null,822536222,1306076682,"TODD DANIEL COOPER","21534 GREAT MILLS RD","LEXINGTON PARK","MD",20653,"DENTAL","General Dentist"]
[null,273900278,1154364396,"PHOEBY J LEWIS","516 GA HIGHWAY 247 S","BONAIRE","GA",31005,"DENTAL","General Dentist"]
[null,521612755,1467678128,"CRAIG L SNYDER","300 E JOPPA RD STE 400","TOWSON","MD",21286,"DENTAL","General Dentist"]
[null,455540750,1760692321,"OMAR S DAMJI","17 EXECUTIVE PARK DR NE STE 235","ATLANTA","GA",30329,"DENTAL","General Dentist"]
[null,205988193,1427143395,"REBECCA B ROSE","55 IRELAND ROAD","BAYBORO","NC",28515,"DENTAL","General Dentist"]
[null,200185918,1912112541,"MICHAEL LEE JARRELL","205 VILLAGE COMMONS DR","ST AUGUSTINE","FL",32092,"DENTAL","General Dentist"]
[null,251585198,1023109006,"KENNETH M SOFRANKO","928 BRODHEAD RD SUITE C","CORAOPOLIS","PA",15108,"DENTAL","General Dentist"]
[null,205061358,1720272768,"GARDINER M PACKER","6037 HARBOUR PARK DR","MIDLOTHIAN","VA",23112,"DENTAL","Endodontist"]
[null,923075506,1629636667,"JONATHON B THOMSON","1175 W WICKENBURG WAY STE 1","WICKENBURG","AZ",85390,"DENTAL","General Dentist"]
[null,932115811,1841853710,"LANCE SCOTT MCGAVIN","2305 VIDINA DR STE 103","MELBOURNE","FL",32940,"DENTAL","General Dentist"]
[null,991873169,1063862589,"LAUREN E BELOUS","1450 EAST BOOT RD STE 600 C","WEST CHESTER","PA",19380,"DENTAL","General Dentist"]
[null,753201454,1346238706,"SENGSOURIYA J ANANTHASANE","5870 CHARLOTTE LN STE 200","CUMMING","GA",30040,"DENTAL","General Dentist"]
[null,200520785,1770757205,"S BRITT  HOLSTEIN","425 A LEXINGTON AVE","CHAPIN","SC",29036,"DENTAL","General Dentist"]
[null,274349544,1962513382,"DARCY R GALBRAITH","3628 MERIDIAN ST STE 1B","BELLINGHAM","WA",98225,"DENTAL","General Dentist"]
[null,463460895,1821576430,"LANDON M MOMBERG","33 LONO AVE STE 370","KAHULUI","HI",96732,"DENTAL","General Dentist"]
[null,262646682,1811059033,"DOUGLAS B SHERLY","326 HADDON AVE STE A","WESTMONT","NJ","08108","DENTAL","General Dentist"]
[null,332436149,1043572977,"CAITLIN H KAUFFMAN","26 CROSS ST","AUBURN","ME","04210","DENTAL","General Dentist"]
[null,300038982,1235245424,"LORENA  COCKLEY","418 W KING ST","EAST BERLIN","PA",17316,"DENTAL","General Dentist"]
[null,352003858,1760978837,"JOSHUA P WELBORN","2300 W FRANKLIN ST","EVANSVILLE","IN",47712,"DENTAL","General Dentist"]
[null,200185918,1912000951,"STEPHEN T MCLEOD","14633 COUNTY ROAD 565A","GROVELAND","FL",34736,"DENTAL","General Dentist"]
[null,208032900,1851482004,"FRANK A PETTISANI","4276 HARBOUR BEACH BLVD STE B","BRIGANTINE","NJ","08203","DENTAL","General Dentist"]
[null,332957138,1942869243,"AVA K BECKER","2935 N COUNTRY CLUB RD","TUCSON","AZ",85716,"DENTAL","General Dentist"]
[null,900490853,1427056753,"SHAWN P MALOY","5419 S CURTICE ST","LITTLETON","CO",80120,"DENTAL","General Dentist"]
[null,475528443,1386991735,"BEVERLY  JAISWAL","196 GROVE AVE STE F","WEST DEPTFORD","NJ","08086","DENTAL","General Dentist"]
[null,260707724,1891487450,"JONATHAN  LEUNG","1932 E SOUTHEAST LOOP 323","TYLER","TX",75701,"DENTAL","General Dentist"]
[null,872378527,1477323095,"JONATHAN GERALD MAINS","120 E MARKET ST","LEWISTOWN","PA",17044,"DENTAL","General Dentist"]
[null,731555706,1891762951,"BRIAN E DREW","1410 N HARRISON ST","SHAWNEE","OK",74801,"DENTAL","General Dentist"]
[null,812444403,1487074415,"CHRISTOPHER S BAILEY","11570 CROSSROADS CIR STE 116","BALTIMORE","MD",21220,"DENTAL","Pediatric Dentist"]
[null,473322920,1477799476,"WAEL M KASSEM","368  BERLIN CROSS KEYS ROAD","WILLIAMSTOWN","NJ","08094","DENTAL","General Dentist"]
[null,844290235,1063893071,"MICHAEL IMAD ALHARIR","1603 SOUTH ST","PHILADELPHIA","PA",19146,"DENTAL","General Dentist"]
[null,824714004,1750128997,"NESREEN  IBRIHIM","9027 W CHESTER PIKE","UPPER DARBY","PA",19082,"DENTAL","General Dentist"]
[null,920833073,1194354712,"AESHA  AMIN","414 CAPITOL TRL","NEWARK","DE",19711,"DENTAL","General Dentist"]
[null,203885623,1407835002,"KEISHA P JUDD","8860 COLUMBIA 100 PKWY STE 106","COLUMBIA","MD",21045,"DENTAL","General Dentist"]
[null,231944530,1447481718,"GREGORY  BELL","190 GOOD DR","LANCASTER","PA",17603,"DENTAL","Oral Surgeon"]
[null,833782430,1649368879,"DOUGLAS  MCMILLAN","831 N JUSTICE ST","HENDERSONVILLE","NC",28791,"DENTAL","General Dentist"]
[null,461462325,1356629091,"RAYMOND S HOLMES","2717 ROANE STATE HWY","HARRIMAN","TN",37748,"DENTAL","General Dentist"]
[null,562088526,1134780018,"IMRAN Z RAUF","7371 SIX FORKS RD","RALEIGH","NC",27615,"DENTAL","General Dentist"]
[null,832587949,1023109006,"KENNETH M SOFRANKO","201 OHIO RIVER BLVD UNIT A","SEWICKLEY","PA",15143,"DENTAL","General Dentist"]
[null,222138393,1306910641,"RICKI  KRANTZ","532 BRICK BLVD","BRICK","NJ","08723","DENTAL","General Dentist"]
[null,233024574,1285017418,"JOHN  RUCH","665 EXTON CMNS","EXTON","PA",19341,"DENTAL","Endodontist"]
[null,800487462,1205169612,"RANDY A CASTLE","2350 SW MULTNOMAH BLVD STE I","PORTLAND","OR",97219,"DENTAL","General Dentist"]
[null,208243635,1639391568,"CHRISTOPHER N SEPPI","13402 SUMMERPORT VILLAGE PKWY STE 502","WINDERMERE","FL",34786,"DENTAL","General Dentist"]
[null,271473680,1477120053,"ALEX  JOSEPH","25 E MAIN ST","MILLVILLE","NJ","08332","DENTAL","General Dentist"]
[null,232347052,1346373693,"BRENT D GUENTHNER","1581 MCDANIEL DR","WEST CHESTER","PA",19380,"DENTAL","General Dentist"]
[null,562185627,1023636198,"JESSICA M FIRNHABER","2048 WATERSCAPE WAY","NEW BERN","NC",28562,"DENTAL","General Dentist"]
[null,471755519,1083764450,"NANCI L HARP","710 SUNSET BLVD N STE B","SUNSET BEACH","NC",28468,"DENTAL","General Dentist"]
[null,271554575,1841356318,"MICHELLE L AITKEN","321 N LANSDOWNE AVE","LANSDOWNE","PA",19050,"DENTAL","General Dentist"]
[null,200185918,1396791810,"JORGE A RODRIGUEZ","12260 TAMIAMI TRL E","NAPLES","FL",34113,"DENTAL","General Dentist"]
[null,851570499,1235841610,"AMARJOT  BRAR","4605 STATE RD","DREXEL HILL","PA",19026,"DENTAL","General Dentist"]
[null,844069690,1548515398,"POLINA  VAYNBLAT","1771 KUSER RD","HAMILTON","NJ","08690","DENTAL","General Dentist"]
[null,994727009,1851750426,"DEREK  CHENET","105 MAIN ST UNIT 1","OLD SAYBROOK","CT","06475","DENTAL","General Dentist"]
[null,571122832,1700830270,"CINDY L HYLTON","445 N CEDAR ST","SUMMERVILLE","SC",29483,"DENTAL","General Dentist"]
[null,832934284,1841032380,"TYLER  SCHMIDT","1126 IVES AVE N","GLENCOE","MN",55336,"DENTAL","General Dentist"]
[null,475520139,1407999063,"MICHAEL J HARTMAN","101 OLD SCHOOLHOUSE LN FL 1","MECHANICSBURG","PA",17055,"DENTAL","Oral Surgeon"]
[null,200185918,1295187516,"IVY N TRAN","2203 EVERGLADES LN","THE VILLAGES","FL",32163,"DENTAL","General Dentist"]
[null,810966671,1538901871,"SARA  ALHAFFAR","4675 E STATE ROAD 44 STE 104","WILDWOOD","FL",34785,"DENTAL","General Dentist"]
[null,465342235,1699047480,"JI HYE  PARK","1567 PALISADE AVE STE 2A","FORT LEE","NJ","07024","DENTAL","General Dentist"]
[null,231352685,1750437885,"DANA  GRAVES","240 S 40TH ST","PHILADELPHIA","PA",19104,"DENTAL","General Dentist"]
[null,232582796,1326192865,"JONATHAN P ASUNCION","422 W MAIN ST","MOUNT JOY","PA",17552,"DENTAL","General Dentist"]
[null,832541146,1578298352,"ALEXANDRA RAE CABRERA","590 S ENOTA DR NE STE 2","GAINESVILLE","GA",30501,"DENTAL","General Dentist"]
[null,742428018,1396446225,"RODRIGO  GUERRERO","2130 NE LOOP 410 STE 225","SAN ANTONIO","TX",78217,"DENTAL","General Dentist"]
[null,861313345,1548464761,"GEORGE T LYNCH","17 W ORMOND AVENUE","CHERRY HILL","NJ","08002","DENTAL","Pediatric Dentist"]
[null,850849636,1730635111,"JINYU  SUN","20785 PROFESSIONAL PARK BLVD","GEORGETOWN","DE",19947,"DENTAL","General Dentist"]
[null,455031707,1528119203,"ALEESHA M FREIMUTH","2509 SE 17TH ST","OCALA","FL",34471,"DENTAL","General Dentist"]
[null,861889356,1861843427,"JOHN E HOGGARD","2252 YAUPON DR","WILMINGTON","NC",28401,"DENTAL","General Dentist"]
[null,921153299,1528686862,"LEILA  MAKI","1209 WARD AVE","WEST CHESTER","PA",19380,"DENTAL","General Dentist"]
[null,993630483,1871905497,"LINY R JOHN","2760 W 1ST ST BLDG C STE 10","PROSPER","TX",75078,"DENTAL","Pediatric Dentist"]
[null,201272092,1962134940,"JUAN CARLOS  ORTIZ CEDENO","8438 SW 103RD STREET RD","OCALA","FL",34481,"DENTAL","General Dentist"]
[null,923075506,1104391341,"JENNA L GAZZOLA","1175 W WICKENBURG WAY STE 1","WICKENBURG","AZ",85390,"DENTAL","General Dentist"]
[null,823231156,1063156628,"NAYANA  DUBIER","4373 JIMMY LEE SMITH PKWY STE 105","HIRAM","GA",30141,"DENTAL","General Dentist"]
[null,271383787,1457447211,"ERIC W BAXMANN","15650 SAN CARLOS BLVD","FORT MYERS","FL",33908,"DENTAL","General Dentist"]
[null,824148857,1740582030,"DAVID A DONATI","3005 REVERE BLVD","BRIGANTINE","NJ","08203","DENTAL","General Dentist"]
[null,814855370,1265743439,"DENA  CONSTANDELIS","465 VALLEY RD","CLIFTON","NJ","07013","DENTAL","General Dentist"]
[null,205996747,1164706420,"SWATI C MAKADIA","7801 YORK RD STE 218","TOWSON","MD",21204,"DENTAL","General Dentist"]
[null,561537517,1497972996,"EDWARD B MCCLENDON","501 HICKMAN RD","TABOR CITY","NC",28463,"DENTAL","General Dentist"]
[null,271669118,1376676981,"STEVEN D CAWLEY","1210 E MAIN ST","MOUNT JOY","PA",17552,"DENTAL","General Dentist"]
[null,923514160,1568948214,"CHESTER B KENER","12480 N RANCHO VISTOSO BLVD STE 150","ORO VALLEY","AZ",85755,"DENTAL","General Dentist"]
[null,263300273,1013135904,"ROBERT E CHIANELLI","411 BROAD ST","MONTOURSVILLE","PA",17754,"DENTAL","General Dentist"]
[null,821761788,1295744407,"SEAN P GRADY","935 BUFORD RD STE 100","CUMMING","GA",30041,"DENTAL","General Dentist"]
[null,822272495,1669521118,"RICHARD  BOSS","553 SHILOH PIKE","BRIDGETON","NJ","08302","DENTAL","General Dentist"]
[null,251512482,1578125639,"BRENT ANDREW VALOSIN","109 ANNA AVE","BLANDON","PA",19510,"DENTAL","General Dentist"]
[null,862891005,1770886020,"EVE  DRAKE","4202 PHILADELPHIA AVE","CHAMBERSBURG","PA",17202,"DENTAL","General Dentist"]
[null,562185627,1124155684,"TRACI M ESPINOSA","1124 GALLERY PARK LN STE 101","WILMINGTON","NC",28412,"DENTAL","General Dentist"]
[null,823163711,1205459153,"TYLER S FLYNN","5 BOULDER ROCK DR STE A","PALM COAST","FL",32137,"DENTAL","General Dentist"]
[null,811144084,1295300820,"BYUNG YOON  KIM","633 CEDAR CREEK GRADE","WINCHESTER","VA",22601,"DENTAL","General Dentist"]
[null,232120659,1467473819,"EDMOND RIGGS LEACH","622 E MAIN ST","DALLASTOWN","PA",17313,"DENTAL","General Dentist"]
[null,300535256,1093935819,"RENEE  FALIVENE","232 NORWOOD AVE STE B","WEST LONG BRANCH","NJ","07764","DENTAL","General Dentist"]
[null,391861854,1568167633,"KELSI A HERFEL","1920 COMMERCE DRIVE","MOUNT HOREB","WI",53572,"DENTAL","General Dentist"]
[null,651144303,1851021398,"CLARK  ALIAPOULIOS","2401 PGA BLVD STE 276","PALM BEACH GARDENS","FL",33410,"DENTAL","General Dentist"]
[null,463332113,1336167303,"CAROLYN A LOUGHLIN","479 THOMAS JONES WY STE 400","EXTON","PA",19341,"DENTAL","Pediatric Dentist"]
[null,"043797278",1669569844,"ISAAC S PIKE","202 N MONROE ST","MEDIA","PA",19063,"DENTAL","General Dentist"]
[null,473992124,1154333235,"DAVID  FERLITA","1501 PRESIDENTIAL WAY STE 3B","WEST PALM BEACH","FL",33401,"DENTAL","General Dentist"]
[null,274273738,1265516975,"COURTNEY  ALEXANDER","20322 HUEBNER RD STE 103","SAN ANTONIO","TX",78258,"DENTAL","Pediatric Dentist"]
[null,273803146,1457407165,"FAITH  MADDEN","555 W UWCHLAN AVE STE 100","EXTON","PA",19341,"DENTAL","General Dentist"]
[null,880926105,1669830212,"EMILY  PLAZA","521 CAPE CORAL PKWY W","CAPE CORAL","FL",33914,"DENTAL","General Dentist"]
[null,854119488,1710969845,"CHRISTOPHER D OLIVER","1724 STATE RD STE 4D","SUMMERVILLE","SC",29483,"DENTAL","General Dentist"]
[null,274408663,1356553606,"ROBERT M MARCUS","11710 REISTERSTOWN RD STE 201","REISTERSTOWN","MD",21136,"DENTAL","Pediatric Dentist"]
[null,650133219,1487744439,"KEVIN D CAPPELEN","4822 DAVIS BLVD","NAPLES","FL",34104,"DENTAL","General Dentist"]
[null,831071266,1063893345,"CREDLE A HARRIS","1721 E FRANKLIN ST","CHAPEL HILL","NC",27514,"DENTAL","General Dentist"]
[null,341944801,1205913738,"CASEY J HAMMOND","78 N CHESTNUT ST","JEFFERSON","OH",44047,"DENTAL","General Dentist"]
[null,650684175,1730230541,"STEVE G WANG","575 AVENUE K SE","WINTER HAVEN","FL",33880,"DENTAL","General Dentist"]
[null,223770919,1164565255,"GABRIEL  LERMAN","901 N OLDEN AVE","TRENTON","NJ","08638","DENTAL","General Dentist"]
[null,204569627,1235211517,"JOSHUA M MILLSAPS","935 4TH STREET DR NE","HICKORY","NC",28601,"DENTAL","General Dentist"]
[null,232264432,1013355213,"STEPHEN A HASSLER","1100 PENN AVE","WYOMISSING","PA",19610,"DENTAL","General Dentist"]
[null,541393769,1255910097,"SUE J CHO","11107 SUNSET HILLS RD STE 111","RESTON","VA",20190,"DENTAL","General Dentist"]
[null,331784564,1740331800,"MATTHEW S LYERLY","5980 US HIGHWAY 52","SALISBURY","NC",28146,"DENTAL","General Dentist"]
[null,460770172,1699030817,"MATTHEW J MAKUTA","536 STATE ROUTE 93 HWY","SUGARLOAF","PA",18249,"DENTAL","General Dentist"]
[null,"061133812",1346926607,"MORGAN E RITCHIE","2675 WHITNEY AVE","HAMDEN","CT","06518","DENTAL","General Dentist"]
[null,274560315,1639345358,"JOSEPH  MIKOLAJEWSKI","7258 CASTOR AVE","PHILADELPHIA","PA",19149,"DENTAL","General Dentist"]
[null,852090057,1770751570,"BOBBI M LARKIN","7 HOPEWELL RD","WILLIAMSPORT","MD",21795,"DENTAL","General Dentist"]
[null,582453481,1942218912,"NINA C LETT","1790 PRESIDENTIAL CIR STE B","SNELLVILLE","GA",30078,"DENTAL","General Dentist"]
[null,"043744703",1811901945,"ERIN L WHITTAKER","11 W COOKE RD","COLUMBUS","OH",43214,"DENTAL","General Dentist"]
[null,993009008,1417680414,"DANNY  ACHEK","801 UPLAND AVE APT B","CHESTER","PA",19013,"DENTAL","General Dentist"]
[null,812569715,1043995863,"SHANSHAN  SUN","870 N US HIGHWAY 27 STE A","LADY LAKE","FL",32159,"DENTAL","General Dentist"]
[null,"043246232",1366708729,"THOMAS J BOWER","323 S MAIN ST","BRADFORD","MA","01835","DENTAL","General Dentist"]
[null,593097305,1952341018,"RICHARD A ASSING","724 LITHIA PINECREST RD","BRANDON","FL",33511,"DENTAL","General Dentist"]
[null,451266532,1073297685,"SHELBY A NUGENT","119 PAVILION DR","LITTLE RIVER","SC",29566,"DENTAL","General Dentist"]
[null,471296904,1720215379,"HENDRICK B TAFO-TABUE","9200 FOREST HILL AVE STE C5","RICHMOND","VA",23235,"DENTAL","General Dentist"]
[null,204508246,1962505875,"DAVID H CHUNG","6885 ALIANTE PKWY STE 111","NORTH LAS VEGAS","NV",89084,"DENTAL","General Dentist"]
[null,621562334,1184805731,"MARVIN C KOONCE","603 N MAIN ST","SHELBYVILLE","TN",37160,"DENTAL","General Dentist"]
[null,571121967,1518940980,"TRISTAN H GREENWALT","5 PROFESSIONAL VILLAGE CIR","BEAUFORT","SC",29907,"DENTAL","General Dentist"]
[null,822272495,1689798555,"CHIAWEI  WU","5650 ROUTE 42","BLACKWOOD","NJ","08012","DENTAL","General Dentist"]
[null,232460694,1578646097,"MATTHEW T HENNY","11A MEADOW LN","LANCASTER","PA",17601,"DENTAL","General Dentist"]
[null,990452861,1316160575,"KEVIN K KO","3190 OLD TUNNEL RD","LAFAYETTE","CA",94549,"DENTAL","General Dentist"]
[null,862585639,1063901148,"ELIZABETH M JOYCE","299 HURLEY RD","COATESVILLE","PA",19320,"DENTAL","General Dentist"]
[null,201892280,1598886194,"MARTIN D SKRAPITS","616 WILLOW GROVE ST","HACKETTSTOWN","NJ","07840","DENTAL","General Dentist"]
[null,461421522,1558558387,"SCOTT STEVEN UPCHURCH","113 CONNETT ST","LEONARD","TX",75452,"DENTAL","General Dentist"]
[null,562185627,1700575701,"TAYLOR B MAST","1215 WEST GATE DR STE 180","LELAND","NC",28451,"DENTAL","General Dentist"]
[null,450537995,1467666271,"SHAMEEM A BHAM","328 N PHILADELPHIA BLVD","ABERDEEN","MD",21001,"DENTAL","General Dentist"]
[null,770639724,1265561807,"MELINDA R OQUIST","680 ALAMO PINTADO RD STE 201","SOLVANG","CA",93463,"DENTAL","General Dentist"]
[null,134334999,1659864460,"TIMOTHY A TURNER","14884 TAMIAMI TRL","NORTH PORT","FL",34287,"DENTAL","General Dentist"]
[null,461360035,1700929452,"DAVID J MONTGOMERY","915 OLD FERN HILL RD BLDG B Ste 302","WEST CHESTER","PA",19380,"DENTAL","General Dentist"]
[null,810878662,1083818777,"CHRISTOPHER D NGUYEN","363 GREEN ST","HAVRE DE GRACE","MD",21078,"DENTAL","General Dentist"]
[null,204573277,1528110384,"JORGE  OAXACA","805 CENTRAL AVE","SEAL BEACH","CA",90740,"DENTAL","General Dentist"]
[null,452546142,1902383557,"ANTHONY M CASTELLANO","2864 CLARK RD","SARASOTA","FL",34231,"DENTAL","General Dentist"]
[null,851291207,1497887897,"AMISH P PATEL","1 WHEATLEY BLVD","MULLICA HILL","NJ","08062","DENTAL","General Dentist"]
[null,273967683,1215112479,"TIMOTHY KARL ROENIGK","2471 S QUEEN ST","YORK","PA",17402,"DENTAL","General Dentist"]
[null,611852281,1013169523,"SHEILA  BENNETT","2520 E BURNSIDE ST","PORTLAND","OR",97214,"DENTAL","General Dentist"]
[null,761074808,1073023172,"JUNGSUK  SUH","1235 W VISTA WAY STE G","VISTA","CA",92083,"DENTAL","General Dentist"]
[null,204802207,1457363715,"THOMAS P RILEY","135 BERKELEY CIRCLE","SUMMERVILLE","SC",29483,"DENTAL","General Dentist"]
[null,825453136,1013071844,"RAHOOL  PATEL","540 2ND STREET PIKE","SOUTHAMPTON","PA",18966,"DENTAL","General Dentist"]
[null,205563826,1770759722,"JASON  COHEN","5530 WISCONSIN AVE STE 560","CHEVY CHASE","MD",20815,"DENTAL","General Dentist"]
[null,260384211,1821299157,"ANGELA M HALLER","8175 KENSINGTON DR STE A","WAXHAW","NC",28173,"DENTAL","General Dentist"]
[null,231365971,1982008959,"JONG RYUL  KIM","3223 N BROAD ST","PHILADELPHIA","PA",19140,"DENTAL","Endodontist"]
[null,680658671,1124130216,"A BRITTON DOLLY","2854 NORTHWESTERN PIKE","CAPON BRIDGE","WV",26711,"DENTAL","General Dentist"]
[null,455402141,1356351878,"DANIEL M BARTON","1000 FIRST COLONIAL RD STE 104","VIRGINIA BEACH","VA",23454,"DENTAL","General Dentist"]
[null,453783612,1073635934,"HUNTER L CHARVET","2300 VETERANS MEMORIAL BLVD","METAIRIE","LA",70002,"DENTAL","General Dentist"]
[null,261535608,1679773188,"MARIANO A POLACK","7431 NEW LINTON HALL RD","GAINESVILLE","VA",20155,"DENTAL","Prosthodontist"]
[null,473789672,1194090241,"ALEXANDRA L ARMSTRONG","2187 MAIN ST","BREWSTER","MA","02631","DENTAL","General Dentist"]
[null,834370146,1629507173,"ALISA  ZITTER","4 GLOCKER WAY","POTTSTOWN","PA",19465,"DENTAL","General Dentist"]
[null,832991224,1144672015,"MICHAEL F CAPUTO","6838 MADISON ST","NEW PORT RICHEY","FL",34652,"DENTAL","General Dentist"]
[null,822997132,1760644181,"TYLER D BURNINGHAM","907 HETHWOOD BLVD","BLACKSBURG","VA",24060,"DENTAL","General Dentist"]
[null,570788902,1326166075,"SHANNON C HUDSON","3369 PELHAM RD","GREENVILLE","SC",29615,"DENTAL","General Dentist"]
[null,592896805,1467093179,"MICHELLE  DULGAR","540 FIELDCREST DR","LADY LAKE","FL",32162,"DENTAL","General Dentist"]
[null,851291207,1023431004,"THEODORE G BELL","1 WHEATLEY BLVD","MULLICA HILL","NJ","08062","DENTAL","General Dentist"]
[null,813793901,1790100303,"CHRISTOPHER A BARTA","501 LIBBIE AVE","RICHMOND","VA",23226,"DENTAL","General Dentist"]
[null,522005525,1962527788,"GORDON C HONIG","2707 KIRKWOOD HWY","NEWARK","DE",19711,"DENTAL","Orthodontist"]
[null,202094369,1255458758,"ANTHONY C SARAZIN","1550 W QUINCY ST","HANCOCK","MI",49930,"DENTAL","General Dentist"]
[null,571112922,1750457222,"KEVIN M RAINES","139 WHITEFORD WAY","LEXINGTON","SC",29072,"DENTAL","Pediatric Dentist"]
[null,881471808,1679871511,"AMANDA M KLAYUM","1260 BROADCASTING RD STE 100","WYOMISSING","PA",19610,"DENTAL","General Dentist"]
[null,200497354,1174666978,"DAVID ALLAN HORN","1515 SE LUCKHARDT ST","STUART","FL",34994,"DENTAL","General Dentist"]
[null,853206983,1255686440,"STEPHANIE  STEPHENS","222 WILLOW VALLEY LAKES DR STE 1400","WILLOW STREET","PA",17584,"DENTAL","General Dentist"]
[null,521256741,1053561225,"TRACY DIAMOND STEIN","20 CROSSROADS DR STE 110","OWINGS MILLS","MD",21117,"DENTAL","General Dentist"]
[null,454030401,1568575330,"RANDALL C SNOW","6100 FAIRVIEW RD STE 610","CHARLOTTE","NC",28210,"DENTAL","General Dentist"]
[null,113642525,1104312107,"ASHLEY  O'BRIEN","760 W SPROUL RD STE 100","SPRINGFIELD","PA",19064,"DENTAL","General Dentist"]
[null,460904940,1477873560,"EDWARD W ARNETTE","509 N MAIN ST","KERNERSVILLE","NC",27284,"DENTAL","General Dentist"]
[null,203296691,1326591181,"JILLIAN  SPRING","2675 E CUMBERLAND ST","PHILADELPHIA","PA",19125,"DENTAL","General Dentist"]
[null,900003639,1962074377,"THIRUPATHI  BANDA","3435 BOX HILL CORPORATE CENTER DR STE E","ABINGDON","MD",21009,"DENTAL","General Dentist"]
[null,742777347,1487744207,"JEFFERY  GERHARDT","3415 EL SALIDO PKWY STE A","CEDAR PARK","TX",78613,"DENTAL","General Dentist"]
[null,475075728,1417106774,"EYAL  SIMCHI","301 RIVERFRONT BLVD STE 2","ELMWOOD PARK","NJ","07407","DENTAL","Pediatric Dentist"]
[null,873030407,1457515298,"MARY  ANDERSON","5036 DORSEY HALL DR STE 105","ELLICOTT CITY","MD",21042,"DENTAL","General Dentist"]
[null,263574613,1225285307,"LESLIE J FINA","746 JESSIE DUPONT MEM HWY","BURGESS","VA",22432,"DENTAL","General Dentist"]
[null,852234982,1720573090,"CHRISTIAN J ALEGRIA","3320 SISKEY PKWY STE 100","MATTHEWS","NC",28105,"DENTAL","General Dentist"]
[null,232762853,1497719967,"MATTHEW F MILANO","2002 SPROUL RD STE 302","BROOMALL","PA",19008,"DENTAL","General Dentist"]
[null,843252479,1588191787,"MILAN VINOD DHANANI","6798 OAK HALL LN STE A1","COLUMBIA","MD",21045,"DENTAL","Oral Surgeon"]
[null,222135466,1588751580,"CHARLES J PERRUZZI","88 W RIDGEWOOD AVE","RIDGEWOOD","NJ","07450","DENTAL","General Dentist"]
[null,364956847,1851348585,"GERARDO  SANTIAGO","3021 AIRPORT PULLING RD N STE 203","NAPLES","FL",34105,"DENTAL","General Dentist"]
[null,223894416,1528028735,"SHANNON  ALLISON","15 AVIEMORE DR","PINEHURST","NC",28374,"DENTAL","General Dentist"]
[null,233024574,1548490451,"LINDI  ORLIN","606 E MARSHALL ST STE 204","WEST CHESTER","PA",19380,"DENTAL","Endodontist"]
[null,274592809,1316688633,"JOUNG YUN CHOI","150 MACDADE BLVD STE G","DARBY","PA",19023,"DENTAL","General Dentist"]
[null,251916591,1306910427,"MARC  WERTHEIM","422 STATE ROUTE 18","EAST BRUNSWICK","NJ","08816","DENTAL","General Dentist"]
[null,820615771,1407585151,"CHRISTOPHER  PRIEST","42 HIGHLAND RD","BRIDGTON","ME","04009","DENTAL","General Dentist"]
[null,320582571,1831538669,"REBECCA LYNN WARNKEN","26908 FOGGY CREEK RD STE 101","WESLEY CHAPEL","FL",33544,"DENTAL","General Dentist"]
[null,870737559,1720062359,"RICHARD R RICCI","274 E BLUE HERON BLVD","RIVIERA BEACH","FL",33404,"DENTAL","General Dentist"]
[null,159464200,1144394412,"STEPHEN P PUDDU","221 E BROAD ST","TAMAQUA","PA",18252,"DENTAL","General Dentist"]
[null,872721505,1336283571,"JEREMY R WARD","2055 HAMILTON CRK PKWY #140","DACULA","GA",30019,"DENTAL","General Dentist"]
[null,561078938,1346814878,"ZACKERY E BUNN","109 BRENTWOOD CENTER LN N","WILSON","NC",27896,"DENTAL","General Dentist"]
[null,851554939,1588047955,"OMAR K CHAHBANDAR","1220 PONTIAC AVENUE SUITE 201","CRANSTON","RI","02920","DENTAL","General Dentist"]
[null,822536222,1871586800,"BRUCE D FINAGIN","21534 GREAT MILLS RD","LEXINGTON PARK","MD",20653,"DENTAL","Prosthodontist"]
[null,831836002,1336406677,"JOHN  MUNSEY","367 ROUTE 120 UNIT D","LEBANON","NH","03766","DENTAL","General Dentist"]
[null,411988781,1124152632,"KATIE M YODER","4131 26TH ST NW STE 1","ROCHESTER","MN",55901,"DENTAL","General Dentist"]
[null,473014799,1043560113,"LUKE A HARRIS","722 WENONAH AVE","PEARISBURG","VA",24134,"DENTAL","General Dentist"]
[null,593416483,1902073042,"KEVIN G SNYDER","6173 W GULF TO LAKE HWY","CRYSTAL RIVER","FL",34429,"DENTAL","General Dentist"]
[null,520595110,1104521343,"GABRIELLA  SUMMA","601 N CAROLINE ST","BALTIMORE","MD",21287,"DENTAL","General Dentist"]
[null,920441543,1760092787,"DAVID  MORABITO","200 FORBES ST STE 301","ANNAPOLIS","MD",21401,"DENTAL","General Dentist"]
[null,881224580,1447094420,"AHMEDI  BUSHRA","145 BRINTON LAKE RD STE 300","GLEN MILLS","PA",19342,"DENTAL","General Dentist"]
[null,200185918,1275739823,"YOAN  GARCIA","3311 DANIELS RD STE 108","WINTER GARDEN","FL",34787,"DENTAL","General Dentist"]
[null,843626319,1306868351,"BETTIE L ONGLEY","45693 HIGHWAY 27","DAVENPORT","FL",33897,"DENTAL","General Dentist"]
[null,871427935,1245645696,"ADARSH  MODANI","214 N CHESTER PIKE","GLENOLDEN","PA",19036,"DENTAL","General Dentist"]
[null,208847282,1689882052,"LISA A JOHNSON","6455 POST RD STE A","DUBLIN","OH",43016,"DENTAL","General Dentist"]
[null,582430949,1306931076,"SHARON R JORDAN","540 SAWNEE CORNERS BLVD","CUMMING","GA",30040,"DENTAL","General Dentist"]
[null,825118844,1689810210,"LEYLA A ABDULHAY","350 FRONT ST","ELMER","NJ","08318","DENTAL","General Dentist"]
[null,881224580,1093231425,"WALTER  HINMAN","1245 N PROVIDENCE ROAD","MEDIA","PA",19063,"DENTAL","General Dentist"]
[null,863342866,1962062349,"FRANCIS J DOLAN","720 JOHNSVILLE BLVD STE 1210","WARMINSTER","PA",18974,"DENTAL","General Dentist"]
[null,232525031,1063530343,"FRANK C PREZIOSO","301 OXFORD VALLEY RD","YARDLEY","PA",19067,"DENTAL","General Dentist"]
[null,463279591,1558511493,"MIGUEL A JUSINO","4933 TAMIAMI TRL N STE 100","NAPLES","FL",34103,"DENTAL","General Dentist"]
[null,204592436,1750475398,"DEIRDRE  CAMPBELL CATLIN","4447 CAMINO REAL WAY","FORT MYERS","FL",33966,"DENTAL","General Dentist"]
[null,464655553,1437561487,"JAMES R JENKINS","8600 SNOWDEN RIVER PKWY STE 302","COLUMBIA","MD",21045,"DENTAL","Pediatric Dentist"]
[null,465657589,1831300094,"KELLY M LINCOLN","24585 STONE CARVER DR STE 225","ALDIE","VA",20105,"DENTAL","General Dentist"]
[null,474364041,1730347600,"DANI E STANSELL","1911 FALLS VALLEY DR STE 107","RALEIGH","NC",27615,"DENTAL","General Dentist"]
[null,562115394,1548274269,"LISA  ADORNETTO","3861 BATTLEGROUND AVE","GREENSBORO","NC",27410,"DENTAL","General Dentist"]
[null,273764668,1952442667,"LINDSAY H MOORE","301 NORTH CHURCH ST","GEORGETOWN","SC",29440,"DENTAL","General Dentist"]
[null,830926850,1649679242,"GREGORY J MULLINS","1617 S CHURCH ST","SMITHFIELD","VA",23430,"DENTAL","General Dentist"]
[null,812208373,1356755474,"BRYAN  BRIGHT","196 EVEREST LN STE 1","SAINT JOHNS","FL",32259,"DENTAL","Pediatric Dentist"]
[null,233024574,1902947518,"KENNETH  LEE","665 EXTON CMNS","EXTON","PA",19341,"DENTAL","Endodontist"]
[null,815020830,1558678839,"HAL L COHEN","257 W UWCHLAN AVE STE B","DOWNINGTOWN","PA",19335,"DENTAL","General Dentist"]
[null,263091158,1922204031,"LESLIE  MCGUINN DAVIS","360 DAHLONEGA ST","CUMMING","GA",30040,"DENTAL","General Dentist"]
[null,300023395,1578660494,"DAVID E HARMAN","14 S MAIN ST","PETERSBURG","WV",26847,"DENTAL","General Dentist"]
[null,232708126,1881439677,"ZACHARY  KULLIVER","8566 BUSTLETON AVE","PHILADELPHIA","PA",19152,"DENTAL","General Dentist"]
[null,990826953,1336450816,"LUKE R PETERSEN","212 AINSLEY AVE","HERTFORD","NC",27944,"DENTAL","General Dentist"]
[null,221942214,1174546311,"GARY B BUDMAN","26 WEST BROAD ST","PAULSBORO","NJ","08066","DENTAL","General Dentist"]
[null,364271142,1689880445,"MICHELE S ARNOLD","10 W PHILLIP RD STE 105","VERNON HILLS","IL",60061,"DENTAL","General Dentist"]
[null,862863877,1609233105,"CHRISTINE M CHAN","7595 E MCDONALD DR STE 110","SCOTTSDALE","AZ",85250,"DENTAL","General Dentist"]
[null,205960793,1457342586,"BRIAN S KRUGER","2788 N MOUNT JULIET RD","MOUNT JULIET","TN",37122,"DENTAL","General Dentist"]
[null,222370427,1831281179,"ROBERT B ULLMANN","312 WARREN AVE","HO HO KUS","NJ","07423","DENTAL","Prosthodontist"]
[null,475214363,1083751911,"JUSTIN  RUFFNER","10 CANNON HILL RD PO BOX 700","SOUTH WELLFLEET","MA","02663","DENTAL","General Dentist"]
[null,273254285,1578942116,"THOMAS  LLOYD","2571 CAMPUS DR","KLAMATH FALLS","OR",97601,"DENTAL","General Dentist"]
[null,934625334,1861474298,"JEMIN  LEE","7380 SPOUT SPRINGS RD Suite 120","FLOWERY BRANCH","GA",30542,"DENTAL","General Dentist"]
[null,463279591,1528222130,"DAVID M GULOTTE","27821 S TAMIAMI TRL STE 1","BONITA SPRINGS","FL",34134,"DENTAL","General Dentist"]
[null,843741387,1891921110,"GREGORY A PETTE","706 SW PINE ISLAND RD STE 103","CAPE CORAL","FL",33991,"DENTAL","Periodontist"]
[null,854127004,1710488150,"MICHAEL A NASR","38 BRIDGE ST BLDG A","METUCHEN","NJ","08840","DENTAL","General Dentist"]
[null,272398024,1578725222,"DAWNE E ADAMS","8196 WCR 13 STE 10","FIRESTONE","CO",80504,"DENTAL","General Dentist"]
[null,921438462,1760733000,"FERNANDO J PADRON","1665 EAGLE HARBOR PKWY","FLEMING ISLAND","FL",32003,"DENTAL","Prosthodontist"]
[null,920833073,1093844250,"MOON C CHA","414 CAPITOL TRL","NEWARK","DE",19711,"DENTAL","General Dentist"]
[null,200185918,1225505704,"FARAZ NABI MEMON","4607 COLLINA TER","CLERMONT","FL",34711,"DENTAL","General Dentist"]
[null,822059166,1861915480,"BRIELLE L LIRA","5725 WILLIAMS DRIVE SUITE 101","GEORGETOWN","TX",78633,"DENTAL","General Dentist"]
[null,222192716,1841315728,"OLUWAKEMI R ODUTAYO","121 WHITE HORSE PIKE","CLEMENTON","NJ","08021","DENTAL","General Dentist"]
[null,203497479,1215051958,"DINESH S TEWARI","4244 FERNE BLVD","DREXEL HILL","PA",19026,"DENTAL","General Dentist"]
[null,881224580,1598883969,"RONALD S GOLDENBERG","145 BRINTON LAKE RD STE 300","GLEN MILLS","PA",19342,"DENTAL","General Dentist"]
[null,222323270,1790900082,"THOMAS W REINHARD","130 WHIPPANY RD","WHIPPANY","NJ","07981","DENTAL","General Dentist"]
[null,814812718,1245611342,"SEBASTIEN PAUL MURPHY","13474 ATLANTIC BLVD STE 109","JACKSONVILLE","FL",32225,"DENTAL","General Dentist"]
[null,650467880,1538214945,"ANTHONY  DELUCIA","731 COLORADO AVE","STUART","FL",34994,"DENTAL","General Dentist"]
[null,474461607,1902034903,"DAVID B LATHAM","960 CIPRIANA DR UNIT B6","MYRTLE BEACH","SC",29572,"DENTAL","General Dentist"]
[null,208648803,1356542278,"MICHAEL  SPANGLER","3234 REYNOLDA RD","WINSTON SALEM","NC",27106,"DENTAL","General Dentist"]
[null,"060920912",1487131157,"RADHEE  SHETH","79A NORWICH AVE","COLCHESTER","CT","06415","DENTAL","General Dentist"]
[null,202094369,1982710802,"RONALD J FISHER","1550 W QUINCY ST","HANCOCK","MI",49930,"DENTAL","General Dentist"]
[null,841908657,1750888970,"KAITLIN TEAL DONOVAN","5484 LORKEY LANE STE 101","VIERA","FL",32940,"DENTAL","General Dentist"]
[null,202901636,1245447945,"DAVID Q LE","44345 PREMIER PLZ STE 230","ASHBURN","VA",20147,"DENTAL","General Dentist"]
[null,593301781,1669511598,"SHAUN G ABOLVERDI","6320 SW 13TH ST","GAINESVILLE","FL",32608,"DENTAL","General Dentist"]
[null,263866723,1245365543,"KAYODE  ONANUGA","6400 BALTIMORE NATIONAL PIKE STE 260B","BALTIMORE","MD",21228,"DENTAL","General Dentist"]
[null,571097954,1942360482,"ROBERT D LAZAROFF","3017 NEWCASTLE LOOP","MYRTLE BEACH","SC",29588,"DENTAL","General Dentist"]
[null,232690496,1447378039,"STEVEN C BUNTING","3443 HUNTINGDON PIKE","HUNTINGDON VALLEY","PA",19006,"DENTAL","General Dentist"]
[null,473179694,1811930845,"DAVID  ROSANIA","185 COTTAGE ST","PORTSMOUTH","NH","03801","DENTAL","Periodontist"]
[null,200185918,1487336111,"AKAANKSHA  BHATIA","276 BUENA VISTA BLVD","THE VILLAGES","FL",32162,"DENTAL","General Dentist"]
[null,813233580,1902298649,"MYUNG-HYUN  BAE","1 GOLDEN HILL ST","MILFORD","CT","06460","DENTAL","General Dentist"]
[null,931303535,1700291572,"NATHAN N LEE","14689 SE SUNNYSIDE RD STE A","HAPPY VALLEY","OR",97086,"DENTAL","General Dentist"]
[null,223558846,1265759476,"RAHA  GHAFURIAN","200 WHITE RD STE 113","LITTLE SILVER","NJ","07739","DENTAL","Pediatric Dentist"]
[null,541387764,1437315702,"JASON I MARGOLIS","3229 BRANDON AVE SW","ROANOKE","VA",24018,"DENTAL","Oral Surgeon"]
[null,471046481,1225169998,"KRISTIN  NYLEN","15 BRONSON ST","OSWEGO","NY",13126,"DENTAL","General Dentist"]
[null,200185918,1225604754,"RANDY  MEJIAS","327 S AVALON PARK BLVD","ORLANDO","FL",32828,"DENTAL","General Dentist"]
[null,263030279,1194749317,"ANTONIO  LOPEZ","2000 CLEMENTS BRIDGE RD STE 117 A","DEPTFORD","NJ","08096","DENTAL","General Dentist"]
[null,621013993,1275796203,"MATTHEW S HART","1603 ROSEWOOD DR","COLUMBIA","TN",38401,"DENTAL","General Dentist"]
[null,862339513,1497985881,"JOCELYN  JEFFRIES","1029 SYCAMORE AVE","TINTON FALLS","NJ","07724","DENTAL","Pediatric Dentist"]
[null,200185918,1710430079,"IGOR  BILOV","5935 LAKEWOOD RANCH BLVD","BRADENTON","FL",34211,"DENTAL","General Dentist"]
[null,872431692,1922211812,"THOMAS  NOONE","219 W HAMILTON AVE","MYERSTOWN","PA",17067,"DENTAL","General Dentist"]
[null,201594846,1689102030,"JENNALEE  DICICCO","1500 JOHN F KENNEDY BLVD STE 300","PHILADELPHIA","PA",19102,"DENTAL","General Dentist"]
[null,208920774,1588396832,"NATHAN  HETRICK","1929 W STATE HIGHWAY 46 STE 102","NEW BRAUNFELS","TX",78132,"DENTAL","General Dentist"]
[null,200000844,1316026669,"PHILIP K CLARK","1590 ISLAND LN STE 12","FLEMING ISLAND","FL",32003,"DENTAL","General Dentist"]
[null,453083069,1245479666,"TAKEISHA R PRESSON","220 I STREET NE STE 100","WASHINGTON","DC",20002,"DENTAL","General Dentist"]
[null,541378845,1720298128,"LLOYD F MOSS JR","1808 PRINCESS ANNE ST STE 100","FREDERICKSBURG","VA",22401,"DENTAL","General Dentist"]
[null,815282711,1710046453,"BRUCE B WRIGHT","18912 JOHN J WILLIAMS HWY","REHOBOTH BEACH","DE",19971,"DENTAL","General Dentist"]
[null,231903489,1114135589,"DAVID B BLOCK","632 MONTGOMERY AVE STE 2","NARBERTH","PA",19072,"DENTAL","General Dentist"]
[null,862675808,1194354712,"AESHA  AMIN","818 KOHL AVE # 820","MIDDLETOWN","DE",19709,"DENTAL","General Dentist"]
[null,522109324,1063590487,"ROBERT S HERMAN","4425 MONTGOMERY AVE","BETHESDA","MD",20814,"DENTAL","General Dentist"]
[null,822272495,1568655397,"JONATHAN S HILL","214 NEW RD","LINWOOD","NJ","08221","DENTAL","General Dentist"]
[null,451266532,1538137716,"THOMAS D FLANDERS","11890 HIGHWAY 707","MURRELLS INLET","SC",29576,"DENTAL","General Dentist"]
[null,200185918,1447886437,"ANELISSE  RIVERA-VELEZ","5837 SEVEN MILE DR","WILDWOOD","FL",34785,"DENTAL","General Dentist"]
[null,843694738,1952354045,"JOHN G MCROBERTS","875 OLD CLEMSON HWY","SENECA","SC",29672,"DENTAL","General Dentist"]
[null,223382270,1528137783,"MICHAEL  VANARIA","159 DELAWARE ST","WOODBURY","NJ","08096","DENTAL","General Dentist"]
[null,474467481,1407239775,"JARED P TAVERNIER","321 N CAMBRIDGE ST","NINETY-SIX","SC",29666,"DENTAL","General Dentist"]
[null,261545477,"NULL","PETER PAUL PATELLIS","32895 COASTAL HWY UNT 102","BETHANY BEACH","DE",19930,"DENTAL","General Dentist"]
[null,651104572,1689717241,"RICHARD D SANDERFORD","10551 SIX MILE CYPRESS PKWY","FORT MYERS","FL",33966,"DENTAL","General Dentist"]
[null,311013942,1669211678,"RAMON E DURAN LOPEZ","230 MARKET ST","NEW CASTLE","VA",24127,"DENTAL","General Dentist"]
[null,922657631,1457649683,"TARAKESWAR R VONGURU","1178 PARKER ST","SPRINGFIELD","MA","01129","DENTAL","General Dentist"]
[null,842053038,1366512865,"EMILY D HAMMES","133 TRAVELERS BLVD","WEST UNION","SC",29696,"DENTAL","General Dentist"]
[null,872243222,1740636166,"RICKY  PATEL","8701 KNOX BRIDGE HWY","CANTON","GA",30114,"DENTAL","General Dentist"]
[null,273976095,1134240096,"MELVIN  EATON","1721 FLAGLER AVE","KEY WEST","FL",33040,"DENTAL","General Dentist"]
[null,832460760,1689793101,"KENNETH M BLACK","988 OCEAN HWY W","SUPPLY","NC",28462,"DENTAL","General Dentist"]
[null,261150518,1669735718,"JOSHUA R ALTER","7 DAVIS AVE","BROOMALL","PA",19008,"DENTAL","General Dentist"]
[null,832601748,1669099834,"TAYLOR J ZOLLINGER","3022 E 57TH AVE STE 10","SPOKANE","WA",99223,"DENTAL","General Dentist"]
[null,464802628,1669106548,"CANDACE  COOK","164 BLUFFTON RD","BLUFFTON","SC",29910,"DENTAL","Pediatric Dentist"]
[null,202077879,1821006222,"JOE L GRIFFIN","2214 W PALMETTO ST","FLORENCE","SC",29501,"DENTAL","General Dentist"]
[null,450891428,1437261195,"TODD C ALEXANDER","2005 E STATE ST","HERMITAGE","PA",16148,"DENTAL","General Dentist"]
[null,272984902,1285675470,"JEFFREY  ALVARADO","3103 CENTER POINTE DRIVE","EDINBURG","TX",78539,"DENTAL","General Dentist"]
[null,843773453,1700917978,"UPINDER  DHILLON","200 E JIMMIE LEEDS RD","GALLOWAY","NJ","08205","DENTAL","General Dentist"]
[null,883332336,1275670424,"PETER N MASTERSON","6270 LAKE OSPREY DR","SARASOTA","FL",34240,"DENTAL","General Dentist"]
[null,273764920,1710191697,"MARIA H BARBOZA","275 WILMINGTON W CHESTER PIKE STE 111","CHADDS FORD","PA",19317,"DENTAL","General Dentist"]
[null,371421156,1710098314,"DANIEL C DEESE","24370 US HIGHWAY 98","FAIRHOPE","AL",36532,"DENTAL","General Dentist"]
[null,454395247,1740550649,"ASHLEY R BROWN","5809 NICHOLSON LN STE T123","NORTH BETHESDA","MD",20852,"DENTAL","General Dentist"]
[null,822956187,1780787119,"TIMOTHY  LEWIS","501 CLINIC RD","HANNIBAL","MO",63401,"DENTAL","General Dentist"]
[null,631158417,1376707869,"DALE E ALLEN","7898 MADISON PIKE","MADISON","AL",35758,"DENTAL","General Dentist"]
[null,843645344,1033992219,"JOLENE JIAXIN ZHENG","750 S POTOMAC ST","WAYNESBORO","PA",17268,"DENTAL","General Dentist"]
[null,202029791,1487680492,"JOSEPH M LARSEN","9000 N ORACLE RD STE 202","TUCSON","AZ",85704,"DENTAL","General Dentist"]
[null,820523495,1578991931,"ELISE H FRANKLIN","150 EAST BOISE AVE","BOISE","ID",83706,"DENTAL","General Dentist"]
[null,920833073,1285753145,"ANNE P ANNONE","414 CAPITOL TRL","NEWARK","DE",19711,"DENTAL","General Dentist"]
[null,571110780,1215615638,"JESSE  KNOWLTON","2590 TAHOE DR","SUMTER","SC",29150,"DENTAL","General Dentist"]
[null,474334095,1790089860,"DAVID CRESTON JACKSON","900 SE OCEAN BLVD STE 110B","STUART","FL",34994,"DENTAL","General Dentist"]
[null,454614697,1356302228,"CHRISTOPHER J KERR","55 NE FAIRGROUNDS RD STE 104","BREMERTON","WA",98311,"DENTAL","General Dentist"]
[null,592931812,1164500278,"STEPHEN H DUNN","7555 SW HIGHWAY 200 STE A","OCALA","FL",34476,"DENTAL","General Dentist"]
[null,812537521,1356438048,"MICHAEL  BELDER","1501 OLD YORK RD","ABINGTON","PA",19001,"DENTAL","General Dentist"]
[null,412178409,1104266824,"TRAVIS E PERRY","1180 W BALTIMORE PIKE","MEDIA","PA",19063,"DENTAL","General Dentist"]
[null,463091708,1588877054,"BRIAN KIYOSHI SHIMIZU","5512 E BRITTON DR STE 208","LONG BEACH","CA",90815,"DENTAL","General Dentist"]
[null,273803146,1467516385,"GARY L KIMBERLIN","67 BRUMBAUGH AVE","CHAMBERSBURG","PA",17201,"DENTAL","General Dentist"]
[null,274967652,1740302389,"MATTHEW M BALLINGER","200 ELM STREET LOWER SUITE","PITTSFIELD","MA","01201","DENTAL","General Dentist"]
[null,232587054,1881720704,"MARK G RADOMILE","4207 STATE RD","DREXEL HILL","PA",19026,"DENTAL","General Dentist"]
[null,270234913,1124012141,"MARK P PCOLINSKY","6807 KNIGHTDALE BLVD STE E","KNIGHTDALE","NC",27545,"DENTAL","General Dentist"]
[null,862565288,1932895620,"MINTRA CANDY THUNTARUG","600 PENNSYLVANIA AVE SE","WASHINGTON","DC",20003,"DENTAL","General Dentist"]
[null,201932570,1831378686,"BRENT R HUMPHREY","103 SPRINGHALL DR","GOOSE CREEK","SC",29445,"DENTAL","Pediatric Dentist"]
[null,731169046,1912080490,"FLOYD  SIMON","501 S 30TH ST","CLINTON","OK",73601,"DENTAL","General Dentist"]
[null,232815882,1013031020,"WILLIAM R GILKEY","6 ORIOLE AVE","MEDIA","PA",19063,"DENTAL","General Dentist"]
[null,"030303826",1245254770,"KEVIN F BROWN","2 SPRING ST","SWANTON","VT","05488","DENTAL","General Dentist"]
[null,510196935,1922194299,"MARK D NEWMAN","9159 FRANKTOWN RD","FRANKTOWN","VA",23354,"DENTAL","General Dentist"]
[null,201990392,1407868177,"BENJAMIN C ANDERSON","210 MEADOW VIEW BLVD","SUFFOLK","VA",23435,"DENTAL","General Dentist"]
[null,851092826,1669163648,"MORGAN W JACKSON","4622 COUNTRY CLUB RD STE 280","WINSTON SALEM","NC",27104,"DENTAL","General Dentist"]
[null,594458791,1386375988,"NOAH  BARNES","3961 SPANISH TRL","PENSACOLA","FL",32504,"DENTAL","General Dentist"]
[null,562379964,1922476910,"PHILLIP L COKER","804 W MAIN ST","LAKE CITY","SC",29560,"DENTAL","General Dentist"]
[null,452150220,1942465323,"ANN E ZOLEDZ-HESS","801 W LANCASTER AVE STE 2","DOWNINGTOWN","PA",19335,"DENTAL","General Dentist"]
[null,873773257,1568134674,"YEMISI H AKPOBIO","10084 REISTERSTOWN RD STE 200E","OWINGS MILLS","MD",21117,"DENTAL","General Dentist"]
[null,"030609351",1104970615,"SANJAY P BHAGCHANDANI","5318 B PATTERSON AVE","RICHMOND","VA",23226,"DENTAL","Endodontist"]
[null,473026714,1063661403,"JASON L KIGGINS","1070 HWY 501 BUSINESS","CONWAY","SC",29526,"DENTAL","General Dentist"]
[null,593350933,1831310101,"MANMOHAN  BATTA","4250 W TOWN CENTER BLVD","ORLANDO","FL",32837,"DENTAL","General Dentist"]
[null,881224580,1952429334,"ANDREW J GOLDENBERG","1 W WOODLAND AVE","SPRINGFIELD","PA",19064,"DENTAL","General Dentist"]
[null,133797774,1023140225,"LAWRENCE E BRECHT","275 MADISON AVE STE 2900","NEW YORK","NY",10016,"DENTAL","Prosthodontist"]
[null,232807796,1275676454,"NAJIBE  DOW","3111 WEST CHESTER PIKE","NEWTOWN SQUARE","PA",19073,"DENTAL","General Dentist"]
[null,841671810,1407987084,"MICHAEL S WU","10795 S BLANEY AVE","CUPERTINO","CA",95014,"DENTAL","General Dentist"]
[null,810566834,1073737789,"JAMIE A RAMSAY","150 BURNETTS WAY STE 300B","SUFFOLK","VA",23434,"DENTAL","General Dentist"]
[null,833280442,1154747095,"ALI H ISMAIL","8701 N SHELDON RD","CANTON","MI",48187,"DENTAL","General Dentist"]
[null,862847947,1073785424,"GREGORY S MOFFITT","101 SAINT CLAIRE PL STE 102","STEVENSVILLE","MD",21666,"DENTAL","General Dentist"]
[null,464086342,1114542727,"DAKOTA J PEACHEE","8066 MARKET ST STE A","WILMINGTON","NC",28411,"DENTAL","General Dentist"]
[null,873154623,1699093351,"JOHN  POWE","110 REGENT CT STE 100","STATE COLLEGE","PA",16801,"DENTAL","Periodontist"]
[null,204711056,1790538155,"ALVIN  CHEN","1702 LOVERING AVE","WILMINGTON","DE",19806,"DENTAL","General Dentist"]
[null,232815882,1538848189,"VICTORIA  GALENAS","1000 EASTON RD","WYNCOTE","PA",19095,"DENTAL","General Dentist"]
[null,822277539,1629417852,"COLE  SMITH","708 PECAN ST","BASTROP","TX",78602,"DENTAL","General Dentist"]
[null,223239711,1255999462,"KUNAL  SACHANANDANI","4301 NEW JERSEY AVE","WILDWOOD","NJ","08260","DENTAL","General Dentist"]
[null,923717047,1215128343,"ALLA A SHRAGER","136 E S MAIN ST","LITTLETON","NC",27850,"DENTAL","Orthodontist"]
[null,464889600,1073604179,"ROBERT LEE KLUSS","32282 CAMINO CAPISTRANO","SAN JUAN CAPISTRANO","CA",92675,"DENTAL","General Dentist"]
[null,870820168,1083766091,"NANDITHA J VIVEKANANTHAN","3651 GREEN LEVEL WEST RD STE 202","APEX","NC",27523,"DENTAL","General Dentist"]
[null,473766090,1619128527,"SINDHU  GUNDABATHULA","3425 LIMEKILN PIKE STE 5","CHALFONT","PA",18914,"DENTAL","General Dentist"]
[null,472538503,1023405305,"GRACE E KIM","17 N MAIN ST","SMYRNA","DE",19977,"DENTAL","General Dentist"]
[null,270234913,1124012141,"MARK P PCOLINSKY","7124 KNIGHTDALE BLVD","KNIGHTDALE","NC",27545,"DENTAL","General Dentist"]
[null,825499609,1881842656,"MICHAEL G SCHUT","904 SPIVEY RD","WHITEVILLE","NC",28472,"DENTAL","General Dentist"]
[null,330940574,1225133127,"JASON R BROWN","306 WALNUT AVE STE 24","SAN DIEGO","CA",92103,"DENTAL","General Dentist"]
[null,822272495,1336822493,"AMR  ABDALLA","63 N LAKEVIEW DR STE 101","GIBBSBORO","NJ","08026","DENTAL","General Dentist"]
[null,811826349,1619052255,"AARON  WELLBORN","308 E CROSSROADS BLVD","SARATOGA SPRINGS","UT",84045,"DENTAL","General Dentist"]
[null,331972533,1134230246,"JENNIFER J KUNA","3303 S WW WHITE RD","SAN ANTONIO","TX",78222,"DENTAL","General Dentist"]
[null,861017364,1649270414,"DAVID G SPALDING","7518 N LA CHOLLA BLVD","TUCSON","AZ",85741,"DENTAL","General Dentist"]
[null,263020975,1255351292,"ERIC A FORT","403 N 5 POINTS RD","WEST CHESTER","PA",19380,"DENTAL","General Dentist"]
[null,843576281,1245433986,"NORA E BARBER","7535 CARPENTER FIRE STATION RD STE 201","CARY","NC",27519,"DENTAL","General Dentist"]
[null,"061672117",1962542852,"F.H.  COLLINS","5744 CANTON CV","WINTER SPRINGS","FL",32708,"DENTAL","General Dentist"]
[null,851704445,1790126795,"LAURIE A RODIO","2133 INDIAN ROCKS RD S","LARGO","FL",33774,"DENTAL","General Dentist"]
[null,465342063,1457615403,"JONATHAN D BISHOP","501 ANGLERS DR STE 102","STEAMBOAT SPRINGS","CO",80487,"DENTAL","General Dentist"]
[null,952773551,1093059123,"MARTIN  ROVIRA","1401 AVOCADO AVE STE 404","NEWPORT BEACH","CA",92660,"DENTAL","General Dentist"]
[null,462320412,1275820532,"LINDSEY A GEORGE","261 MAIN ST PO BOX H","CLAYSVILLE","PA",15323,"DENTAL","General Dentist"]
[null,834447082,1326474230,"ERIN B JOHNSON","300 S LOGAN ST SUITE 103","DENVER","CO",80209,"DENTAL","General Dentist"]
[null,934479894,1265952642,"MARTIN  DRUBI","15495 TAMIAMI TRL N STE 125","NAPLES","FL",34110,"DENTAL","General Dentist"]
[null,844057236,1699141119,"CHRISTIAN  ORTIZ","1740 US HWY 27 STORE 28","CLERMONT","FL",34714,"DENTAL","General Dentist"]
[null,825082822,1861875353,"ARIAN  HAMIDI","7190 TROY HILL DR STE 200","ELKRIDGE","MD",21075,"DENTAL","General Dentist"]
[null,271066396,1568634400,"HONGMEI  YANG","434 EXTON CMNS","EXTON","PA",19341,"DENTAL","General Dentist"]
[null,472415560,1730963562,"KELCIE  DOWNER","2560 BELL RD","MONTGOMERY","AL",36117,"DENTAL","General Dentist"]
[null,161692992,1073659413,"JOHN W WARREN","20 QUAIL RIDGE RD","HIRAM","GA",30141,"DENTAL","General Dentist"]
[null,932751188,1225635857,"KARAN  NADIG","7052 FRANKFORD AVE 56","PHILADELPHIA","PA",19135,"DENTAL","General Dentist"]
[null,474316619,1255788998,"ALEX  ROSNER","7847 OLD YORK RD 2ND FL","ELKINS PARK","PA",19027,"DENTAL","Orthodontist"]
[null,821824102,1356441455,"RICK L LEIBOLD","103 FITE WAY STE A","QUARRYVILLE","PA",17566,"DENTAL","General Dentist"]
[null,460895361,1841629045,"SWETHA  BUDDA","175 CROSS KEYS RD STE 101A","BERLIN","NJ","08009","DENTAL","General Dentist"]
[null,884194648,1912915810,"JERRY G BAYLIFF","441 S MORGAN ST","ROXBORO","NC",27573,"DENTAL","General Dentist"]
[null,455482092,1740406321,"LISA K JENSEN","7717 SW 34TH AVE","PORTLAND","OR",97219,"DENTAL","General Dentist"]
[null,271383787,1457447211,"ERIC W BAXMANN","15650 SAN CARLOS BLVD","FORT MYERS","FL",33908,"DENTAL","General Dentist"]
[null,862863877,1881029650,"JULIE  BENJAMIN","7595 E MCDONALD DR STE 110","SCOTTSDALE","AZ",85250,"DENTAL","General Dentist"]
[null,454020795,1447692231,"ALLISON P CALDWELL","1803-A AUGUSTA ST","GREENVILLE","SC",29605,"DENTAL","General Dentist"]
[null,273479017,1760653950,"ROBERT T BOHNENBERGER","523 N OAK AVE","ALDAN","PA",19018,"DENTAL","General Dentist"]
[null,432055285,1487036984,"CHAD  BROWNSBERGER","1630 ROUTE 322 STE A","SWEDESBORO","NJ","08085","DENTAL","Oral Surgeon"]
[null,231900762,1245242007,"JOHN W DEVER","815 MARTIN AVE","EPHRATA","PA",17522,"DENTAL","General Dentist"]
[null,262160462,1033324504,"ANNA  KOPIT","3420 WORTHINGTON BLVD STE A","FREDERICK","MD",21704,"DENTAL","General Dentist"]
[null,471657310,1679618375,"ATTY D SMITH","1840 E INNOVATION PARK DR","ORO VALLEY","AZ",85755,"DENTAL","General Dentist"]
[null,873513031,1255844924,"ALEX  GRUENBERG","2499 GLADES RD STE 208","BOCA RATON","FL",33431,"DENTAL","General Dentist"]
[null,881600158,1235392929,"JULIE A MOORE","6824 W GULF TO LAKE HWY","CRYSTAL RIVER","FL",34429,"DENTAL","General Dentist"]
[null,200185918,1720601628,"AMBER  MEDELLIN","9940 BELVEDERE RD STE A","ROYAL PALM BEACH","FL",33411,"DENTAL","General Dentist"]
[null,461341176,1366601247,"CHRISTOPHER S PAGE","4953 CASTELLO DR STE 100","NAPLES","FL",34103,"DENTAL","General Dentist"]
[null,881224580,1053876136,"JERRY  CHOI","1245 N PROVIDENCE ROAD","MEDIA","PA",19063,"DENTAL","General Dentist"]
[null,231995431,1952074767,"JOWHAR  BROWN","5629 VINE ST STE C9","PHILADELPHIA","PA",19139,"DENTAL","Pediatric Dentist"]
[null,474861416,1992796981,"ELIZABETH E DULING","6707 HIGHWAY 431 S STE 103","OWENS CROSS ROADS","AL",35763,"DENTAL","General Dentist"]
[null,201170108,1679850234,"RYAN M COOK","1122 HWY 86","PIEDMONT","SC",29673,"DENTAL","General Dentist"]
[null,831355317,1437533650,"RAMSEY G EDWARDS","66 N GARDEN AVE","SIERRA VISTA","AZ",85635,"DENTAL","General Dentist"]
[null,271145686,1881691251,"HERBERT B FRIEDMAN","8501 LASALLE RD SUITE 306","TOWSON","MD",21286,"DENTAL","General Dentist"]
[null,333518312,1447799028,"MEGAN  LARAWAY","613 DUTCHMANS LANE","EASTON","MD",21601,"DENTAL","Pediatric Dentist"]
[null,270679041,1093823023,"MELANIE  RABENI","45 RESNIK RD STE 102","PLYMOUTH","MA","02360","DENTAL","General Dentist"]
[null,823813275,1912690546,"JOSHUA  BOSTIC","231 PARKVIEW DR","MILLERSBURG","OH",44654,"DENTAL","General Dentist"]
[null,593348925,1275540593,"WILLIAM H MILLER","829 E OAK ST STE A","KISSIMMEE","FL",34744,"DENTAL","General Dentist"]
[null,392361648,1033956180,"BRYCE T BYMAN","643 CAPE CORAL PKWAY E Suite A","CAPE CORAL","FL",33904,"DENTAL","General Dentist"]
[null,205498134,1588891634,"SHAWN P WILSON","8695 COMMERCE DR STE 4","EASTON","MD",21601,"DENTAL","General Dentist"]
[null,820705624,1447329818,"SANTOSH K SAINI","13603 W CAMINO DEL SOL","SUN CITY WEST","AZ",85375,"DENTAL","General Dentist"]
[null,883732461,1356757462,"BRADLEY M ISOM","4329 BALL CAMP PIKE","KNOXVILLE","TN",37921,"DENTAL","General Dentist"]
[null,811318074,1396066544,"NANDHINI  BOGAVELLI","219 E MAIN ST STE 113","MECHANICSBURG","PA",17055,"DENTAL","General Dentist"]
[null,540923790,1043551823,"ROBERT L BINDA","1327 ROSSER AVE","WAYNESBORO","VA",22980,"DENTAL","General Dentist"]
[null,842720842,1730593856,"KATHRYN  CARNES PETERSON","2104 OLD SPARTANBURG RD","GREER","SC",29650,"DENTAL","General Dentist"]
[null,870911587,1992998033,"WILLIAM R MONACELL","14420 SOMMERVILLE CT","MIDLOTHIAN","VA",23113,"DENTAL","General Dentist"]
[null,208920479,1871541698,"PATRICK S BELL","400 DEL WEBB BLVD STE 104","GEORGETOWN","TX",78633,"DENTAL","General Dentist"]
[null,521229253,1932243581,"GREGORY A DIGIOVANNI","1920 ROCK SPRING RD STE 200","FOREST HILL","MD",21050,"DENTAL","General Dentist"]
[null,823711837,1710900204,"MARK C GLADNICK","5513 KIRKWOOD HWY","WILMINGTON","DE",19808,"DENTAL","General Dentist"]
[null,883574900,1013460740,"FRANK ALLEN LAGA II","6731 US HIGHWAY 98 N","LAKELAND","FL",33809,"DENTAL","General Dentist"]
[null,872070531,1275949760,"WIN  LEE","7122 RISING SUN AVE","PHILADELPHIA","PA",19111,"DENTAL","Pediatric Dentist"]
[null,593038968,1366512147,"BRENT C BEYER","1218 E VENICE AVE","VENICE","FL",34285,"DENTAL","General Dentist"]
[null,201380662,1235423740,"ERIC R HUNT","1040 DEKALB PIKE STE 100","BLUE BELL","PA",19422,"DENTAL","Pediatric Dentist"]
[null,811371348,1205145521,"VANI B PRABAKARAN","6210 SCOTT ST UNIT 114","PUNTA GORDA","FL",33950,"DENTAL","General Dentist"]
[null,232624793,1457531931,"THOMAS L CHERMOL","801 YALE AVE STE 518","SWARTHMORE","PA",19081,"DENTAL","General Dentist"]
[null,912180598,1184989998,"JASON D WIDNER","707 228TH AVE NE ST","SAMMAMISH","WA",98074,"DENTAL","General Dentist"]
[null,920812816,1811379100,"JENNIFER A LOVELAND","3015 MAPLEWOOD AVE","WINSTON SALEM","NC",27103,"DENTAL","General Dentist"]
[null,870930952,1326348335,"KAMBIZ  TAVAKKOLI","3 WASHINGTON CIR NW STE 306","WASHINGTON","DC",20037,"DENTAL","General Dentist"]
[null,510398102,1205914652,"BRUCE G FAY","685 E CHESTNUT HILL RD","NEWARK","DE",19713,"DENTAL","General Dentist"]
[null,621429072,1306854310,"DONNIE K DEAN","121 CAPITAL DR","KNOXVILLE","TN",37922,"DENTAL","General Dentist"]
[null,822059166,1386373025,"TIFFANY  NANTHAVONGDOUANGSY","5725 WILLIAMS DRIVE SUITE 101","GEORGETOWN","TX",78633,"DENTAL","General Dentist"]
[null,842195456,1912404708,"ZOE  KIKLIS CHRISTENSEN","77 SOUTH ST","GORHAM","ME","04038","DENTAL","General Dentist"]
[null,274937349,1861464125,"BRYAN G FOOTE","601 W NIFONG STE 4A","COLUMBIA","MO",65203,"DENTAL","General Dentist"]
[null,383505782,1831326883,"ROBIN O BERNARD","4320 ORCHARD LAKE RD","WEST BLOOMFIELD","MI",48323,"DENTAL","General Dentist"]
[null,462184700,1164685459,"RICHARD M DELVECCHIO","2204 SINGERLY RD","ELKTON","MD",21921,"DENTAL","General Dentist"]
[null,461594640,1528298379,"NILAY S PATEL","341 NEWBERRY ST NW","AIKEN","SC",29801,"DENTAL","General Dentist"]
[null,834717782,1245586882,"RONALD C WILLIAMS","744 W LANCASTER AVE STE 115","WAYNE","PA",19087,"DENTAL","General Dentist"]
[null,251889371,1003824962,"ROBERT B CRAMER","753 FISHBURN RD","HERSHEY","PA",17033,"DENTAL","Pediatric Dentist"]
[null,204255036,1649493669,"PERRY H FRAIMAN","18715 N REEMS RD STE 100","SURPRISE","AZ",85374,"DENTAL","Prosthodontist"]
[null,200238650,1063439610,"EDGARDO A GRANDE","1401 FORUM WAY STE 810","WEST PALM BEACH","FL",33401,"DENTAL","General Dentist"]
[null,223385978,1285722785,"DAVID  PODOLNICK","3957 BLACK HORSE PIKE","MAYS LANDING","NJ","08330","DENTAL","General Dentist"]
[null,462793799,1992033799,"ANTHONY C SMALLWOOD","4102 QUARLES CT","ROCKINGHAM","VA",22801,"DENTAL","General Dentist"]
[null,863627829,1306454848,"HUNTER M HAWKINS","303 S ARCHUSA AVE # B","QUITMAN","MS",39355,"DENTAL","General Dentist"]
[null,881224580,1083910350,"EDWARD S LITMAN","10101 ACADEMY RD FL 2","PHILADELPHIA","PA",19114,"DENTAL","General Dentist"]
[null,454993022,1558308395,"JUSTIN N ZUMSTEIN","80 PERSHING AVENUE","WAKEFIELD","RI","02879","DENTAL","General Dentist"]
[null,200120892,1467898601,"KAYNAZ J MYRUM","130 S STATE RD Suite 300","SPRINGFIELD","PA",19064,"DENTAL","Pediatric Dentist"]
[null,333031777,1083788350,"ROBERT L GIBSON","2303 N CORAL CANYON BLVD STE 202","WASHINGTON","UT",84780,"DENTAL","General Dentist"]
[null,232175092,1922640473,"ROBERT  ZALITCHI","845 EDGEWOOD RD","YORK","PA",17402,"DENTAL","General Dentist"]
[null,873016641,1417324161,"EDUARDO  CORTES-CONTRERAS","1 DOCTORS LN","LAKE WALES","FL",33853,"DENTAL","General Dentist"]
[null,593708502,1841341815,"TROY L KING","1390 CITY VIEW CTR","OVIEDO","FL",32765,"DENTAL","General Dentist"]
[null,592995490,1225258270,"KENNETH L STAUDT","944 BRIDGEWATER DR # 2B","PORT ORANGE","FL",32129,"DENTAL","General Dentist"]
[null,204841519,1770753295,"MARIA A FERMIN","2182 NE 123RD ST","NORTH MIAMI","FL",33181,"DENTAL","General Dentist"]
[null,921469853,1487222337,"PATRICK E DONNELLY","105 MEADOW SPRING RD","GREENSBURG","PA",15601,"DENTAL","General Dentist"]
[null,844882064,1235474685,"LIANGKAI  WENG","7696 DORCHESTER BLVD STE 1","HANOVER","MD",21076,"DENTAL","General Dentist"]
[null,821052246,1619663234,"PATRICE D QUADREL","2512 E VISTOSO COMMERCE LOOP","ORO VALLEY","AZ",85755,"DENTAL","General Dentist"]
[null,204136907,1710150156,"BARBARA A PIERANTOZZI MCCAUGHEY","2012 S TOLLGATE RD STE 108","BEL AIR","MD",21015,"DENTAL","General Dentist"]
[null,474755223,1407470578,"TIMOTHY M MCKINLEY","56 OFFICE PARK DR UNIT 100","JACKSONVILLE","NC",28546,"DENTAL","General Dentist"]
[null,800632928,1508096652,"ARCHANA  SHARMA","2 CAMPBELL ST","LEBANON","NH","03766","DENTAL","General Dentist"]
[null,320224403,1972035939,"SUMMER  CERAOLO-O'DONNELL","1134 N ROLLING RD","CATONSVILLE","MD",21228,"DENTAL","Pediatric Dentist"]
[null,320224403,1417076191,"RACHAEL L SIMON","1134 N ROLLING RD","CATONSVILLE","MD",21228,"DENTAL","Pediatric Dentist"]
[null,205390000,1255422515,"JAMES D ROPPA","5600 PORADA DR STE 101","VIERA","FL",32940,"DENTAL","General Dentist"]
[null,204022970,1356455034,"DIVYA Y SHETTY","1201 BARBARA JORDAN BLVD STE 1435","AUSTIN","TX",78723,"DENTAL","General Dentist"]
[null,208923970,1992924989,"KARSTEN  GRINDERSLEV","405 MAIN ST","LANDISVILLE","PA",17538,"DENTAL","General Dentist"]
[null,232708126,1689055030,"JENNIFER L KIM","6801 RIDGE AVE","PHILADELPHIA","PA",19128,"DENTAL","Pediatric Dentist"]
[null,721535493,1831454198,"MEGAN R SMITH MAGARGAL","1220 W CHESTER PIKE","HAVERTOWN","PA",19083,"DENTAL","Pediatric Dentist"]
[null,455166025,1588158372,"LOVIKA  KALRA","31 S EAGLE RD STE 100","HAVERTOWN","PA",19083,"DENTAL","Pediatric Dentist"]
[null,870930952,1194108696,"SUMEEN  MAUR","3 WASHINGTON CIR NW STE 306","WASHINGTON","DC",20037,"DENTAL","General Dentist"]
[null,854281974,1598782435,"LEE E OPPENHEIMER","23B SHELTER COVE LN STE 200","HILTON HEAD ISLAND","SC",29928,"DENTAL","Periodontist"]
[null,272878142,1659681559,"SEPTIMIU N PASTIU","400 GANTTOWN RD","SEWELL","NJ","08080","DENTAL","General Dentist"]
[null,582426214,1477164655,"SAMUEL P BRUNSON","9083-B OLD HWY 6","SANTEE","SC",29142,"DENTAL","General Dentist"]
[null,455522773,1114180106,"DAVID W BURDETTE","5429 HARDING HWY STE 101","MAYS LANDING","NJ","08330","DENTAL","General Dentist"]
[null,510562439,1356402499,"GREG C HANSEN","28318 DUPONT BLVD UNIT 1","MILLSBORO","DE",19966,"DENTAL","General Dentist"]
[null,455402141,1407934854,"MOLLIE H GIOFFRE","2129 GENERAL BOOTH BLVD STE 117","VIRGINIA BEACH","VA",23454,"DENTAL","General Dentist"]
[null,994872155,1922626498,"DOMINICK R DOLECKI","1900 TAMIAMI TRL","PUNTA GORDA","FL",33950,"DENTAL","General Dentist"]
[null,872543653,1124336227,"MATTHEW S BRYINGTON","37153 STATE ROAD 54","ZEPHYRHILLS","FL",33542,"DENTAL","General Dentist"]
[null,465715285,1629353768,"JUSTIN D SCHMIDT","1824 CASCADE AVE","HOOD RIVER","OR",97031,"DENTAL","General Dentist"]
[null,"030545809",1134398985,"ROGELIO X ESTRINGEL","1300 N TEXAS BLVD","ALICE","TX",78332,"DENTAL","General Dentist"]
[null,873016641,1417324161,"EDUARDO  CORTES-CONTRERAS","1 DOCTORS LN","LAKE WALES","FL",33853,"DENTAL","General Dentist"]
[null,222350719,1467502724,"PAUL L PASTERNACK","1 BRITTON PL STE 11","VOORHEES","NJ","08043","DENTAL","Pediatric Dentist"]
[null,475434669,1467140582,"RICHARD J MORRIS","10185 OCEAN HWY UNIT B","PAWLEYS ISLAND","SC",29585,"DENTAL","General Dentist"]
[null,464241126,1396889523,"JUDITH A KIMMELMAN","31 W MAIN ST","PENNS GROVE","NJ","08069","DENTAL","General Dentist"]
[null,451266532,1053970392,"BENJAMIN D ROSELL","9360 TWO NOTCH RD","COLUMBIA","SC",29223,"DENTAL","General Dentist"]
[null,872777514,1225606064,"KRISTEN  SCIOLINO","97 LEE RD","LINCOLN","ME","04457","DENTAL","General Dentist"]
[null,834116100,1235525221,"SHARON  WORZALLA","2737 DEVONSHIRE PL NW STE A","WASHINGTON","DC",20008,"DENTAL","General Dentist"]
[null,362757472,1992146757,"DAVID B GERSHENZON","30 N MICHIGAN AVE STE 904","CHICAGO","IL",60602,"DENTAL","General Dentist"]
[null,273152881,1659729283,"PAVEL Y IVASHCHUK","353 YORK ST FRNT","GETTYSBURG","PA",17325,"DENTAL","General Dentist"]
[null,464802628,1104177617,"SHANE A HARPHAM","164 BLUFFTON RD","BLUFFTON","SC",29910,"DENTAL","Pediatric Dentist"]
[null,223452451,1700352689,"ASMA  HUSIENZAD","133 JACKSON RD STE E","MEDFORD","NJ","08055","DENTAL","General Dentist"]
[null,831788337,1548555220,"AUSTIN T WESTOVER","11 MEADOW BRANCH AVE","WINCHESTER","VA",22601,"DENTAL","General Dentist"]
[null,472445671,1871824797,"MATTHEW H ALDRED","17084 MOUNTAIN RD","MONTPELIER","VA",23192,"DENTAL","General Dentist"]
[null,820554997,1740339605,"AUSTIN H WANG","153 MANCHESTER ST STE 5","CONCORD","NH","03301","DENTAL","Periodontist"]
[null,842637699,1255415469,"HITESHKUMAR J SHAH","10868 US 15 501 HWY","SOUTHERN PINES","NC",28387,"DENTAL","General Dentist"]
[null,200204878,1912119397,"MICHAEL L CARIENS","332 OLD CHAPIN RD","LEXINGTON","SC",29072,"DENTAL","General Dentist"]
[null,200120892,1134328115,"DEBRA A PISARCIK","900 W BALTIMORE PIKE STE 203","WEST GROVE","PA",19390,"DENTAL","Pediatric Dentist"]
[null,474316619,1225045974,"JOHN S HORCHOS","7847 OLD YORK RD 2ND FL","ELKINS PARK","PA",19027,"DENTAL","Pediatric Dentist"]
[null,520960590,1326113093,"IRVING M PHILLIPS","503 DUTCHMANS LN STE A","EASTON","MD",21601,"DENTAL","General Dentist"]
[null,815044870,1013271972,"DANIEL J POLITELLI","1353 WARWICK AVENUE","WARWICK","RI","02888","DENTAL","General Dentist"]
[null,200120892,1972009959,"LEILA  HAZAVEI","130 S STATE RD Suite 300","SPRINGFIELD","PA",19064,"DENTAL","Pediatric Dentist"]
[null,921664922,1528440146,"KENNETH C HOBBS","612 FAYETTE ST SUITE 2B","CONSHOHOCKEN","PA",19428,"DENTAL","General Dentist"]
[null,824706277,1316527799,"CAROLINE SUNG-EUN KIM","2304 CONCORD PIKE","WILMINGTON","DE",19803,"DENTAL","General Dentist"]
[null,371915960,1114602737,"NATHALIA  MERCADO","7300 4TH ST N","SAINT PETERSBURG","FL",33702,"DENTAL","General Dentist"]
[null,202106441,1306965686,"DAVID W MIOLEN","2648 APD 40","CLEVELAND","TN",37323,"DENTAL","General Dentist"]
[null,521116591,1649679085,"WAYNE  STEPHENS","320 HARGRAVES DR","FEDERALSBURG","MD",21632,"DENTAL","Pediatric Dentist"]
[null,270500276,1083955611,"DUANE  ANGLIN","10451 MILL RUN CIR STE 310","OWINGS MILLS","MD",21117,"DENTAL","General Dentist"]
[null,933424200,1386080893,"PETER W INNACOLA","3244 HARRISBURG PIKE","LANDISVILLE","PA",17538,"DENTAL","General Dentist"]
[null,843889369,1043625510,"THOMAS J DIX","2821 N PARHAM RD STE 102","RICHMOND","VA",23294,"DENTAL","General Dentist"]
[null,824142758,1558794404,"MARIA INEZ BARTOLETTI","115 MILL ST","SHERIDAN","MT",59749,"DENTAL","General Dentist"]
[null,232708126,1144710047,"JULIANNA  KOPAKOWSKI","330 W OREGON AVE STE H","PHILADELPHIA","PA",19148,"DENTAL","Pediatric Dentist"]
[null,182488133,1225300460,"DREW CHRISTOPHER ECKMAN","301 N 3RD ST","OXFORD","PA",19363,"DENTAL","General Dentist"]
[null,201564078,1114045648,"MICHAEL A ISRAELSON","168 CENTENNIAL PKWY STE 190","LOUISVILLE","CO",80027,"DENTAL","General Dentist"]
[null,541958510,1396942298,"JOHN M MCCOMBE","1205 YORK RD STE 31","LUTHERVILLE","MD",21093,"DENTAL","General Dentist"]
[null,223558846,1497910954,"SALLY M GUERRASIO","200 WHITE RD STE 113","LITTLE SILVER","NJ","07739","DENTAL","Pediatric Dentist"]
[null,208130619,1164430765,"D S THOMAS","4 OLDE EASTWOOD VILLAGE BLVD STE 102","ASHEVILLE","NC",28803,"DENTAL","General Dentist"]
[null,208643759,1114488772,"JENNIFER  CAUGHEY","1004 S STATE ST STE 1","DOVER","DE",19901,"DENTAL","General Dentist"]
[null,842492688,1174264758,"CLARK  HAMILTON","2010 S JUNIPER ST","PHILADELPHIA","PA",19148,"DENTAL","Pediatric Dentist"]
[null,932560798,1700362555,"STEPHEN  JAEGER","799 US HIGHWAY 1 S","ISELIN","NJ","08830","DENTAL","General Dentist"]
[null,"061652496",1023163433,"RONALD  HANDLEY","10710 BARKER CYPRESS RD STE A","CYPRESS","TX",77433,"DENTAL","General Dentist"]
[null,831855238,1821008228,"PAUL M FEIT","13435 S MCCALL RD STE C17","PORT CHARLOTTE","FL",33981,"DENTAL","General Dentist"]
[null,474692724,1467837203,"MARCELA  ECHEVERRY","1708 E HALLANDALE BEACH BLVD","HALLANDALE BEACH","FL",33009,"DENTAL","General Dentist"]
[null,995062861,1225232788,"THADDEUS H VINCENT","434 N GUIGNARD DR","SUMTER","SC",29150,"DENTAL","General Dentist"]
[null,811547442,1679913610,"JACQUELYN  MILLER","1699 S 14TH ST STE 21 Ste 21","FERNANDINA BEACH","FL",32034,"DENTAL","General Dentist"]
[null,994989830,1629417654,"BINDU M VEMARAJU","2412 N SALISBURY BLVD STE A","SALISBURY","MD",21801,"DENTAL","General Dentist"]
[null,651290619,1366425738,"EDWARD  CIAS","58 E WELLSBORO ST","MANSFIELD","PA",16933,"DENTAL","General Dentist"]
[null,822272495,1073643797,"ELIZABETH  BALIS","474 HURFFVILLE CROSSKEYS RD SUITE A","SEWELL","NJ","08080","DENTAL","General Dentist"]
[null,582426214,1235543521,"JESSIE S ROBINSON","9083-B OLD HWY 6","SANTEE","SC",29142,"DENTAL","General Dentist"]
[null,810875970,1588790596,"THOMAS B COGSIL","608 N PARROTT AVE","OKEECHOBEE","FL",34972,"DENTAL","General Dentist"]
[null,208920774,1790822500,"LARA  PERRY","1929 W STATE HIGHWAY 46 STE 102","NEW BRAUNFELS","TX",78132,"DENTAL","General Dentist"]
[null,454080678,1467974253,"ANN M SEAVY","157 HOLLAND AVE","WESTOVER","WV",26501,"DENTAL","General Dentist"]
[null,832460760,1720148232,"CYNTHIA  WALKER","988 OCEAN HWY W","SUPPLY","NC",28462,"DENTAL","General Dentist"]
[null,473596549,1003061276,"FREDERICK V BALLARD","1692 CLEMENTS BRIDGE RD","DEPTFORD","NJ","08096","DENTAL","Pediatric Dentist"]
[null,455285158,1154619096,"KELLY A HORVATH","3123 MILLER AVE","CROSSVILLE","TN",38555,"DENTAL","General Dentist"]
[null,208185727,1457935801,"MORGAN  STRAITS","633 N UNION ST","LOUDONVILLE","OH",44842,"DENTAL","General Dentist"]
[null,200120892,1861952830,"VERONICA  KRAYNIK","235 S POTTSTOWN PIKE","EXTON","PA",19341,"DENTAL","Pediatric Dentist"]
[null,156483359,1487704748,"BARBARA  LENK","935 KINGS HWY STE 500","WEST DEPTFORD","NJ","08086","DENTAL","General Dentist"]
[null,922956978,1962081471,"AUSTIN  EDDY","115 N BEECH ST","CORTEZ","CO",81321,"DENTAL","General Dentist"]
[null,842788535,1437283157,"WINSTON B WOODS","7400 BLANCO RD STE 100","SAN ANTONIO","TX",78216,"DENTAL","General Dentist"]
[null,814426745,1548669740,"ENRIQUE  OLTRA ESPLUGUES","1769 JAMESTOWN RD STE 2B","WILLIAMSBURG","VA",23185,"DENTAL","Endodontist"]
[null,472157654,1902535354,"JOHN  WATSON","511 N PROVIDENCE RD","MEDIA","PA",19063,"DENTAL","General Dentist"]
[null,201932296,1013134931,"DONALD P PETERSON","11855 HOLLY LN STE 103","WALDORF","MD",20601,"DENTAL","General Dentist"]
[null,300572363,1396958195,"ANTHONY M BOSCHETTI","62 WEST MAIN ST","HILLSBORO","NH","03244","DENTAL","General Dentist"]
[null,451266532,1134957913,"BROCK J ANDERSON","9360 TWO NOTCH RD","COLUMBIA","SC",29223,"DENTAL","General Dentist"]
[null,455166025,1780134155,"MEENA  MEMAR","31 S EAGLE RD STE 100","HAVERTOWN","PA",19083,"DENTAL","General Dentist"]
[null,456868389,1811106693,"DAVID  OLIVAS","7 HARKNESS BROOK LN","ROCKPORT","ME","04856","DENTAL","General Dentist"]
[null,510406360,1356469928,"JULIE F PETERSON","1223 FOULK RD","WILMINGTON","DE",19803,"DENTAL","General Dentist"]
[null,832601748,1205985843,"LOGAN D BEHRMANN","3022 E 57TH AVE STE 10","SPOKANE","WA",99223,"DENTAL","General Dentist"]
[null,474316619,1851602775,"SCOTT J SOLOW","7847 OLD YORK RD 2ND FL","ELKINS PARK","PA",19027,"DENTAL","Pediatric Dentist"]
[null,843645344,1053092817,"MATTHEW  CRADDUCK","750 S POTOMAC ST","WAYNESBORO","PA",17268,"DENTAL","General Dentist"]
[null,232052784,1003919325,"ANDREW T PAGANO","2420 SCHOENERSVILLE RD","BETHLEHEM","PA",18017,"DENTAL","General Dentist"]
[null,232588740,1780655563,"HOWARD A WEINSTOCK","1420 MANOA RD","WYNNEWOOD","PA",19096,"DENTAL","General Dentist"]
[null,591304462,1790833978,"CRAIG  GEORGIADES","3900 CLARK RD STE E4","SARASOTA","FL",34233,"DENTAL","General Dentist"]
[null,680032058,1275673618,"STEVE  MOSBY","821 W MAIN","LEWISTOWN","MT",59457,"DENTAL","General Dentist"]
[null,233100103,1457341455,"MATTHEW D FREEDMAN","416 N DUKE ST","LANCASTER","PA",17602,"DENTAL","General Dentist"]
[null,320337332,1720063589,"JON E CRUZ","24164 STATE ROAD 35","SIREN","WI",54872,"DENTAL","General Dentist"]
[null,392937909,1174045330,"MATTHEW P BARONNER","127 W STREET RD STE 301","KENNETT SQUARE","PA",19348,"DENTAL","General Dentist"]
[null,813391505,1336589795,"CHRISTOPHER B DANIEL","130 ST JAMES AVE","GOOSE CREEK","SC",29445,"DENTAL","General Dentist"]
[null,461258716,1750609301,"MATTHEW H COONS","5988 WEST MALL","ATASCADERO","CA",93422,"DENTAL","General Dentist"]
[null,232708126,1578918777,"LESLIE  FITZ","4659 WEST CHESTER PIKE","NEWTOWN SQUARE","PA",19073,"DENTAL","Pediatric Dentist"]
[null,812744800,1730241290,"NIKOLAOS D KARELLOS","801 YALE AVE APT 619","SWARTHMORE","PA",19081,"DENTAL","General Dentist"]
[null,650044366,1316615214,"TATIANA  KALASHNIKOVA","3850 S OSPREY AVE","SARASOTA","FL",34239,"DENTAL","General Dentist"]
[null,231953077,1508981739,"GEORGE W HECKERT","2642 AUDUBON RD","AUDUBON","PA",19403,"DENTAL","General Dentist"]
[null,922059494,1265606651,"MICHAEL M MERCADO","14203 COASTAL HWY STE 1","OCEAN CITY","MD",21842,"DENTAL","General Dentist"]
[null,271561298,1861583023,"CHRISTINA M KULESA","538 POLARIS PKWY","WESTERVILLE","OH",43082,"DENTAL","General Dentist"]
[null,461093540,1558575936,"CHRISTOPHER A CAPPELLINI","3025 LAKE ARIEL HWY","HONESDALE","PA",18431,"DENTAL","General Dentist"]
[null,232175912,1598769572,"ROBERT M SCHWAN","606 E MARSHALL ST STE 202","WEST CHESTER","PA",19380,"DENTAL","General Dentist"]
[null,201481137,1114233095,"ROBERT G RITTER","500 UNIVERSITY BLVD STE 109","JUPITER","FL",33458,"DENTAL","General Dentist"]
[null,331325671,1326146218,"NOELLE  LING","19 MORRIS AVE","BRYN MAWR","PA",19010,"DENTAL","General Dentist"]
[null,474087706,1790047306,"DAVID H KIM","9275 BALTIMORE NATIONAL PIKE STE 103","ELLICOTT CITY","MD",21042,"DENTAL","General Dentist"]
[null,232778744,1467532259,"STEVEN J ROTHEMICH","15 E WOODLAND AVE","SPRINGFIELD","PA",19064,"DENTAL","General Dentist"]
[null,844882064,1407111487,"JORDAN M ZANER","7696 DORCHESTER BLVD STE 1","HANOVER","MD",21076,"DENTAL","General Dentist"]
[null,251753545,1619197134,"MICHAEL K DAWSON","4570 PENNS VALLEY RD STE 2","SPRING MILLS","PA",16875,"DENTAL","General Dentist"]
[null,201272092,1528633609,"VEDANSHI  AMIN","10725 US HIGHWAY 1","SEBASTIAN","FL",32958,"DENTAL","General Dentist"]
[null,475037240,1023005733,"JANA E BOYD","2900 GODWIN BLVD","SUFFOLK","VA",23434,"DENTAL","General Dentist"]
[null,382358709,1942401047,"JENNY A GRUNBERG","54055 COUNTY ROAD 653","PAW PAW","MI",49079,"DENTAL","General Dentist"]
[null,201727881,1942310768,"JOSEPH G GRAVER","564 OLD YORK RD","ETTERS","PA",17319,"DENTAL","General Dentist"]
[null,382777800,1477574960,"JEFFREY L WEINFELD","6024 W MAPLE RD STE 105","WEST BLOOMFIELD","MI",48322,"DENTAL","General Dentist"]
[null,591685673,1063558096,"ANDREA L ASSEFF","3800 S OCEAN DR STE 241","HOLLYWOOD","FL",33019,"DENTAL","General Dentist"]
[null,371915960,1982276788,"LORA  SOLIMAN","7300 4TH ST N","SAINT PETERSBURG","FL",33702,"DENTAL","General Dentist"]
[null,233025075,1871899310,"MATTHEW J BALLAS","317 PRIMROSE DR","UPPER GWYNEDD","PA",19446,"DENTAL","General Dentist"]
[null,471220468,1780768747,"STEVEN LEE STEAKLEY","4338 1ST ST N STE E","SAINT PETERSBURG","FL",33703,"DENTAL","General Dentist"]
[null,472965093,1801632617,"PAIGE E WHITE","3420 PLEASANT VALLEY BLVD","ALTOONA","PA",16602,"DENTAL","General Dentist"]
[null,231965988,1689899353,"MARK P CARLSON","37 PEARL ST","PORT ALLEGANY","PA",16743,"DENTAL","General Dentist"]
[null,812808331,1215293196,"MUKUND T PATEL","2842 STREET RD","BENSALEM","PA",19020,"DENTAL","Pediatric Dentist"]
[null,464802628,1396976866,"TIMOTHY J BYRNES","164 BLUFFTON RD","BLUFFTON","SC",29910,"DENTAL","Pediatric Dentist"]
[null,203589894,1134174162,"PATRICK  PIRKLE","621 SEBASTIAN BLVD Suite A","SEBASTIAN","FL",32958,"DENTAL","General Dentist"]
[null,"030280826",1093725194,"CHRISTOPHER  FAUVER","48 MAIN STREET","CHESTER","VT","05143","DENTAL","General Dentist"]
[null,570737664,1972632644,"GEORGINA G COFFEY","24 BOZARD ST","MANNING","SC",29102,"DENTAL","General Dentist"]
[null,270084883,1417080490,"RANDY J SACHS","9835 LAKE WORTH RD STE 8","LAKE WORTH","FL",33467,"DENTAL","General Dentist"]
[null,200091594,1114018009,"MITCHELL D KAPLAN","2301 PLATT RD STE 100","ANN ARBOR","MI",48104,"DENTAL","Periodontist"]
[null,208643759,1033257530,"DOUGLAS L DITTY","19323 LIGHTHOUSE PLAZA BLVD UNIT 4","REHOBOTH BEACH","DE",19971,"DENTAL","Oral Surgeon"]
[null,844919448,1457903866,"SANKET A RATHOD","1861 PLACIDA RD STE 105","ENGLEWOOD","FL",34223,"DENTAL","General Dentist"]
[null,474900994,1659563138,"JAMES D MEDWICK","25 TROTTER HILLS CIR","PINEHURST","NC",28374,"DENTAL","General Dentist"]
[null,825210299,1063545242,"GEORGE E HITZEL","1330 S BELCHER RD","CLEARWATER","FL",33764,"DENTAL","General Dentist"]
[null,562055694,1417086745,"WILLIAM  COCO","500 RED BANKS RD STE A","GREENVILLE","NC",27858,"DENTAL","General Dentist"]
[null,831741561,1922447556,"ANDREW J SPIGUZZA","4004 BAYBORO ST","LORIS","SC",29569,"DENTAL","General Dentist"]
[null,261372981,1023141462,"ANITHA  PRASANNA","1490 CHENEY HWY # 50","TITUSVILLE","FL",32780,"DENTAL","General Dentist"]
[null,200120892,1235475666,"EDWARD  GARJARIAN","900 W BALTIMORE PIKE STE 203","WEST GROVE","PA",19390,"DENTAL","Pediatric Dentist"]
[null,561739038,1457389322,"THOMAS S CLIFTON","5242 N ROXBORO RD STE A","DURHAM","NC",27712,"DENTAL","General Dentist"]
[null,463778054,1205990686,"DAVID LOUIS CASTELLANO","7320 FOREST OAKS BLVD","SPRING HILL","FL",34606,"DENTAL","General Dentist"]
[null,392408375,1598769572,"ROBERT M SCHWAN","606 E MARSHALL ST STE 202","WEST CHESTER","PA",19380,"DENTAL","General Dentist"]
[null,231889724,1003136904,"STEPHEN J OLLOCK","116 SEYMOUR ST","BLOSSBURG","PA",16912,"DENTAL","General Dentist"]
[null,232860692,1154453678,"DARYL  KLOPP","147 MONTGOMERY AVE","BALA CYNWYD","PA",19004,"DENTAL","General Dentist"]
[null,331404025,1114280245,"ROBERT FRANCIS BRACHO","925 HIGH POINT DR","NAPLES","FL",34103,"DENTAL","General Dentist"]
[null,810898884,1235380817,"SAMIR A SHAH","2106 NEW RD STE C4","LINWOOD","NJ","08221","DENTAL","Periodontist"]
[null,843937781,1720280514,"BRADLEY D HUGHES","10 WILLIAM POPE DR STE 2","OKATIE","SC",29909,"DENTAL","General Dentist"]
[null,451266532,1215598792,"SHAYAL  NARAYAN","1586 HWY 17N","NORTH MYRTLE BEACH","SC",29582,"DENTAL","General Dentist"]
[null,931357853,1386175149,"WILLIAM C DESONNE","2300 WRANGLEBORO RD STE 740","MAYS LANDING","NJ","08330","DENTAL","Pediatric Dentist"]
[null,992404935,1104130038,"MALAVIKA  PRASANNA","15946 REDMOND WAY STE 106","REDMOND","WA",98052,"DENTAL","General Dentist"]
[null,851791619,1730630914,"CHRISTOPHER  SANGINITI","633 GREENWAY RD SE","GLEN BURNIE","MD",21061,"DENTAL","General Dentist"]
[null,831846173,1124479662,"BRANDON  VANASSE","296 MAIN ST","DERBY","VT","05829","DENTAL","General Dentist"]
[null,233056351,1821011719,"JONI R MARCUS","7215 PASSYUNK AVE","PHILADELPHIA","PA",19142,"DENTAL","General Dentist"]
[null,263850282,1275790339,"JOHN M DROP","204 HERSHEY RD","HUMMELSTOWN","PA",17036,"DENTAL","General Dentist"]
[null,200000844,1316026669,"PHILIP K CLARK","1590 ISLAND LN STE 12","FLEMING ISLAND","FL",32003,"DENTAL","General Dentist"]
[null,472678579,1598499535,"HAI  LIU","12 MAIN ST","CENTER HARBOR","NH","03226","DENTAL","General Dentist"]
[null,650485117,1740340504,"THOMAS  WIERNICKI","190 NW SPANISH RIVER BLVD STE 100","BOCA RATON","FL",33431,"DENTAL","General Dentist"]
[null,223542608,1326632555,"BENJAMIN S PAULUSSEN","354 US HIGHWAY 46 W STE 1A","HACKETTSTOWN","NJ","07840","DENTAL","General Dentist"]
[null,233101899,1780614883,"THOMAS P NORDONE","50 S PROVIDENCE RD","MEDIA","PA",19063,"DENTAL","Oral Surgeon"]
[null,823872990,1487874293,"JAMES B LEWIS","2025 W PINE ST","SANDPOINT","ID",83864,"DENTAL","General Dentist"]
[null,262805557,1245915958,"KAITLIN E YOUNG","104 PROMINENCE POINT PKWY STE 100","CANTON","GA",30114,"DENTAL","General Dentist"]
[null,260614571,1710290028,"NAVID N MALIK","6700 WOODLANDS PKWY STE 160","THE WOODLANDS","TX",77382,"DENTAL","General Dentist"]
[null,852047949,1750905592,"TERESA H HUYNH","344 ROCKLAND ST","HINGHAM","MA","02043","DENTAL","General Dentist"]
[null,233051080,1619723780,"ROCCO  MESORACA","5000 CHICHESTER AVE","ASTON","PA",19014,"DENTAL","General Dentist"]
[null,821909932,1427318773,"GINA ARLINE BERTUGLIA GOMEZ","2915 E CERVANTES ST","PENSACOLA","FL",32503,"DENTAL","General Dentist"]
[null,851092826,1386132934,"ANN P LIN","4622 COUNTRY CLUB RD STE 280","WINSTON SALEM","NC",27104,"DENTAL","General Dentist"]
[null,824856277,1346501913,"STEPHEN D HOYLE","1716 OLD VILLAGE RD","HENDERSONVILLE","NC",28791,"DENTAL","General Dentist"]
[null,204078423,1649208034,"MICHAEL GERARD COOK","10690 S US HIGHWAY 1 STE A","PORT ST LUCIE","FL",34952,"DENTAL","General Dentist"]
[null,260367216,1508299090,"DANIEL P THOMAS","701 MAIN ST","ROYERSFORD","PA",19468,"DENTAL","General Dentist"]
[null,464802628,1699803189,"TOBIAS  DERLOSHON","164 BLUFFTON RD","BLUFFTON","SC",29910,"DENTAL","Pediatric Dentist"]
[null,872378527,1053057562,"AVRINA  NAIR","120 E MARKET ST","LEWISTOWN","PA",17044,"DENTAL","General Dentist"]
[null,"061401784",1184852535,"SARAI  RUIZ NIEVES","1000 BRIDGEPORT AVE","SHELTON","CT","06484","DENTAL","General Dentist"]
[null,203979806,1962568279,"JAMES L CARTER","2416 CONGRESS PKWY S","ATHENS","TN",37303,"DENTAL","General Dentist"]
[null,650457638,1528126984,"GREGG F MCNEAL","643 CAPE CORAL PKWY E STE A","CAPE CORAL","FL",33904,"DENTAL","General Dentist"]
[null,210447516,1073614947,"CASIMIR M WOLANIN","1210 DARBY RD","HAVERTOWN","PA",19083,"DENTAL","General Dentist"]
[null,510214005,1396872974,"NICHOLAS  PUNTURIERI","1200 PEOPLES PLZ STE 1260","NEWARK","DE",19702,"DENTAL","General Dentist"]
[null,593727118,1851412613,"JOHN K GROTHE","8454 NORTHCLIFFE BLVD","SPRING HILL","FL",34606,"DENTAL","General Dentist"]
[null,331740532,1295963726,"MATTHEW W DOVER","400 S COLLEGE ST STE 1","MOUNTAIN HOME","AR",72653,"DENTAL","General Dentist"]
[null,770417764,1790146876,"MARY ANNE  MARSCHIK","880 CASS ST STE 207","MONTEREY","CA",93940,"DENTAL","General Dentist"]
[null,"030364169",1063593754,"JOHN S THOMPSON","173 WEST ST","ESSEX JCT","VT","05452","DENTAL","General Dentist"]
[null,262154247,1528232246,"ANNE R BASHAM","1226 SHEPHERDSTOWN RD","MARTINSBURG","WV",25404,"DENTAL","General Dentist"]
[null,753061437,1578631875,"RICHARD E COFER","5400 CROSSLAKE PKWY STE 400","WACO","TX",76712,"DENTAL","General Dentist"]
[null,873866466,1720566581,"TYLER E AZEVEDO","102 CONNER RD","OXFORD","PA",19363,"DENTAL","General Dentist"]
[null,521116591,1538298070,"CHOPTANK COMMUNTY HLTH SYSTM INC","320 HARGRAVES DR","FEDERALSBURG","MD",21632,"DENTAL","General Dentist"]
[null,611033691,1881322410,"ANNA M JOINES","106 POWELL STREET","BROOKSVILLE","KY",41004,"DENTAL","General Dentist"]
[null,881186055,1306510524,"GREGORY P MALONEY","141 TUCKAHOE RD STE 380","SEWELL","NJ","08080","DENTAL","General Dentist"]
[null,472597936,1063543015,"WILLIAM D MESTICHELLI","1903 S BROAD ST","PHILADELPHIA","PA",19148,"DENTAL","General Dentist"]
[null,842464644,1952469488,"PAUL JOSEPH KINSEY","515 BENFIELD RD STE 202","SEVERNA PARK","MD",21146,"DENTAL","General Dentist"]
[null,232979294,1881796431,"DAVID E FREILICH","429 N SPRINGFIELD RD","CLIFTON HEIGHTS","PA",19018,"DENTAL","General Dentist"]
[null,922374664,1295263259,"ANIRUDH  PATEL","99 ST PAUL DR","CHAMBERSBURG","PA",17201,"DENTAL","General Dentist"]
[null,854281974,1851723886,"DANIEL J BROCKWAY","23 SHELTER COVE LN BLDG B STE 200","HILTON HEAD ISLAND","SC",29928,"DENTAL","Periodontist"]
[null,991860454,1194913640,"BRIAN  SHEPANSKI","1 CRESCENT DR STE 300","PHILADELPHIA","PA",19112,"DENTAL","General Dentist"]
[null,463279591,1801525548,"STEPHEN  KRAUSS","3030 US HIGHWAY 301 N","ELLENTON","FL",34222,"DENTAL","General Dentist"]
[null,201048094,1245343136,"JAMES  ENGSTROM","1719 EDINBURG ST","RAWLINS","WY",82301,"DENTAL","General Dentist"]
[null,271516018,1336479237,"RICHARD L VONNAHME","700 WHITNELL ST","MURRAY","KY",42071,"DENTAL","General Dentist"]
[null,861832438,1780994533,"OMAR E ELBANHAWY","43902 WOODWARD AVE STE 220","BLOOMFIELD HILLS","MI",48302,"DENTAL","Periodontist"]
[null,842656919,1235525791,"LALITA D NEKKANTI","2615 S MIAMI BLVD","DURHAM","NC",27703,"DENTAL","General Dentist"]
[null,921041596,1851959076,"TAYLOR J SUTTON","300 NOVA WAY","PARKESBURG","PA",19365,"DENTAL","General Dentist"]
[null,475252227,1679695431,"SHARON C BLEILER","801 OLD YORK RD STE 403","JENKINTOWN","PA",19046,"DENTAL","General Dentist"]
[null,205548551,1396373775,"KEVIN  SMYTH","234 S MAIN ST","SLIPPERY ROCK","PA",16057,"DENTAL","General Dentist"]
[null,208591702,1245306463,"GARRETT A BETHKE","21715 KINGSLAND BLVD STE 105","KATY","TX",77450,"DENTAL","General Dentist"]
[null,854281974,1851723886,"DANIEL J BROCKWAY","23B SHELTER COVE LN STE 200","HILTON HEAD ISLAND","SC",29928,"DENTAL","Periodontist"]
[null,270728558,1497854871,"THOMAS KEVIN BAILEY","13700 N US HIGHWAY 441","LADY LAKE","FL",32159,"DENTAL","General Dentist"]
[null,830857212,1609259704,"RONAK  SHUKLA","3921 5TH AVE N","SAINT PETERSBURG","FL",33713,"DENTAL","General Dentist"]
[null,522134962,1578713442,"SAUREEN S SHAH","806 LANDMARK DR STE 124","GLEN BURNIE","MD",21061,"DENTAL","General Dentist"]
[null,861139109,1316681471,"AO  BAI","4317 ABBOTTS BRIDGE RD STE 4","DULUTH","GA",30097,"DENTAL","General Dentist"]
[null,824814044,1588926018,"ERIC  BROE","100 MARKETSIDE AVE STE 306","PONTE VEDRA","FL",32081,"DENTAL","General Dentist"]
[null,231365971,1053969113,"BHUMICA  PATEL","3223 N BROAD ST","PHILADELPHIA","PA",19140,"DENTAL","General Dentist"]
[null,851503546,1396154126,"DAVID A LAMBERT","100 S 18TH ST","COLUMBIA","PA",17512,"DENTAL","General Dentist"]
[null,842669320,1558852392,"ABDULLAH  ALLAWNHA","617 75TH AVE","SAINT PETE BEACH","FL",33706,"DENTAL","General Dentist"]
[null,227643191,1912184334,"STEVEN B SCHMITT","6911 PATTERSON AVE","RICHMOND","VA",23226,"DENTAL","General Dentist"]
[null,"061672117",1184356917,"DANIEL  KORTYKA","5744 CANTON CV","WINTER SPRINGS","FL",32708,"DENTAL","General Dentist"]
[null,231365971,1861730434,"ELIZABETH C TWEDDALE CORREA","3223 N BROAD ST","PHILADELPHIA","PA",19140,"DENTAL","General Dentist"]
[null,205145207,1427126184,"TOMOYASU  FUJI","1500 WALNUT ST STE 2001","PHILADELPHIA","PA",19102,"DENTAL","Periodontist"]
[null,593613378,1598870511,"ALBERTO M BIRD","2610 WEST BAY DR","LARGO","FL",33770,"DENTAL","Periodontist"]
[null,872378527,1750067880,"ZHAOHAN  JIA","120 E MARKET ST","LEWISTOWN","PA",17044,"DENTAL","General Dentist"]
[null,863611905,1083684104,"ANTHONY JOSEPH KOAGEL","7768 CUMMING HWY STE 100","CANTON","GA",30115,"DENTAL","General Dentist"]
[null,571036858,1912083163,"GEORGE I CRAWFORD","117 TRAFALGAR LN SW","AIKEN","SC",29801,"DENTAL","General Dentist"]
[null,650700946,1356071005,"BROOK M PATTERSON","81990 OVERSEAS HWY STE 103","ISLAMORADA","FL",33036,"DENTAL","General Dentist"]
[null,932917391,1639818065,"ADIL  IBRAHIM","3615 FLORIDA AVE S SUITE 7","LAKELAND","FL",33803,"DENTAL","General Dentist"]
[null,231365971,1811349517,"BRUNA  TANELLO NEIVA","3223 N BROAD ST","PHILADELPHIA","PA",19140,"DENTAL","Periodontist"]
[null,621373171,1518309657,"KE  QI","116 JACK WHITE DR STE 12","KINGSPORT","TN",37664,"DENTAL","General Dentist"]
[null,231365971,1760815328,"OQBA N MEMAR","3223 N BROAD ST","PHILADELPHIA","PA",19140,"DENTAL","General Dentist"]
[null,570859576,"NULL","SC DEPARTMENT OF HEALTH & HUMAN SERVICES","PO BOX 8355","COLUMBIA","SC",29202,"DENTAL","General Dentist"]
[null,204072849,1023037603,"NILASH S PATEL","2154 ASHLEY OAKS CIR","WESLEY CHAPEL","FL",33544,"DENTAL","General Dentist"]
[null,861832438,1700328721,"GEORGE  KARAOUZAS","43902 WOODWARD AVE STE 220","BLOOMFIELD HILLS","MI",48302,"DENTAL","General Dentist"]
[null,"030280826",1841978921,"SHOBHNA  SAINI","48 MAIN STREET","CHESTER","VT","05143","DENTAL","General Dentist"]
[null,520986541,1982715108,"EVERETT J EKLUND","1301 POTOMAC AVE","HAGERSTOWN","MD",21742,"DENTAL","General Dentist"]
[null,860965061,1861047490,"MATTHEW A CATUNA","13949 W MEEKER BLVD STE A","SUN CITY WEST","AZ",85375,"DENTAL","General Dentist"]
[null,994989830,1912216854,"JAE H KIM","2412 N SALISBURY BLVD STE A","SALISBURY","MD",21801,"DENTAL","Oral Surgeon"]
[null,260702833,1780600106,"SARA KOHEN DEAN","106 N OLD KINGS RD #A","ORMOND BEACH","FL",32174,"DENTAL","General Dentist"]
[null,474011990,1366863250,"SAM  DIRAWI","3150 CHENEY HWY","TITUSVILLE","FL",32780,"DENTAL","General Dentist"]
[null,812569715,1861178808,"CASSANDRA  FRANCO","870 N US HIGHWAY 27 STE A","LADY LAKE","FL",32159,"DENTAL","General Dentist"]
[null,260127330,1992890230,"AJAY  SONI","68 S WHITE HORSE PIKE","BERLIN","NJ","08009","DENTAL","General Dentist"]
[null,461215895,1528367190,"NISHIT  SHAH","120 CENTER SQUARE RD STE 205","WOOLWICH TOWNSHIP","NJ","08085","DENTAL","General Dentist"]
[null,873215474,1124862891,"JUANITA  PIZA","6182 N US HIGHWAY 41 UNIT A","APOLLO BEACH","FL",33572,"DENTAL","General Dentist"]
[null,834025037,1770758401,"FRED J NORKIN","3020 N MILITARY TRL STE 200","BOCA RATON","FL",33431,"DENTAL","General Dentist"]
[null,454278988,1174757363,"MICHAEL J KRATCHMAN","401 HARMONY RD STE 14","GIBBSTOWN","NJ","08027","DENTAL","General Dentist"]
[null,843051844,1154079788,"SRIDIVYA  KASINADHUNI","10160 HIGHWAY 242 STE 100","CONROE","TX",77385,"DENTAL","Periodontist"]
[null,814164971,1235623315,"LAUREN R TRAGER","2301 E EVESHAM RD STE 602","VOORHEES","NJ","08043","DENTAL","Oral Surgeon"]
[null,853560257,1699061952,"LISAMARIE  SARHANGIAN","1200 W WARNER RD STE 3","CHANDLER","AZ",85224,"DENTAL","Oral Surgeon"]
[null,882393585,1023334299,"OMAR K ARMSTRONG","282 GRAND ST","JERSEY CITY","NJ","07302","DENTAL","General Dentist"]
[null,464114038,1295742575,"JOSEPH M CURLEY","143 POOLE RD STE C","BELVILLE","NC",28451,"DENTAL","General Dentist"]
[null,200133768,1013042274,"WAYMAN JAYE BROWN","12200 ANNAPOLIS RD STE 112","GLENN DALE","MD",20769,"DENTAL","General Dentist"]
[null,521789875,1649591298,"ANTHONY H HAMOD","2300 BEL AIR RD","FALLSTON","MD",21047,"DENTAL","General Dentist"]
[null,823466634,1598845133,"LITTLEJOHN K VANHORN","5901 S LOS ALTOS PKWY STE 100","SPARKS","NV",89436,"DENTAL","General Dentist"]
[null,332987196,1023334299,"OMAR K ARMSTRONG","191 LEFANTE WAY STE 2C","BAYONNE","NJ","07002","DENTAL","General Dentist"]
[null,844919448,1578116182,"HUGO  ZEGARRA BAQUERIZO","1491 E VENICE AVE STE B","VENICE","FL",34292,"DENTAL","Periodontist"]
[null,593331216,1629091400,"ALAN  FARRUGIA","5710 N DAVIS HWY STE 1","PENSACOLA","FL",32503,"DENTAL","General Dentist"]
[null,391861854,1609301027,"SAMI B KAWAS","1141 SIMON CRESTWAY","WAUNAKEE","WI",53597,"DENTAL","General Dentist"]
[null,273938944,1942303045,"KIMBERLY J WILLIAMS","1950 SPECTRUM CIR SE STE 100","MARIETTA","GA",30067,"DENTAL","General Dentist"]
[null,"030366445",1356563100,"PETER  LAKATOS","70 ALLEN ST","RUTLAND","VT","05701","DENTAL","General Dentist"]
[null,371759682,1922235829,"JOEL S HAMILTON","2 AUDOBON CT","BLOOMSBURG","PA",17815,"DENTAL","General Dentist"]
[null,834137019,1831117407,"ERIC  MYERS","120 LJK WAY","STEVENSVILLE","MT",59870,"DENTAL","General Dentist"]
[null,522259263,1992733059,"ZIAD E BATROUNI","128 LUBRANO DR STE 300","ANNAPOLIS","MD",21401,"DENTAL","Oral Surgeon"]
[null,262775992,1154470235,"RONNIE R DU","323 BOSTON POST RD","SUDBURY","MA","01776","DENTAL","General Dentist"]
[null,991376452,1104342161,"DAVID  AZIZYAN","700 S HENDERSON RD STE 306","KING OF PRUSSIA","PA",19406,"DENTAL","General Dentist"]
[null,272767912,1821250796,"LA TOYA C MORRIS","8035 W MANCHESTER AVE STE C","PLAYA DEL REY","CA",90293,"DENTAL","General Dentist"]
[null,233100842,1205842069,"RUSSEL S BLEILER","2030 E OLD LINCOLN HWY","LANGHORNE","PA",19047,"DENTAL","Oral Surgeon"]
[null,462020325,1568957157,"CARMEN L RUTH","3500 OLD WASHINGTON RD STE 301","WALDORF","MD",20602,"DENTAL","General Dentist"]
[null,593695834,1144398595,"SHARMILLA  ANAND","1601 SAN MARCO BLVD","JACKSONVILLE","FL",32207,"DENTAL","General Dentist"]
[null,934072190,1548611510,"ROCIO  BAROCIO TORANO","4012 KELCEY CT STE 101","TALLAHASSEE","FL",32308,"DENTAL","General Dentist"]
[null,814767271,1841361995,"JAY  CAZES","332 SPARTA AVE","SPARTA","NJ","07871","DENTAL","General Dentist"]
[null,330809853,1841467834,"GREG ALLEN MCELROY","700 GARDEN VIEW CT STE 201","ENCINITAS","CA",92024,"DENTAL","General Dentist"]
[null,844919448,1801294327,"PRAGYA  SHARMA","1491 E VENICE AVE STE B","VENICE","FL",34292,"DENTAL","Periodontist"]
[null,863269318,1245547603,"DEREK J CONOVER","212 RACE ST UNIT 1A","PHILADELPHIA","PA",19106,"DENTAL","General Dentist"]
[null,391861854,1801454210,"SYED  HASSAN","2501 PARMENTER ST STE 100B","MIDDLETON","WI",53562,"DENTAL","General Dentist"]
[null,472808085,1629166152,"BETH M GOLDBERG","111 EAST AVE STE 200","NORWALK","CT","06851","DENTAL","General Dentist"]
[null,825382813,1326427550,"AMI  PATEL","210 FAIRVIEW RD","ELLENWOOD","GA",30294,"DENTAL","General Dentist"]
[null,260107668,1477646628,"JOAN C LAURA","2326 JAMES ST","SYRACUSE","NY",13206,"DENTAL","General Dentist"]
[null,834458817,1033639125,"ZINAL  PATEL","3494 LINCOLN HWY","THORNDALE","PA",19372,"DENTAL","General Dentist"]
[null,606247360,1588782734,"BENJAMIN T STEVENS","3553 CAMINO MIRA COSTA STE B","SAN CLEMENTE","CA",92672,"DENTAL","General Dentist"]
[null,273600447,1821273731,"CARLOS A POLO-MONTES","6390 CYPRESS GARDENS BLVD","WINTER HAVEN","FL",33884,"DENTAL","Prosthodontist"]
[null,270204988,1780390807,"GARRETT LEE WILSON","638 UPTOWN BLVD STE 100","CEDAR HILL","TX",75104,"DENTAL","General Dentist"]
[null,202830486,1396848867,"BRIANNA L SCHRAW","1096 ASSEMBLY DR STE 216","FORT MILL","SC",29708,"DENTAL","General Dentist"]
[null,200185918,1255863114,"DEBBIE  DESRAVINES","1173 E STATE ROAD 434","WINTER SPRINGS","FL",32708,"DENTAL","General Dentist"]
[null,844788591,1063795797,"ROBERTO  SALAZAR","365 S RANCHO SANTA FE RD STE 105","SAN MARCOS","CA",92078,"DENTAL","General Dentist"]
[null,275317760,1578009007,"LUIS DIEGO  GONZALEZ","26321 NORTHWEST FWY STE 700","CYPRESS","TX",77429,"DENTAL","Oral Surgeon"]
[null,813267349,1093387482,"BRYAN M MORRISON","19315 W CATAWBA AVE STE 104","CORNELIUS","NC",28031,"DENTAL","General Dentist"]
[null,611511855,1487611042,"MELANIE K KESSLER","1361 SUMNEYTOWN PIKE","LANSDALE","PA",19446,"DENTAL","General Dentist"]
[null,203257018,1467511006,"JOSE M MARTINEZ","6817 SOUTHPOINT PKWY STE 302","JACKSONVILLE","FL",32216,"DENTAL","General Dentist"]
[null,522327497,1528456423,"TUAN M TRAN","1800 K ST NW STE 1104","WASHINGTON","DC",20006,"DENTAL","General Dentist"]
[null,812569715,1760833073,"SULAIMAN  ALSHAAR","870 N US HIGHWAY 27 STE A","LADY LAKE","FL",32159,"DENTAL","Oral Surgeon"]
[null,471706456,1306404066,"LILIAN  REYES","1855 US 27TH NORTH","SEBRING","FL",33870,"DENTAL","General Dentist"]
[null,463279591,1568567147,"DANIEL  DELROSE","3030 US HIGHWAY 301 N","ELLENTON","FL",34222,"DENTAL","General Dentist"]
[null,823776473,1659503910,"JOHN  KULAGA","1221 DUNLAWTON AVE STE 100","PORT ORANGE","FL",32127,"DENTAL","General Dentist"]
[null,455444754,1952502791,"JASON T HERRES","1013 W MAIN ST STE 6","MOUNT JOY","PA",17552,"DENTAL","General Dentist"]
[null,853264507,1629056635,"JENNIE E NICHOLS","243 S BROADWAY ST","MEDINA","OH",44256,"DENTAL","General Dentist"]
[null,821676253,1982140950,"PAOLA M WAINBERG","8060 W MCNAB RD","NORTH LAUDERDALE","FL",33068,"DENTAL","General Dentist"]
[null,223188233,1972727303,"ALBERT J KURPIS","545 STATE RT 17 STE 2007","RIDGEWOOD","NJ","07450","DENTAL","General Dentist"]
[null,463277773,1134587934,"ERIC  SILVER","5003 EDGMONT AVE","BROOKHAVEN","PA",19015,"DENTAL","Oral Surgeon"]
[null,331485355,1740204973,"GEORGE  TUNDER","4955 STEUBENVILLE PIKE STE 361","PITTSBURGH","PA",15205,"DENTAL","Oral Surgeon"]
[null,871805611,1831623073,"HECTOR  CUELLAR GONZALEZ","1340 TUSKAWILLA RD STE 108","WINTER SPRINGS","FL",32708,"DENTAL","General Dentist"]
[null,591263586,1831623156,"IAN  DAY","4850 N 9TH AVE STE 4","PENSACOLA","FL",32503,"DENTAL","Oral Surgeon"]
[null,464229264,1972764967,"SRAVANTHI  GANNE","1050 W GRANADA BLVD STE 1","ORMOND BEACH","FL",32174,"DENTAL","Oral Surgeon"]
[null,200185918,1932883477,"CHASE  SIMPSON","250 PALM COAST PKWY NE UNIT 1302","PALM COAST","FL",32137,"DENTAL","General Dentist"]
[null,834404696,1669706198,"RICHARD E BAUER","180 SWINDERMAN RD STE 260","WEXFORD","PA",15090,"DENTAL","Oral Surgeon"]
[null,823482022,1124331004,"MARISA E PATT","5400 IDYLWILD TRL STE A","BOULDER","CO",80301,"DENTAL","Prosthodontist"]
[null,540912688,1447231337,"MELVIN L FORD","2875 SABRE ST #260","VIRGINIA BEACH","VA",23452,"DENTAL","Oral Surgeon"]
[null,474126096,1043748593,"ARIANA  GODOY","2939 US ALT 19","PALM HARBOR","FL",34683,"DENTAL","General Dentist"]
[null,593570970,1790907376,"DOUG Q NGUYEN","18101 HIGHWOODS PRES PKWY #200","TAMPA","FL",33647,"DENTAL","General Dentist"]
[null,272665895,1598927899,"RICHARD C GILBERT","23451 WALDEN CENTER DR STE 100","BONITA SPRINGS","FL",34134,"DENTAL","General Dentist"]
[null,561882327,1013367846,"MARY L BERNE","5041 SIX FORKS RD STE 200","RALEIGH","NC",27609,"DENTAL","Orthodontist"]
[null,472532794,1871012278,"JAHNELLE DANICA MCLENNAN","1003 W PATRICK ST","FREDERICK","MD",21702,"DENTAL","General Dentist"]
[null,813793901,1902287683,"JACOB L SHEPPARD","1165 JEFFERSON GREEN CIR","MIDLOTHIAN","VA",23113,"DENTAL","General Dentist"]
[null,920332248,1114664513,"BRADY  HUANG","1290 BALTIMORE PIKE STE 110","CHADDS FORD","PA",19317,"DENTAL","General Dentist"]
[null,232336900,1316931298,"ROBERT  LASKI","1321 N NEW ST","BETHLEHEM","PA",18018,"DENTAL","Oral Surgeon"]
[null,"020557171",1932279312,"JAMES W WARNER","1100 QUEENSBOROUGH BLVD STE 103","MT PLEASANT","SC",29464,"DENTAL","General Dentist"]
[null,461131621,1982278677,"MORGAN W WYROSDICK","6819 WASHINGTON AVE STE C","OCEAN SPRINGS","MS",39564,"DENTAL","General Dentist"]
[null,830597687,1528750114,"SHAIMAA H AZZUBAIRI","1070 W MERCURY BLVD","HAMPTON","VA",23666,"DENTAL","General Dentist"]
[null,270693847,1801985957,"LIE-YING  PERIU","650 CLASSIC CT","MELBOURNE","FL",32940,"DENTAL","General Dentist"]
[null,320453960,1982856530,"ALEXANDER J MOHEBAN","273 SOUTHWEST CUTOFF","NORTHBOROUGH","MA","01532","DENTAL","General Dentist"]
[null,843576281,1578254173,"LAURA H DIRIENZO","7535 CARPENTER FIRE STATION RD STE 201","CARY","NC",27519,"DENTAL","General Dentist"]
[null,204714412,1649602152,"SHANNON K LEE","3896 N MARTIN L KING BLVD","NORTH LAS VEGAS","NV",89032,"DENTAL","General Dentist"]
[null,341196118,1659449882,"GARY  SCHWEEN","5002 FOOTE RD","MEDINA","OH",44256,"DENTAL","Oral Surgeon"]
[null,854070577,1134416290,"JOHN J MCELVEEN JR","4185 ALTAMONT PL","WHITE PLAINS","MD",20695,"DENTAL","Oral Surgeon"]
[null,233062898,1568646628,"MANSOOR  MADANI","15 PRESIDENTIAL BLVD STE 301","BALA CYNWYD","PA",19004,"DENTAL","Oral Surgeon"]
[null,873534052,1427285758,"CHRISTOPHER D MAZZOLA","555 S GARFIELD AVE","TRAVERSE CITY","MI",49686,"DENTAL","General Dentist"]
[null,954443054,1326108895,"MIRYAM S MIYAMOTO","23333 CINEMA DR STE 200","VALENCIA","CA",91355,"DENTAL","Orthodontist"]
[null,113642490,1316090830,"ANDREW S IN","3307 LINCOLN HWY","THORNDALE","PA",19372,"DENTAL","General Dentist"]
[null,592417087,1255986576,"OTHMAN  REZKI","8845 HAWBUCK ST","TRINITY","FL",34655,"DENTAL","Oral Surgeon"]
[null,263114642,1295995140,"DARREN C PAKRAVAN","2921 N LINCOLN AVE GF","CHICAGO","IL",60657,"DENTAL","Orthodontist"]
[null,200547067,1932729258,"STEVEN D HANCOCK","2606 IRON GATE DR STE 101","WILMINGTON","NC",28412,"DENTAL","Orthodontist"]
[null,921917009,1184636490,"MICHAEL E ANDREWS","400 NATIONWIDE DR","HARRISBURG","PA",17110,"DENTAL","Oral Surgeon"]
[null,592207423,1306072863,"MICHAEL W DELUCIA","2204 ROGERO RD","JACKSONVILLE","FL",32211,"DENTAL","General Dentist"]
[null,200185918,1326527623,"ZIAD  SHANNIS","8267 LITTLE RD","NEW PORT RICHEY","FL",34654,"DENTAL","General Dentist"]
[null,232001368,1427340553,"GEOFFREY S ZINBERG","1075 BERKSHIRE BLVD STE 800","WYOMISSING","PA",19610,"DENTAL","Oral Surgeon"]
[null,592417087,1255986576,"OTHMAN  REZKI","4372 COMMERCIAL WAY","SPRING HILL","FL",34606,"DENTAL","Oral Surgeon"]
[null,651168476,1649302126,"BHARAT  RAKSHAK","1070 N DAVIS RD Ste A2","SALINAS","CA",93907,"DENTAL","General Dentist"]
[null,832782368,1184077000,"CLAY  ALGEO","1406 N SIOUX AVE","CLAREMORE","OK",74017,"DENTAL","General Dentist"]
[null,332900245,1952827123,"MICHAEL ANTHONY ROLFES","4410 S RIDGEWOOD AVE","PORT ORANGE","FL",32127,"DENTAL","General Dentist"]
[null,262656706,1255352142,"DIEGO L OSPINA","3040 SW 27TH AVE # 101","OCALA","FL",34471,"DENTAL","General Dentist"]
[null,920273230,1366824799,"MARTIN N BAKER","1312 COMMERCE DR","NEW BERN","NC",28562,"DENTAL","General Dentist"]
[null,844045777,1386364446,"DOMINIK M ROKITA","33160 US 19 N","PALM HARBOR","FL",34684,"DENTAL","General Dentist"]
[null,620811327,1861595068,"JON A MATHER","1203 N WILCOX DR","KINGSPORT","TN",37660,"DENTAL","General Dentist"]
[null,263219184,1538226550,"ANITA J WELLS","3803 COMPUTER DR STE 200","RALEIGH","NC",27609,"DENTAL","General Dentist"]
[null,260357554,1568479905,"ANTHONY TUONG BUI","4701 N HIGHWAY 19A STE 1","MT DORA","FL",32757,"DENTAL","General Dentist"]
[null,473831321,1174888622,"DONG J PARK","354 SAW MILL RD","WEST HAVEN","CT","06516","DENTAL","General Dentist"]
[null,223689294,1982367785,"JUSTIN  TENBROOK","108 RT 322 UNIT 3","MULLICA HILL","NJ","08062","DENTAL","Orthodontist"]
[null,933835703,1710303425,"ANUJA V PATEL","9170 STATE ROUTE 108 STE 200","COLUMBIA","MD",21045,"DENTAL","General Dentist"]
[null,452441057,1821384900,"ZACHARY R DIXON","1700 UNIVERSITY BLVD STE 105","MORRILTON","AR",72110,"DENTAL","General Dentist"]
[null,582120048,1114985389,"CHRIS  JO","3590 BRASELTON HWY STE 101","DACULA","GA",30019,"DENTAL","Oral Surgeon"]
[null,223707311,1437268190,"LISA  GAMBINO","4 W MAPLE CT","WOODSTOWN","NJ","08098","DENTAL","General Dentist"]
[null,261536032,1851412803,"GINA J LEE","9650 BRIER CREEK PKWY STE 101","RALEIGH","NC",27617,"DENTAL","Orthodontist"]
[null,843075977,1447611629,"MARIELLE  BEAUCHAMP","3890 TURTLE CREEK DR STE A","PORT ORANGE","FL",32127,"DENTAL","General Dentist"]
[null,852402265,1760526024,"WILLIAM J CRUSE","18518 HARDY OAK BLVD STE 200","SAN ANTONIO","TX",78258,"DENTAL","General Dentist"]
[null,933058005,1124401641,"JOHN A WESTRES","8075 SW HIGHWAY 200 STE 114-115","OCALA","FL",34481,"DENTAL","General Dentist"]
[null,270204988,1588116057,"OBADAH  ATTAR","638 UPTOWN BLVD STE 100","CEDAR HILL","TX",75104,"DENTAL","Endodontist"]
[null,934427526,1609287143,"DANIEL B ADAIR","81-990 HALEKII ST STE 130","KEALAKEKUA","HI",96750,"DENTAL","General Dentist"]
[null,473047634,1386002616,"HANNA  LEE","14540 JOHN MARSHALL HWY STE 103","GAINESVILLE","VA",20155,"DENTAL","General Dentist"]
[null,205111039,1558467399,"STACEY M BLUME","4030 SMITH RD STE 225","CINCINNATI","OH",45209,"DENTAL","Periodontist"]
[null,471706456,1346906849,"ARIANA E MERCHI","3848 SUN CITY CENTER BLVD STE 102","RUSKIN","FL",33573,"DENTAL","General Dentist"]
[null,874505729,1861957243,"DARSHAN  PATEL","201 W INTERNATIONAL SPEEDWAY BLVD","DAYTONA BEACH","FL",32114,"DENTAL","General Dentist"]
[null,591299709,1922266915,"JONATHAN  CALDERON","210 JACKSON AVE","SATELLITE BEACH","FL",32937,"DENTAL","General Dentist"]
[null,991966914,1497755102,"GRAIG D BROWN","3148 N SWAN RD","TUCSON","AZ",85712,"DENTAL","Periodontist"]
[null,260681106,1922076348,"GREGORY M CASEY","3388 WOODS EDGE CIR STE 103","BONITA SPRINGS","FL",34134,"DENTAL","Oral Surgeon"]
[null,462262500,1225695786,"ARIANA  FRANK","7350 VAN DUSEN RD STE 440","LAUREL","MD",20707,"DENTAL","General Dentist"]
[null,333940265,1154814960,"CHARLES C YUN","184 THOMAS JOHNSON DR. SUITE 202","FREDERICK","MD",21702,"DENTAL","General Dentist"]
[null,465273634,1467757443,"NOUMAN  BASHIR","1515 WEST CHESTER PIKE UNIT C1","WEST CHESTER","PA",19382,"DENTAL","General Dentist"]
[null,200381365,1790782720,"HILARRY A DOUGLAS","575 W CHANDLER BLVD STE 223","CHANDLER","AZ",85225,"DENTAL","General Dentist"]
[null,471918945,1285656751,"ARTHUR  THURM","925 HADDON AVE","COLLINGSWOOD","NJ","08108","DENTAL","General Dentist"]
[null,814720657,1558463240,"FRED J BONACCI","672N S RIVER ST STE 209","PLAINS","PA",18705,"DENTAL","General Dentist"]
[null,834230311,1952534570,"MICHAEL C WITKOWSKI","2606 GREEN OAK DR","KINGWOOD","TX",77339,"DENTAL","General Dentist"]
[null,562335928,1750317178,"JEFFREY S JELIC","5501 FORTUNES RIDGE DR STE G","DURHAM","NC",27713,"DENTAL","Oral Surgeon"]
[null,853196163,1649654310,"BENJAMIN K CANARY","11 PARK STREET","LEOMINSTER","MA","01453","DENTAL","Orthodontist"]
[null,223092122,1891849394,"CARLYN S PHUCAS","975 TUCKERTON RD STE 201","MARLTON","NJ","08053","DENTAL","Orthodontist"]
[null,223615261,1366782229,"SCOTT I HAIMES","1901 N OLDEN AVENUE EXT STE 28A","EWING","NJ","08618","DENTAL","General Dentist"]
[null,872559781,1619257581,"CARLOS FRANCISCO VILLANUEVA","15641 SHERIDAN ST STE 400","DAVIE","FL",33331,"DENTAL","Prosthodontist"]
[null,844877076,1962801704,"DANIEL  COCRIS","15044 SANDPIPER LANE SUITE 2","NAPLES","FL",34114,"DENTAL","General Dentist"]
[null,833041296,1396808135,"CRAIG J DEAN","8975 W ATLANTIC AVE","DELRAY BEACH","FL",33446,"DENTAL","General Dentist"]
[null,992947495,1013745033,"SMILE DOCTORS OF PENNYSLVANIA PC","127 WEST STREET ROAD STE 201","KENNETT SQUARE","PA",19348,"DENTAL","General Dentist"]
[null,992947495,1275636151,"JEFFREY M HENDRIX","127 WEST STREET ROAD STE 201","KENNETT SQUARE","PA",19348,"DENTAL","Orthodontist"]
[null,611772086,1184170425,"BRETT  BURANA","1234 S HOVER ST STE 100","LONGMONT","CO",80501,"DENTAL","General Dentist"]
[null,842567230,1912784471,"MITALI  LAVANI","9709 REDSTONE DR SUITE 500","FORT MILL","SC",29707,"DENTAL","General Dentist"]
[null,843106452,1164929816,"YOUNGCHI  CHANG","113 SMITH AVE UNIT 5","SHALLOTTE","NC",28470,"DENTAL","General Dentist"]
[null,203741920,1417935172,"DANIEL  TSAO","310 N HILLSIDE ST","WICHITA","KS",67214,"DENTAL","General Dentist"]
[null,557356855,1396981577,"JAMES H KELSO","2255 YGNACIO VALLEY RD STE H","WALNUT CREEK","CA",94598,"DENTAL","Periodontist"]
[null,261544164,1942465869,"RAMA  GOSWAMI","14535 JOHN MARSHALL HWY STE 101","GAINESVILLE","VA",20155,"DENTAL","General Dentist"]
[null,202583278,1083707475,"GLYNDA R MCCONVILLE","1129 CARTHAGE ST","SANFORD","NC",27330,"DENTAL","Orthodontist"]
[null,561580925,1649316241,"WILLIAM S DUNLAP","104 MONTGOMERY DR","ANDERSON","SC",29621,"DENTAL","Oral Surgeon"]
[null,800477874,1558590984,"MELANIE T DAVIS","125 POWELL MILL RD STE C","SPARTANBURG","SC",29301,"DENTAL","General Dentist"]
[null,861083510,1164567301,"JOEL  KLASFELD","630 5TH AVE STE 1870","NEW YORK","NY",10111,"DENTAL","General Dentist"]
[null,833810491,1043274871,"JAVID  HARIRI","5801 RITCHIE HWY","BALTIMORE","MD",21225,"DENTAL","General Dentist"]
[null,932070343,1174600712,"SHAKEEL  AHMED","34 FRANKLIN CORNER RD","LAWRENCEVILLE","NJ","08648","DENTAL","Periodontist"]
[null,822845056,1689883563,"SEPAND  HOKMABADI","3300 WEBSTER ST STE 812","OAKLAND","CA",94609,"DENTAL","General Dentist"]
[null,922827927,1932429198,"JOHN P SOLIMAN","9 HOSPITAL DR STE A6","TOMS RIVER","NJ","08755","DENTAL","Oral Surgeon"]
[null,871396870,1629630074,"ANURAG R GUDETI","1644 BRUCE B DOWNS BLVD","WESLEY CHAPEL","FL",33544,"DENTAL","General Dentist"]
[null,873154623,1376795393,"BARRY L HOLDEN","110 REGENT CT STE 100","STATE COLLEGE","PA",16801,"DENTAL","Periodontist"]
[null,133579806,1003443854,"JUSTIN  SEDAGHAT","750 PARK AVE STE 1A- 1B","NEW YORK","NY",10021,"DENTAL","General Dentist"]
[null,824706277,1336532712,"SOONJAE JOSEPH LEE","2304 CONCORD PIKE","WILMINGTON","DE",19803,"DENTAL","General Dentist"]
[null,384087136,1003157793,"ERIC  FRANK","522 E BROAD ST","WESTFIELD","NJ","07090","DENTAL","Orthodontist"]
[null,271613502,1033367024,"MICHAEL  CARI","201 MARSHALL ST","KENNETT SQUARE","PA",19348,"DENTAL","Orthodontist"]
[null,264431685,1124172879,"JONG S LEE","1331 PENNSYLVANIA AVE NW STE 502","WASHINGTON","DC",20004,"DENTAL","General Dentist"]
[null,475265368,1992809685,"NEIL S WOLOSHIN","125 GREENTREE DR STE 2","DOVER","DE",19904,"DENTAL","General Dentist"]
[null,"043739375",1457598518,"GEORGE RENE NICOLAS","7000 W PALMETTO PARK RD STE 108","BOCA RATON","FL",33433,"DENTAL","Orthodontist"]
[null,"043800812",1184638579,"TEJAL  PATEL","2001 LIBERTY PL","SICKLERVILLE","NJ","08081","DENTAL","Oral Surgeon"]
[null,873235783,1942864392,"HAMIDREZA  GHORBANIPARVAR","6798 OAK HALL LN STE A3","COLUMBIA","MD",21045,"DENTAL","General Dentist"]
[null,880845263,1902053598,"CHARLES  HICKS","100 WHETSTONE PL STE 308","ST AUGUSTINE","FL",32086,"DENTAL","General Dentist"]
[null,814544906,1417202599,"ORRIN L MACKEY","517 S MAIN ST","COTTONWOOD","AZ",86326,"DENTAL","General Dentist"]
[null,922266206,1194133751,"RICHARD A MCKINNEY","907 N MAIN ST","SUMMERVILLE","SC",29486,"DENTAL","Oral Surgeon"]
[null,472327013,1982852612,"JAMES JINWOOK CHUN","120 ELLINGTON BLVD","GAITHERSBURG","MD",20878,"DENTAL","General Dentist"]
[null,832941574,1205123106,"PALLAVI  BATRA","7501 STENTON AVE","PHILADELPHIA","PA",19150,"DENTAL","General Dentist"]
[null,460858514,1922593029,"SARAH M STUART","2402 RICE BLVD # C","HOUSTON","TX",77005,"DENTAL","General Dentist"]
[null,932472173,1043242969,"ERICK J NUNEZ","4782 MARIGOLD AVE","KISSIMMEE","FL",34758,"DENTAL","General Dentist"]
[null,810778869,1285029157,"AMBRE A KRAGOR","1816 EAGLE DR STE 100-B","WOODSTOCK","GA",30189,"DENTAL","General Dentist"]
[null,831324654,1932787504,"JAVIER  GUILLEN RAMIREZ","3751 TAMIAMI TRL E","NAPLES","FL",34112,"DENTAL","General Dentist"]
[null,882878673,1669853065,"RICHARD H FURMAN","687 BLYTHE STREET CT STE B","HENDERSONVILLE","NC",28739,"DENTAL","General Dentist"]
[null,356001673,1467885756,"MONICA P GIBSON","1121 W MICHIGAN ST","INDIANAPOLIS","IN",46202,"DENTAL","Periodontist"]
[null,204116177,1497005748,"LAN  VU","61 S BLACK HORSE PIKE","BLACKWOOD","NJ","08012","DENTAL","General Dentist"]
[null,884216456,1184919334,"ERIC MICHAEL SERRANO","1540 CORNERSTONE BLVD STE 100","DAYTONA BEACH","FL",32117,"DENTAL","Endodontist"]
[null,472949138,1164443297,"SIMON  ROYTBERG","10 MITCHELL PL STE 102","WHITE PLAINS","NY",10601,"DENTAL","General Dentist"]
[null,871396870,1871789461,"OMAR M ZAROU","7208 BENEVA RD","SARASOTA","FL",34238,"DENTAL","General Dentist"]
[null,921399770,1356467930,"SURENDRA GOPAL SIRIVOLU","307 LAGRANDE BLVD","LADY LAKE","FL",32159,"DENTAL","General Dentist"]
[null,454781557,1356901953,"MINJE  KIM","2546 S BROAD ST","PHILADELPHIA","PA",19145,"DENTAL","Endodontist"]
[null,871534276,1740625094,"JOSEPH T FACCIOLO","74 OMEGA DR","NEWARK","DE",19713,"DENTAL","Orthodontist"]
[null,933157524,1699094151,"BROCK ANTHONY PHILIPS","630 ATLANTIC BLVD STE 7","NEPTUNE BEACH","FL",32266,"DENTAL","General Dentist"]
[null,541146055,1689981722,"BYRON  CAPPS","2800 EISENHOWER AVE STE 230","ALEXANDRIA","VA",22314,"DENTAL","Oral Surgeon"]
[null,832643669,1942560099,"MAME ADUBEA  ASAMOAH-ODEI","8175 WESTSIDE BLVD STE A","FULTON","MD",20759,"DENTAL","General Dentist"]
[null,208737121,1457791626,"MEHULKUMAR B ARDESHANA","9690 GLADES RD UNIT 430","BOCA RATON","FL",33434,"DENTAL","General Dentist"]
[null,912184217,1942772926,"PATRICK R ORME","620 E 8TH ST","PORT ANGELES","WA",98362,"DENTAL","General Dentist"]
[null,815249092,1932545266,"SHANE M MARKEY","8412 NEW TOWN RD STE A","WAXHAW","NC",28173,"DENTAL","Orthodontist"]
[null,861490078,1699159392,"ANAIT  BALASANYAN","3614 S PROVIDENCE RD STE 103","WAXHAW","NC",28173,"DENTAL","General Dentist"]
[null,993009008,1578134870,"HAMZA  TARIQ","801 UPLAND AVE APT B","CHESTER","PA",19013,"DENTAL","General Dentist"]
[null,475434669,1073929634,"BLAKE H BURNETT","10185 OCEAN HWY UNIT B","PAWLEYS ISLAND","SC",29585,"DENTAL","General Dentist"]
[null,821052246,1770504201,"GREGORY S SCHWARTZ","2512 E VISTOSO COMMERCE LOOP","ORO VALLEY","AZ",85755,"DENTAL","General Dentist"]
[null,843051844,1003301458,"TYLER  ORN","10160 HIGHWAY 242 STE 100","CONROE","TX",77385,"DENTAL","General Dentist"]
[null,475037240,1023005733,"JANA E BOYD","2900 GODWIN BLVD","SUFFOLK","VA",23434,"DENTAL","General Dentist"]
[null,474019096,1982991329,"JEFFREY SCOTT BIRD","203B RIDGEWATER DR STE 1","POLSON","MT",59860,"DENTAL","General Dentist"]
[null,522136878,1982652053,"PAYAM  HARIRI","2021B EMMORTON RD STE 222","BEL AIR","MD",21015,"DENTAL","Endodontist"]
[null,570703959,1457475188,"CHARLES R CONNER","461 W CHEVES ST","FLORENCE","SC",29501,"DENTAL","General Dentist"]
[null,844919448,1457903866,"SANKET A RATHOD","1861 PLACIDA RD STE 105","ENGLEWOOD","FL",34223,"DENTAL","General Dentist"]
[null,384105402,1811427073,"SAMIP A PATEL","13410 E MARY ANN CLEVELAND WAY","VAIL","AZ",85641,"DENTAL","General Dentist"]
[null,472443444,1235346164,"MATTHEW W CLINE","2212 JOHN ROLFE PKWY","RICHMOND","VA",23233,"DENTAL","Orthodontist"]
[null,"050539365",1477633576,"ANGELA  BERKOVICH","1348 E HILLSBORO BLVD STE A","DEERFIELD BEACH","FL",33441,"DENTAL","General Dentist"]
[null,462931351,1619380888,"KARISA  CARROLL","2140 VOORHEES TOWN CTR","VOORHEES","NJ","08043","DENTAL","Pediatric Dentist"]
[null,251410772,1013350057,"GARY R EGGLER","1470 INDIAN SPRINGS RD UNIT 1","INDIANA","PA",15701,"DENTAL","Periodontist"]
[null,463277773,1497216055,"ALYSSA  SOUTHARD","5003 EDGMONT AVE","BROOKHAVEN","PA",19015,"DENTAL","General Dentist"]
[null,831943793,1093944035,"ANTHONY R CASTELLANO","1118 W MAIN ST","RICHMOND","VA",23220,"DENTAL","General Dentist"]
[null,830356334,1861513335,"GARY  REZNIK","1816 EMMORTON RD","BEL AIR","MD",21015,"DENTAL","General Dentist"]
[null,561580925,1578638177,"ISAAC E DAVIS","109 REED AVE","LEXINGTON","SC",29072,"DENTAL","Oral Surgeon"]
[null,991178546,1407964273,"DIANA H RAULSTON","250 W LANCASTER AVE STE 130","FORT WORTH","TX",76102,"DENTAL","General Dentist"]
[null,874415754,1023136843,"TANYA  STAVISKY","279 S BROADWAY","PENNSVILLE","NJ","08070","DENTAL","Orthodontist"]
[null,221906385,1063611523,"JANINE  TRINDADE","400 GREENTREE RD","SEWELL","NJ","08080","DENTAL","Orthodontist"]
[null,900935286,1114696671,"THERIN  BAUM","115 COMMONS WAY STE 101","KALISPELL","MT",59901,"DENTAL","General Dentist"]
[null,271758427,1992910673,"THOMAS C STEET","1142 EXECUTIVE CIR","CARY","NC",27511,"DENTAL","General Dentist"]
[null,432078776,1982685160,"RICHARD S MALEK","161 EAST AVE STE 201","NORWALK","CT","06851","DENTAL","General Dentist"]
[null,465260232,1750010609,"GEFEI  WANG","460 KELLER PKWY STE C 2","KELLER","TX",76248,"DENTAL","General Dentist"]
[null,450584482,1215158142,"MARC J PUKENAS","3069 ENGLISH CREEK AVE STE 304","EGG HARBOR TOWNSHIP","NJ","08234","DENTAL","General Dentist"]
[null,842656919,1366594434,"MENGCHI S YANG","16011 LANCASTER HWY STE D","CHARLOTTE","NC",28277,"DENTAL","General Dentist"]
[null,863119749,1033350533,"SUZZANE  LORINO","1550 MATTHEW DR","FORT MYERS","FL",33907,"DENTAL","General Dentist"]
[null,931888863,1356848022,"OLUBUSOLA OLAOLUWA ADEGABI","6911 LAUREL BOWIE RD STE 204","BOWIE","MD",20715,"DENTAL","General Dentist"]
[null,822272495,1558048264,"TZICHA J WANG","474 HURFFVILLE CROSSKEYS RD SUITE A","SEWELL","NJ","08080","DENTAL","Periodontist"]
[null,272183157,1275140535,"BYEONGUK  KANG","220 LILLY RD NE STE A","OLYMPIA","WA",98506,"DENTAL","Periodontist"]
[null,461309347,1487930640,"NICHOLAS E DANIEL","1610 WEST ST STE 202","ANNAPOLIS","MD",21401,"DENTAL","General Dentist"]
[null,232650922,1215094875,"JAGAISHWAR P SINGH","408 N 63RD ST","PHILADELPHIA","PA",19151,"DENTAL","General Dentist"]
[null,844427450,1831532829,"ANGEL F MOGROVEJO FAJARDO","461 MCLAWS CIR STE 1","WILLIAMSBURG","VA",23185,"DENTAL","Periodontist"]
[null,271066396,1568634400,"HONGMEI  YANG","3309 EDGMONT AVE","BROOKHAVEN","PA",19015,"DENTAL","General Dentist"]
[null,820562632,1700402435,"TRISTAN  LUNSFORD","25 CLARK SUMMIT DR STE 100","BLUFFTON","SC",29910,"DENTAL","General Dentist"]
[null,832595810,1922488139,"MOHAMED  OMAR","1486 BLACKWOOD CLEMENTON RD","CLEMENTON","NJ","08021","DENTAL","General Dentist"]
[null,364309803,1154490829,"FELICIA  CHU","750 FLETCHER DR STE 302","ELGIN","IL",60123,"DENTAL","General Dentist"]
[null,"061654506",1891903944,"ROBERT C HEDGEPATH","1001 10TH AVE S UNT 218","NAPLES","FL",34102,"DENTAL","General Dentist"]
[null,461962947,1437549011,"EUGENE A SAMBATARO","5012 DORSEY HALL DR #205","ELLICOTT CITY","MD",21042,"DENTAL","General Dentist"]
[null,464364511,1124318571,"BRIAN S PODBESEK","41 SOUTH MEDICAL PARK DR SUITE 100","FISHERSVILLE","VA",22939,"DENTAL","General Dentist"]
[null,332586998,1578350807,"AMER  SBEIH","651 NAUTICA DR UNIT 1","JACKSONVILLE","FL",32218,"DENTAL","General Dentist"]
[null,472599165,1982716890,"SYLVIA Y DE LA ROSA","802 S LOOP 499 STE 1","HARLINGEN","TX",78550,"DENTAL","General Dentist"]
[null,920862580,1376161927,"COLE  CHESTER","415 PENNINGTON AVE STE 100","HAVRE DE GRACE","MD",21078,"DENTAL","General Dentist"]
[null,843522851,1194890020,"ANTHONY DUGINS ENGLE","2323 MOODY PKWY","MOODY","AL",35004,"DENTAL","General Dentist"]
[null,995004029,1437260148,"STEPHANIE  DIAZ","459 W CALL ST","STARKE","FL",32091,"DENTAL","General Dentist"]
[null,200185918,1174367213,"MICHEL  VALLADARES","8615 COLLIER BLVD","NAPLES","FL",34114,"DENTAL","General Dentist"]
[null,841785637,1174177703,"PRATHIBHA  MUDALAPURAM","346 SEMBLER LN","CARY","NC",27519,"DENTAL","General Dentist"]
[null,990969544,1194840983,"JOEL A SILMAN","3611 PERKIOMEN AVE","READING","PA",19606,"DENTAL","General Dentist"]
[null,833576196,1174045322,"KATELYN D SUNDIN","849 W OGLETHORPE HWY STE 140","HINESVILLE","GA",31313,"DENTAL","General Dentist"]
[null,810686663,1376396473,"EYMAN S ZAITAR","29 TANYARD STATION DR","BARBOURSVILLE","WV",25504,"DENTAL","General Dentist"]
[null,510321801,1548527104,"FADI N KOSA","2001 CONCORD PIKE STE 200","WILMINGTON","DE",19803,"DENTAL","Oral Surgeon"]
[null,825286485,1396093050,"ALEXANDER S TRAN","82151 AVENUE 42 STE 110","INDIO","CA",92203,"DENTAL","General Dentist"]
[null,271487691,1073863817,"EVA K CHEN","30 E 40TH ST RM 105","NEW YORK","NY",10016,"DENTAL","General Dentist"]
[null,871740402,1417399171,"ANDREW  MULLET","1301 PLANTATION ISLAND DR S STE 104B","SAINT AUGUSTINE","FL",32080,"DENTAL","General Dentist"]
[null,881118070,1609948645,"MITESH G BRAHMBHATT","3886 BEMISS RD STE C","VALDOSTA","GA",31605,"DENTAL","General Dentist"]
[null,853159532,1336462613,"GUOQIANG  GUAN","479 THOMAS JONES WAY STE 150","EXTON","PA",19341,"DENTAL","Orthodontist"]
[null,464991279,1477980456,"ANDREW M APPEL","6801 RIDGE AVE STE 2","PHILADELPHIA","PA",19128,"DENTAL","Orthodontist"]
[null,462776357,1619118197,"CHRISTINE D FERRELL","501 HANNUM AVE","WEST CHESTER","PA",19380,"DENTAL","Orthodontist"]
[null,261608760,1811059678,"CHRISTOPHER C JERNIGAN","306 CHANNEL DR","COLUMBIA","SC",29229,"DENTAL","Orthodontist"]
[null,232911630,1144383183,"RICHARD C HAYES","3920 PYLE RD","CHADDS FORD","PA",19317,"DENTAL","Orthodontist"]
[null,861535819,1346430840,"GEORGE  SANDAU","658 W CUTHBERT BLVD","WESTMONT","NJ","08108","DENTAL","Oral Surgeon"]
[null,830962504,1841922606,"SETH  CALISH","425 CITRUS TOWER BLVD STE 101","CLERMONT","FL",34711,"DENTAL","General Dentist"]
[null,453994765,1902117104,"MATTHEW JOHN HOLTAN","12052 TAMIAMI TRL N","NAPLES","FL",34110,"DENTAL","General Dentist"]
[null,201705922,1538397161,"NEIL R ZACHS","20950 N TATUM BLVD STE 210","PHOENIX","AZ",85050,"DENTAL","Periodontist"]
[null,472532794,1912216854,"JAE H KIM","2412 N SALISBURY BLVD STE A","SALISBURY","MD",21801,"DENTAL","Oral Surgeon"]
[null,473431193,1144454182,"JEFFREY W GOLDFINE","555 E CITY AVE LBBY 100","BALA CYNWYD","PA",19004,"DENTAL","General Dentist"]
[null,462158764,1528258779,"JESSICA  DICERBO DIPIETRO","424 SAVANNAH RD","LEWES","DE",19958,"DENTAL","Pediatric Dentist"]
[null,650836044,1336347012,"JERONIMO  GUZMAN","1025 MILITARY TRL STE 110","JUPITER","FL",33458,"DENTAL","Oral Surgeon"]
[null,202784939,1912346586,"DANIEL G LEE","3070 HWY 17 N STE 102","MOUNT PLEASANT","SC",29466,"DENTAL","Oral Surgeon"]
[null,871575977,1669454633,"JAMES M CROUSE","1413 WESLEY DRIVE","SALISBURY","MD",21801,"DENTAL","Orthodontist"]
[null,"045604189",1255324125,"JEFFREY  BURNS","933 HARTFORD TPK","VERNON","CT","06066","DENTAL","General Dentist"]
[null,833313083,1710006424,"DAVID S QUERIDO","1189 E PULASKI HWY","ELKTON","MD",21921,"DENTAL","General Dentist"]
[null,993647481,1609392778,"MICHAEL T GAFFNEY","1515 N FLAGLER DR STE 520","WEST PALM BEACH","FL",33401,"DENTAL","General Dentist"]
[null,202784939,1205873114,"EDWARD R STRAUSS","3700 INGLESIDE BLVD STE 101","LADSON","SC",29456,"DENTAL","Oral Surgeon"]
[null,814557964,1346247376,"MALEK  FANSA","9620 E 59TH ST","INDIANAPOLIS","IN",46216,"DENTAL","General Dentist"]
[null,462984148,1316062011,"GEORGE K CAMP","32 MALPHRUS RD STE 115","BLUFFTON","SC",29910,"DENTAL","General Dentist"]
[null,"020334854",1083685374,"KEITH C KEALEY","16 AIRPORT RD","W LEBANON","NH","03784","DENTAL","Oral Surgeon"]
[null,843359627,1386076081,"JEFFREY S EVERS","160 S POWER RD","MESA","AZ",85206,"DENTAL","General Dentist"]
[null,233101899,1760439228,"MICHAEL S DESALVO","860 FIRST AVE SUITE 3","KING OF PRUSSIA","PA",19406,"DENTAL","Oral Surgeon"]
[null,951959423,1578818134,"DEREK J HAVAS","306 WALNUT AVE STE 26","SAN DIEGO","CA",92103,"DENTAL","Oral Surgeon"]
[null,"020618170",1790706356,"MICHAEL L SHAPIRO","45 SLOCUM RD","NORTH DARTMOUTH","MA","02747","DENTAL","Periodontist"]
[null,811882121,1760823892,"NADER  AFGAN","100 CRAIN HWY S","GLEN BURNIE","MD",21061,"DENTAL","General Dentist"]
[null,453113931,1518459312,"CARLOS H RIBEIRO CAMARGO","796 EAST ST","PITTSBORO","NC",27312,"DENTAL","Endodontist"]
[null,271795416,1639475304,"TERRY  SPURLIN MOORE","808 KIRKWOOD AVE","NASHVILLE","TN",37204,"DENTAL","General Dentist"]
[null,721399428,1306021969,"CHRISTOPHER S MCMANUS","921 PLANTATION BLVD","FAIRHOPE","AL",36532,"DENTAL","Endodontist"]
[null,233077648,1437249562,"PREETHA D KESARI","480 LANCASTER AVE","FRAZER","PA",19355,"DENTAL","General Dentist"]
[null,833222586,1962799767,"ANDREW  AZIZ","2100 OLD FARM DR STE 1B","FREDERICK","MD",21702,"DENTAL","General Dentist"]
[null,262075973,1629111596,"KERRI L WHITE","200 W PALMETTO PARK RD STE 103","BOCA RATON","FL",33432,"DENTAL","General Dentist"]
[null,873780957,1235021882,"MUHAMMAD  AWAN","775 N FERDON BLVD STE A","CRESTVIEW","FL",32536,"DENTAL","General Dentist"]
[null,872509229,1558852517,"RACHEL WALSH REILLY","2416 W DARBY RD","HAVERTOWN","PA",19083,"DENTAL","General Dentist"]
[null,954665677,1861631228,"RICHARD  PAK","607 N TUSTIN ST","ORANGE","CA",92867,"DENTAL","Endodontist"]
[null,208510369,1376982397,"MARK J MIZZELL JR","7701 WHITE HORSE ROAD","GREENVILLE","SC",29611,"DENTAL","General Dentist"]
[null,465644948,1881706232,"AMY G DOAN","1601 E BAY DR STE 1","LARGO","FL",33771,"DENTAL","General Dentist"]
[null,"020618170",1245361609,"JOHN T VEALE","45 SLOCUM RD","NORTH DARTMOUTH","MA","02747","DENTAL","General Dentist"]
[null,823376215,1205083490,"ANDREW S CHANDLER","8720 NORTH PARK BLVD STE C","CHARLESTON","SC",29406,"DENTAL","Endodontist"]
[null,263974066,1235308776,"DANIEL E STEVENS","2535 TRUXTUN RD STE 200","SAN DIEGO","CA",92106,"DENTAL","General Dentist"]
[null,833615548,1629286703,"STEPHEN M VARIPATIS","8502 HARFORD RD STE 1","PARKVILLE","MD",21234,"DENTAL","General Dentist"]
[null,233101899,1285663534,"MICHAEL A BIANCHI","26 S BRYN MAWR AVE","BRYN MAWR","PA",19010,"DENTAL","Oral Surgeon"]
[null,232815882,1003547829,"MAX  BLUMENTHAL","6 ORIOLE AVE","MEDIA","PA",19063,"DENTAL","General Dentist"]
[null,216526780,1396902102,"RICHARD C GARRIGAN","1 BARRINGTON PL STE 101","BEL AIR","MD",21014,"DENTAL","General Dentist"]
[null,522069772,1851304349,"JEFFREY B JARVIS","1130 BALTIMORE BLVD STE A","WESTMINSTER","MD",21157,"DENTAL","Orthodontist"]
[null,"061652496",1851829030,"KATIE  CHANG","10710 BARKER CYPRESS RD STE A","CYPRESS","TX",77433,"DENTAL","General Dentist"]
[null,201272092,1255823076,"MONA  DURANI","775 E MERRITT ISLAND CSWY STE 220","MERRITT ISLAND","FL",32952,"DENTAL","General Dentist"]
[null,200185918,1003268525,"DENIS  MONZIN","5935 LAKEWOOD RANCH BLVD","BRADENTON","FL",34211,"DENTAL","General Dentist"]
[null,200120892,1841859238,"MEGANN  ABEDINI","2901 DUTTON MILL RD STE 210","ASTON","PA",19014,"DENTAL","Pediatric Dentist"]
[null,452546142,1467643239,"KENNETH S LISZEWSKI","1810 59TH ST W UNIT A","BRADENTON","FL",34209,"DENTAL","General Dentist"]
[null,540882399,1689910101,"BENJAMIN T OVERSTREET","11301 POLO PL STE B","MIDLOTHIAN","VA",23113,"DENTAL","General Dentist"]
[null,452546142,1609009463,"TOSHA RENAE WILLIAMS","6010 N LOCKWOOD RIDGE RD","SARASOTA","FL",34243,"DENTAL","General Dentist"]
[null,341819779,1639516081,"ALISON M JOHNSON","210 W AIRPORT HWY","SWANTON","OH",43558,"DENTAL","General Dentist"]
[null,581292216,1487727012,"BRIAN A SMITH","132 SOUTHERN BLVD","SAVANNAH","GA",31405,"DENTAL","General Dentist"]
[null,825470730,1447543939,"AIMEE M LEIBOWITZ","522 E BROAD ST","WESTFIELD","NJ","07090","DENTAL","Pediatric Dentist"]
[null,232788290,1598865792,"YIU MAN M KO","11601 BUSTLETON AVE","PHILADELPHIA","PA",19116,"DENTAL","General Dentist"]
[null,992212833,1114301603,"TYLER J HICKS","9825 E BELL RD STE 140","SCOTTSDALE","AZ",85260,"DENTAL","General Dentist"]
[null,205875051,1104830512,"PAUL  BOERMAN","44 TIMBER LN","S BURLINGTON","VT","05403","DENTAL","Oral Surgeon"]
[null,333696204,1174191365,"NATHAN  BUCK","201 OKATIE VILLAGE DR STE 4","OKATIE","SC",29909,"DENTAL","General Dentist"]
[null,843576281,1093332017,"MATTHEW C SMITH","7535 CARPENTER FIRE STATION RD STE 201","CARY","NC",27519,"DENTAL","General Dentist"]
[null,851687846,1801823216,"TODD IVAN EGGLESTON","13535 HAUSMAN PASS STE 102A","SAN ANTONIO","TX",78249,"DENTAL","Oral Surgeon"]
[null,472795083,1255411278,"JEFFREY D HARTMAN","524 WASHINGTON ST","HUNTINGDON","PA",16652,"DENTAL","General Dentist"]
[null,331259127,1033926340,"ADITI  PATEL","1021 OLD YORK RD STE 201","ABINGTON","PA",19001,"DENTAL","General Dentist"]
[null,232766120,1376561076,"JOHN R SPAGNUOLO","189 S RIVER ST","PLAINS","PA",18705,"DENTAL","General Dentist"]
[null,811318074,1609008556,"VENKATESWAR R KAPA","219 E MAIN ST STE 113","MECHANICSBURG","PA",17055,"DENTAL","General Dentist"]
[null,475265368,1336532712,"SOONJAE JOSEPH LEE","125 GREENTREE DR STE 2","DOVER","DE",19904,"DENTAL","General Dentist"]
[null,880212245,1730349879,"BRUCE E CROWLEY","9510 W SAHARA AVE STE 100","LAS VEGAS","NV",89117,"DENTAL","General Dentist"]
[null,233102117,1205847696,"SCOTT K SMITH","357 S GULPH RD STE 250","KING OF PRUSSIA","PA",19406,"DENTAL","Periodontist"]
[null,133675172,1184796534,"WILLIAM A LIMONGELLI","12 WARBURTON AVE","YONKERS","NY",10701,"DENTAL","General Dentist"]
[null,452531760,1235423997,"JOSSUE  ALFONSO","351 NW 42 AVENUE STE 402","MIAMI","FL",33126,"DENTAL","General Dentist"]
[null,464565917,1811017007,"VLADIMIR  FEDIN","919 N MICHIGAN AVE STE 3C","CHICAGO","IL",60611,"DENTAL","General Dentist"]
[null,473654864,1437796182,"JASMINE T THOMAS","1040 N RANGELINE RD STE B","CARMEL","IN",46032,"DENTAL","General Dentist"]
[null,203541143,1437374964,"THOMAS R O LEARY","16419 NORTHCROSS DR STE E","HUNTERSVILLE","NC",28078,"DENTAL","General Dentist"]
[null,825449539,1790910859,"ARCHANA R REJINTALA","24805 PINEBROOK RD ST 212","SOUTH RIDING","VA",20152,"DENTAL","General Dentist"]
[null,202077879,1366561623,"DANIEL G VISEL","2214 W PALMETTO ST","FLORENCE","SC",29501,"DENTAL","General Dentist"]
[null,872629551,1245848332,"HOWARD C TSOI","215 MILLER AVE","SOUTH SAN FRANCISCO","CA",94080,"DENTAL","General Dentist"]
[null,844290723,1457791030,"BRUNA  LOUNSBERRY","2501 S HWY 27","CLERMONT","FL",34711,"DENTAL","General Dentist"]
[null,992271701,1336436872,"VIVEK  SOLANKI","2699 1ST AVE N","SAINT PETERSBURG","FL",33713,"DENTAL","General Dentist"]
[null,853963843,1326177551,"OTTO L HEROD","1313 PETERSBURG ST","CASTROVILLE","TX",78009,"DENTAL","General Dentist"]
[null,861879655,1932656816,"DELESHEA  BLISSETT","3841 MAIN ST","COLLEGE PARK","GA",30337,"DENTAL","General Dentist"]
[null,202264453,1285651257,"LISA A MARVIL","17341 PICKWICK DR STE B","PURCELLVILLE","VA",20132,"DENTAL","Periodontist"]
[null,932156473,1770078503,"MICHAEL  HAMPTON","344 S YELLOWSTONE DR","MADISON","WI",53705,"DENTAL","General Dentist"]
[null,900231650,1619945078,"MARK D ANDERSON","3625 CANAL ST","NEW ORLEANS","LA",70119,"DENTAL","General Dentist"]
[null,921773564,1427617000,"HENRIQUE F SILVA","216 N MAIN ST","TRENTON","FL",32693,"DENTAL","General Dentist"]
[null,592209155,1851732325,"AMY ACKLEY MORIEL","1530 PINEHURST DR","SPRING HILL","FL",34606,"DENTAL","General Dentist"]
[null,841216527,1699880328,"PERRI L CARNES","7889 S LINCOLN CT STE 205","LITTLETON","CO",80122,"DENTAL","Endodontist"]
[null,233060530,1861554313,"PAUL D FISCHER","2301 E ALLEGHENY AVE","PHILADELPHIA","PA",19134,"DENTAL","General Dentist"]
[null,274669115,1457424723,"JASON D MUCK","3149 LINCOLN HWY","THORNDALE","PA",19372,"DENTAL","General Dentist"]
[null,221915422,1225069578,"DOMENIC  CAPRICE","1318 SOUTH MAIN RD BLDG 4B","VINELAND","NJ","08360","DENTAL","Oral Surgeon"]
[null,383176563,1003433806,"MATTHEW W FERGUSON","8670 FERRY ST","MONTAGUE","MI",49437,"DENTAL","General Dentist"]
[null,"030581017",1487821138,"JONATHAN A SIEGEL","1818 MARKET ST STE 100","PHILADELPHIA","PA",19103,"DENTAL","General Dentist"]
[null,232750077,1205977402,"DAVID J WEINSTOCK","15 PRESIDENTIAL BLVD STE 201","BALA CYNWYD","PA",19004,"DENTAL","Periodontist"]
[null,834330867,1174659445,"ALI S HUSAIN","51 HUNTFIELD DR STE 200","SMYRNA","DE",19977,"DENTAL","Orthodontist"]
[null,134334999,1144925413,"PETER GABRIEL MARATTO","14884 TAMIAMI TRL","NORTH PORT","FL",34287,"DENTAL","General Dentist"]
[null,833309302,1750070991,"HARRISON  CONNER","624 W PALMER ST","FRANKLIN","NC",28734,"DENTAL","General Dentist"]
[null,874732079,1013316983,"MATTHEW  SILVER","596 LANCASTER AVE STE 100","MALVERN","PA",19355,"DENTAL","Orthodontist"]
[null,814805611,1649460718,"SCOTT  LEVY","1215 W BALTIMORE PIKE STE 9","MEDIA","PA",19063,"DENTAL","Endodontist"]
[null,882463754,1699384834,"JAYASHREE R THORAT","712A TRENTON RD","LANGHORNE","PA",19047,"DENTAL","General Dentist"]
[null,450539511,1093952053,"MARISOL  GARCIA","71 HOOK SQ","MIAMI SPRINGS","FL",33166,"DENTAL","General Dentist"]
[null,200185918,1477280055,"ZAYDA  HUBERT REYES","4289 S HIGHWAY 27","CLERMONT","FL",34711,"DENTAL","General Dentist"]
[null,201932296,1730896101,"FARAZ  SHAMSI","11855 HOLLY LN STE 103","WALDORF","MD",20601,"DENTAL","General Dentist"]
[null,872132949,1699089086,"KEVIN W SNYDER","311 BLANDING BLVD STE 7","ORANGE PARK","FL",32073,"DENTAL","General Dentist"]
[null,465329631,1225622830,"BLAKE  MA","419 MIDDLE TPKE W","MANCHESTER","CT","06040","DENTAL","General Dentist"]
[null,310839904,1134154727,"STEVEN K HOAGLAND","77 S LIBERTY ST STE 1A","POWELL","OH",43065,"DENTAL","General Dentist"]
[null,384105402,1558974121,"STEPHEN A MCCOMAS","13410 E MARY ANN CLEVELAND WAY","VAIL","AZ",85641,"DENTAL","General Dentist"]
[null,223689294,1336652239,"JAGDESH  DUDANI","508 SHILOH PKE","BRIDGETON","NJ","08302","DENTAL","Orthodontist"]
[null,994989830,1912216854,"JAE H KIM","213 MARLBORO AVE","EASTON","MD",21601,"DENTAL","Oral Surgeon"]
[null,833178818,1235500018,"KHALID N SADEDDIN","300 N SHARAF RD STE 108","RED OAK","TX",75154,"DENTAL","General Dentist"]
[null,830356334,1235796491,"STEPHANIE  SPITZNAGEL","1816 EMMORTON RD","BEL AIR","MD",21015,"DENTAL","General Dentist"]
[null,300702618,1801143441,"MARK A DINDAL","18779 S NOGALES HWY STE 100","GREEN VALLEY","AZ",85614,"DENTAL","General Dentist"]
[null,844533929,1548044365,"MITUL  AHMED","9031 US HIGHWAY 42 STE A","UNION","KY",41091,"DENTAL","General Dentist"]
[null,200040163,1205927696,"GREGORY S VANCE","3285 BLAZER PKWY STE 110","LEXINGTON","KY",40509,"DENTAL","Periodontist"]
[null,222692491,1962571224,"CONDRA  GAINES","2 WASHINGTON AVE","IRVINGTON","NJ","07111","DENTAL","General Dentist"]
[null,200185918,1083281620,"CHRISTOPHER  NORRIS","5245 BIG PINE WAY STE 103","FORT MYERS","FL",33907,"DENTAL","General Dentist"]
[null,822842586,1285967521,"BRIAN  SLIGHLY","3550 S GENERAL BRUCE DR STE 103D","TEMPLE","TX",76504,"DENTAL","Prosthodontist"]
[null,920193736,1164863643,"ALYSSA R COBB","2647 BULVERDE RD","BULVERDE","TX",78163,"DENTAL","General Dentist"]
[null,204535029,1841251667,"BRIAN  BENSON","100 SPILLMAN CT","TRAVELERS REST","SC",29690,"DENTAL","General Dentist"]
[null,832724148,1588978761,"MICHAEL F TROFA","148 EAST AVE STE 2J","NORWALK","CT","06851","DENTAL","Oral Surgeon"]
[null,200030858,1487182507,"BRYANT H WOOTEN","915 KILDAIRE FARM RD","CARY","NC",27511,"DENTAL","General Dentist"]
[null,204829655,1467665299,"AMIR  BARATI","5045 SWAMP RD STE 101","FOUNTAINVILLE","PA",18923,"DENTAL","General Dentist"]
[null,356001673,1790721991,"VANCHIT  JOHN","1121 W MICHIGAN ST","INDIANAPOLIS","IN",46202,"DENTAL","Periodontist"]
[null,861687865,1124422043,"MYLY  RUFF","2009 MAIN ST","CHESTER","MD",21619,"DENTAL","General Dentist"]
[null,472932519,1154610533,"BEHNAZ  GAREMANI","718 10TH AVENUE","NEW YORK","NY",10019,"DENTAL","General Dentist"]
[null,872623505,1124568993,"JOSE M ALVAREZ","8057 BREWERTON RD","CICERO","NY",13039,"DENTAL","General Dentist"]
[null,522153469,1902979016,"KELLY L FOSTER","110 W TIMONIUM RD STE 2A","TIMONIUM","MD",21093,"DENTAL","General Dentist"]
[null,223657222,1962061556,"TIMOTHY  PARSONS","285 S CHURCH ST STE 7","MOORESTOWN","NJ","08057","DENTAL","Periodontist"]
[null,884139525,1487000998,"YESELL  CANDELARIO BENITEZ","198 S NOVA RD","ORMOND BEACH","FL",32174,"DENTAL","General Dentist"]
[null,650972240,1326156324,"CARA D OVERBECK","1040 E VENICE AVE","VENICE","FL",34285,"DENTAL","General Dentist"]
[null,833222586,1962799767,"ANDREW  AZIZ","2407 WHITTIER DR","FREDERICK","MD",21702,"DENTAL","General Dentist"]
[null,233051080,1982024600,"ALEXANDER  APPLE","5000 CHICHESTER AVE","ASTON","PA",19014,"DENTAL","Orthodontist"]
[null,922059494,1407516487,"SUKHBIR KAUR  DHALIWAL","14203 COASTAL HWY STE 1","OCEAN CITY","MD",21842,"DENTAL","General Dentist"]
[null,472873127,1881422780,"DAVID W CHOI","18 DOWLING VILLAGE BLVD","NORTH SMITHFIELD","RI","02896","DENTAL","General Dentist"]
[null,463448481,1952561730,"ANN  CHERNYAK","380 MIDDLETOWN BLVD STE 712","LANGHORNE","PA",19047,"DENTAL","Periodontist"]
[null,813189579,1184076291,"DOMENIC  LOMBARDI","60 N MERCER AVE","SHARPSVILLE","PA",16150,"DENTAL","General Dentist"]
[null,392799807,1134587934,"ERIC  SILVER","104 BALTIMORE PIKE","SPRINGFIELD","PA",19064,"DENTAL","Oral Surgeon"]
[null,201621350,1083671515,"BRUCE J CUTILLI","809 N BETHLEHEM PIKE","SPRING HOUSE","PA",19477,"DENTAL","Oral Surgeon"]
[null,203296691,1578134870,"HAMZA  TARIQ","2675 E CUMBERLAND ST","PHILADELPHIA","PA",19125,"DENTAL","General Dentist"]
[null,232857585,1275619553,"JEFFREY R BRENNER","283 2ND STREET PIKE STE 140","SOUTHAMPTON","PA",18966,"DENTAL","General Dentist"]
[null,"010418322",1245725431,"ANDREW  EMERY","5 COMMUNITY DR","AUGUSTA","ME","04330","DENTAL","Oral Surgeon"]
[null,521233484,1629092481,"JAMES B WOODDELL","3102 DAVIDSONVILLE RD","DAVIDSONVILLE","MD",21035,"DENTAL","General Dentist"]
[null,272829923,1194928655,"PATRICIA  WARDIUS","560 KEMPSVILLE RD STE 200","CHESAPEAKE","VA",23320,"DENTAL","General Dentist"]
[null,545673111,1700883923,"FRANKLIN C LACKEE","419 E MAIN ST STE 202","MIDDLETOWN","NY",10940,"DENTAL","General Dentist"]
[null,833803175,1831449206,"HUGH  DOWDY III","700 S SYCAMORE ST STE 17","PETERSBURG","VA",23803,"DENTAL","General Dentist"]
[null,911665549,1447906359,"MATTHEW D SPALTI","2086 MAIN ST","FERNDALE","WA",98248,"DENTAL","General Dentist"]
[null,200185918,1861178451,"NICOLE  LAURITSEN","1339 N SUMTER BLVD","NORTH PORT","FL",34286,"DENTAL","General Dentist"]
[null,133408472,1790774271,"DAVID M FRAENKEL","2374 GRAND CONCOURSE","BRONX","NY",10458,"DENTAL","General Dentist"]
[null,824352722,1497983019,"MARK R STRANG","714 N BETHLEHEM PIKE STE 100","LOWER GWYNEDD","PA",19002,"DENTAL","General Dentist"]
[null,920233649,1326639287,"NILESH  PATEL","372 N SUNRISE AVE STE 200","ROSEVILLE","CA",95661,"DENTAL","General Dentist"]
[null,953070006,1689770869,"ROBERT J LYTLE","500 N CENTRAL AVE STE 710","GLENDALE","CA",91203,"DENTAL","Oral Surgeon"]
[null,203067055,1942343264,"ALLEN A ZARRINFAR","850 E MAIN ST STE D","PURCELLVILLE","VA",20132,"DENTAL","General Dentist"]
[null,994689102,1942835822,"AMANDA  VEDROS","7115 GEORGE WASHINGTON MEMORIAL HWY","GLOUCESTER","VA",23061,"DENTAL","General Dentist"]
[null,474815921,1396975777,"HARBPINDER  SHEVCHENKO","55 HIGH ST STE 202","HAMPTON","NH","03842","DENTAL","General Dentist"]
[null,263850834,1407548803,"PHACHARA  STANCU","110 TRENTON AVE STE 1","BARRINGTON","NJ","08007","DENTAL","General Dentist"]
[null,204045283,1558559807,"VICTOR  LEUNG","132 CENTRAL ST STE 103","FOXBORO","MA","02035","DENTAL","General Dentist"]
[null,651239333,1063485654,"JAY  NESVOLD","278 LAFAYETTE RD BLDG E","PORTSMOUTH","NH","03801","DENTAL","General Dentist"]
[null,561580925,1710052311,"CHARLES  MIYAJI","112 SALUDA RIDGE CT STE 400","WEST COLUMBIA","SC",29169,"DENTAL","Oral Surgeon"]
[null,260650512,1639149834,"SCOTT R GOODOVE","1127 FIRST COLONIAL RD","VIRGINIA BEACH","VA",23454,"DENTAL","Oral Surgeon"]
[null,475376619,1114941275,"PATRICK M MCDONOUGH","2808 VILLAGE WAY","TRENT WOODS","NC",28562,"DENTAL","Periodontist"]
[null,"020413859",1548463714,"H J LUDINGTON","288 LAFAYETTE RD","PORTSMOUTH","NH","03801","DENTAL","Endodontist"]
[null,990250982,1518309145,"RASHEED B SIDDIQUI","91-5431 KAPOLEI PKWY STE 1707","KAPOLEI","HI",96707,"DENTAL","General Dentist"]
[null,421594304,1558520494,"ARVIND K VAKANI","1963 SE FEDERAL HWY","STUART","FL",34994,"DENTAL","Orthodontist"]
[null,204804773,1740853019,"MORGAN Q ABRAHAM","1044 CASTELLO DR STE 109","NAPLES","FL",34103,"DENTAL","General Dentist"]
[null,272050028,1689825176,"MARIA T LUONG","972 DEL MAR DR","LADY LAKE","FL",32159,"DENTAL","General Dentist"]
[null,611267485,1932296639,"HARRY W SLEET II","4748 HOUSTON RD","FLORENCE","KY",41042,"DENTAL","Oral Surgeon"]
[null,232366553,1003037292,"JEFFREY M WEINER","3254 RED LION RD","PHILADELPHIA","PA",19114,"DENTAL","General Dentist"]
[null,883258896,1033422720,"SILVIA  VALTCHEVA","3615 OLD FOREST RD","LYNCHBURG","VA",24501,"DENTAL","General Dentist"]
[null,631107148,1093880924,"BRADLEY G REYNOLDS","114 BROOKWOOD RD E","MIDFIELD","AL",35228,"DENTAL","General Dentist"]
[null,462931351,1275727430,"SUNDEEP  SEKHON","2140 VOORHEES TOWN CTR","VOORHEES","NJ","08043","DENTAL","Pediatric Dentist"]
[null,232667416,1013497536,"PHILIP J MORETTO","114 S STATE RD","SPRINGFIELD","PA",19064,"DENTAL","General Dentist"]
[null,222323270,1306213939,"RICHARD H REINHARD","130 WHIPPANY RD","WHIPPANY","NJ","07981","DENTAL","General Dentist"]
[null,621853722,1669447868,"ALLEN K LANGFORD","111 FOX RD STE 202","KNOXVILLE","TN",37922,"DENTAL","Orthodontist"]
[null,200185918,1356969117,"CYNTHIA A MARTINEZ","210 MARKETSIDE AVE STE 1","PONTE VEDRA","FL",32081,"DENTAL","General Dentist"]
[null,812158250,1871714766,"TYRUS G MONTGOMERY","12300 KEMMERTON LN","BOWIE","MD",20715,"DENTAL","General Dentist"]
[null,333426634,1073291316,"CHANDLER D REED","7205 HANCOCK VILLAGE DR","CHESTERFIELD","VA",23832,"DENTAL","General Dentist"]
[null,884251301,1881269462,"YANG  HU","1 WALLIS CT STE 4","LEXINGTON","MA","02421","DENTAL","General Dentist"]
[null,204677757,1114970241,"RICHARD J ROSATO","129 WILTON RD STE B","PETERBOROUGH","NH","03458","DENTAL","Oral Surgeon"]
[null,223895016,1053315952,"JASON  KLEVANSKY","3455 LAWRENCEVILLE HWY","LAWRENCEVILLE","GA",30044,"DENTAL","General Dentist"]
[null,270343035,1992922066,"ERICK T ANDERSON","5725 ERINDALE DR STE 210","COLORADO SPRINGS","CO",80918,"DENTAL","General Dentist"]
[null,521277321,1376755389,"RICHARD  HUNSINGER","4825 BETHESDA AVE STE 308","BETHESDA","MD",20814,"DENTAL","General Dentist"]
[null,383063197,1376430496,"DANH  PHAN","415 W COMMERCE RD","COMMERCE TOWNSHIP","MI",48382,"DENTAL","General Dentist"]
[null,113297807,1881828176,"EZRA A TRACHTENBERG","135 LAWRENCE ST","BROOKLYN","NY",11201,"DENTAL","General Dentist"]
[null,844743601,1043954837,"KENTON CRAIG  COVINGTON","2100 S. FERDON BLVD SUITE 140","CRESTVIEW","FL",32536,"DENTAL","Orthodontist"]
[null,825285355,1417640038,"ANIER  DIAZ VIDAL","1625 CHESTNUT ST STE 228","PHILADELPHIA","PA",19103,"DENTAL","General Dentist"]
[null,471540975,1689923542,"CARLY SARA POLIN","2600 N MILITARY TRL STE 320","BOCA RATON","FL",33431,"DENTAL","General Dentist"]
[null,382327175,1104956226,"CHRISTOPHER B BECK","1903 10TH AVE","PORT HURON","MI",48060,"DENTAL","Oral Surgeon"]
[null,832811205,1659548410,"VIRAJ V GADKAR","358 N BROADWAY STE 201","SLEEPY HOLLOW","NY",10591,"DENTAL","General Dentist"]
[null,205025337,1114948601,"JENNIFER B CHACE","4479 N HARBOR CITY BLVD","MELBOURNE","FL",32935,"DENTAL","General Dentist"]
[null,264609067,1124127774,"SONIA DENISE CARTWRIGHT-SMITH","105 E BELT LINE RD STE 900","CEDAR HILL","TX",75104,"DENTAL","General Dentist"]
[null,232907957,1669552386,"GARY S WEGMAN","3650 PERKIOMEN AVE","READING","PA",19606,"DENTAL","General Dentist"]
[null,811373286,1699037507,"ADITI RAJESH SAXENA","5610 E CENTRAL TEXAS EXPY STE 3","KILLEEN","TX",76543,"DENTAL","General Dentist"]
[null,200185918,1518702034,"PATRICK  CHENG","40214 HIGHWAY 27","DAVENPORT","FL",33837,"DENTAL","General Dentist"]
[null,232852589,1902214661,"ERIC N HODGES","1 BELMONT AVE STE 316","BALA CYNWYD","PA",19004,"DENTAL","Endodontist"]
[null,208510369,1669150314,"HANNAH  BANNISTER","7701 WHITE HORSE ROAD","GREENVILLE","SC",29611,"DENTAL","General Dentist"]
[null,853480256,1194925263,"JON M KANEGAWA","4811 JONESTOWN RD STE 129","HARRISBURG","PA",17109,"DENTAL","General Dentist"]
[null,"043383379",1528156486,"JOANNE  MIRRAS","205 CHELMSFORD ST","CHELMSFORD","MA","01824","DENTAL","Endodontist"]
[null,842123108,1699188391,"PAUL M BUCKING","3695 W BOYNTON BEACH BLVD STE 1","BOYNTON BEACH","FL",33436,"DENTAL","Oral Surgeon"]
[null,463222042,1225294259,"VERONICA F MILLER","115 PARK ST #201","VIENNA","VA",22180,"DENTAL","General Dentist"]
[null,232625984,1427738012,"NAQUITA M DIXSON","201 3RD AVE BLDG 38200","FORT GORDON","GA",30905,"DENTAL","General Dentist"]
[null,562245313,1720095201,"JOHN M ROMULUS","306 DOLPHIN DR STE 1","JACKSONVILLE","NC",28546,"DENTAL","General Dentist"]
[null,841764767,1083062020,"NHU-NGUYEN  NGUYEN","5312 SE 52ND AVE","PORTLAND","OR",97206,"DENTAL","General Dentist"]
[null,933324817,1114088515,"CHRISTOPHER D MULLENIX","715 DOWNTOWNER BLVD","MOBILE","AL",36609,"DENTAL","Oral Surgeon"]
[null,232656047,1962405944,"JERALD  MATT","776 W LANCASTER AVE","BRYN MAWR","PA",19010,"DENTAL","General Dentist"]
[null,824414227,1083098172,"JIREH J YUE","18851 UNIVERSITY BLVD #210","SUGAR LAND","TX",77479,"DENTAL","General Dentist"]
[null,813793901,1790832707,"GREGORY K KONTOPANOS","3525 IRON BRIDGE RD","RICHMOND","VA",23234,"DENTAL","General Dentist"]
[null,263025953,1609930320,"KAREN H WINTERFIELD-DODDS","109 FRANKLIN CORNER RD","LAWRENCE TOWNSHIP","NJ","08648","DENTAL","General Dentist"]
[null,825078849,1326163957,"BRIAN M PELSUE","201 ACADEMY RD STE 6","STARKVILLE","MS",39759,"DENTAL","Orthodontist"]
[null,882454247,1225445182,"KAVISH A GURJAR","801 PLEASANT DR STE 160","ROCKVILLE","MD",20850,"DENTAL","General Dentist"]
[null,223553302,1194787820,"GARY S DWORKIN","350 ROUTE 73 S","MARLTON","NJ","08053","DENTAL","General Dentist"]
[null,471460666,1831394352,"YUNG  KIM","314 W 56TH ST STE LB","NEW YORK","NY",10019,"DENTAL","Prosthodontist"]
[null,452675489,1659668499,"JULIA NICOLE WHEELER","5172 WRIGHTSBORO RD","GROVETOWN","GA",30813,"DENTAL","General Dentist"]
[null,263006639,1568664472,"JULIA  LEE","2211 OLYMPIC BLVD","WALNUT CREEK","CA",94595,"DENTAL","General Dentist"]
[null,272535713,1588830517,"HOLLY B SLETTEN","19621 SOLAR CIR STE 202","PARKER","CO",80134,"DENTAL","General Dentist"]
[null,934898220,1972097285,"FAZEL  FAKHARI","5840 BANNEKER RD STE 120","COLUMBIA","MD",21044,"DENTAL","Endodontist"]
[null,920265261,1760971410,"SYED H HAIDER","771 ROUTE 70 E STE D-175","MARLTON","NJ","08053","DENTAL","General Dentist"]
[null,270602568,1336308600,"JENINE N GILES","5050 KENTWORTH DR","HOLLY SPRINGS","NC",27540,"DENTAL","General Dentist"]
[null,814712385,1689006603,"JUSTIN  GRIMES","15 RUTH DRIVE","NEWNAN","GA",30265,"DENTAL","Oral Surgeon"]
[null,860783790,1265505226,"BRYAN J SHANAHAN","750 N KENDRICK ST STE 100","FLAGSTAFF","AZ",86001,"DENTAL","General Dentist"]
[null,232814394,1053539734,"DREW A SHULMAN","2417 WELSH RD","PHILADELPHIA","PA",19114,"DENTAL","General Dentist"]
[null,522237953,1306870282,"MICHELLE ELISE WOODS","325 GAMBRILLS RD STE C","GAMBRILLS","MD",21054,"DENTAL","General Dentist"]
[null,464286999,1407902067,"LAURA M ESPOSITO","901 STEWART AVE STE 200","GARDEN CITY","NY",11530,"DENTAL","General Dentist"]
[null,631107148,1093880924,"BRADLEY G REYNOLDS","114 BROOKWOOD RD E","MIDFIELD","AL",35228,"DENTAL","General Dentist"]
[null,821271143,1568996007,"AURELIE  HUYGHUES DESPOINTES","118 SE 23RD AVE","BOYNTON BEACH","FL",33435,"DENTAL","General Dentist"]
[null,841683505,1790873032,"DANIEL L MULLENAUX","21805 S ELLSWORTH RD STE 110","QUEEN CREEK","AZ",85142,"DENTAL","General Dentist"]
[null,462984148,1316062011,"GEORGE K CAMP","32 MALPHRUS RD STE 115","BLUFFTON","SC",29910,"DENTAL","General Dentist"]
[null,463753644,1205451754,"JACOB THOMAS WOOD","221 PARKWAY DR","KALISPELL","MT",59901,"DENTAL","General Dentist"]
[null,844784496,1710362660,"TREVOR L WILLIAMS","510 VONDERBURG DR STE 211","BRANDON","FL",33511,"DENTAL","General Dentist"]
[null,842669134,1467989921,"JAKE M DORFMAN","345 KNOWLES AVE STE 7","SOUTHAMPTON","PA",18966,"DENTAL","Orthodontist"]
[null,853954883,1699367565,"BETHANY P LEEDY","2015 2ND AVE #201","SUMMERVILLE","SC",29486,"DENTAL","General Dentist"]
[null,263339077,1912427253,"STEVEN TYLER BAKER","3640 S SUNCOAST BLVD","HOMOSASSA","FL",34448,"DENTAL","General Dentist"]
[null,651042456,1770920902,"MATTHEW  RADER","10730 SE FEDERAL HWY","HOBE SOUND","FL",33455,"DENTAL","General Dentist"]
[null,157582727,1265874259,"DOROTHY A FEEHAN","21 S KINDERKAMACK RD","MONTVALE","NJ","07645","DENTAL","General Dentist"]
[null,831578012,1386903623,"MATTHEW J VENUTO","813 NEW BROOKLYN ERIAL RD","SICKLERVILLE","NJ","08081","DENTAL","General Dentist"]
[null,203167059,1104857606,"ROBERT C HULL","650 N LEE HWY STE 1","LEXINGTON","VA",24450,"DENTAL","General Dentist"]
[null,203241962,1295748747,"CARLA P TALAVERA-JORDAN","533 CAGAN PARK AVE STE 307","CLERMONT","FL",34714,"DENTAL","General Dentist"]
[null,920244352,1104046473,"ROBERT  GALVAN","1217 S 31ST ST","TEMPLE","TX",76504,"DENTAL","Endodontist"]
[null,931250718,1770732950,"TROY N PORTASH","12801 SE FOSTER RD","PORTLAND","OR",97236,"DENTAL","General Dentist"]
[null,932029594,1205424108,"INGY H ELKOMARY","7765 AIRPORT BLVD STE D200","MOBILE","AL",36608,"DENTAL","General Dentist"]
[null,473179694,1467717595,"AMY  ROSANIA","185 COTTAGE ST","PORTSMOUTH","NH","03801","DENTAL","Periodontist"]
[null,651104572,1689717241,"RICHARD D SANDERFORD","10551 SIX MILE CYPRESS PKWY","FORT MYERS","FL",33966,"DENTAL","General Dentist"]
[null,821889727,1710072137,"SANDRA L PAYNE","4156 WESTPORT RD","LOUISVILLE","KY",40207,"DENTAL","General Dentist"]
[null,270478474,1134291198,"G  SHELTON","7402 YORK RD STE 303","TOWSON","MD",21204,"DENTAL","General Dentist"]
[null,920532717,1659864254,"MOHAMMAD  HEMMATIAN","1160 VARNUM ST NE STE 6","WASHINGTON","DC",20017,"DENTAL","General Dentist"]
[null,760675541,1982727269,"RONALD C CAMPBELL","23410 GRAND RESERVE DRIVE BLDG 5 STE 505","KATY","TX",77494,"DENTAL","Endodontist"]
[null,330063120,1790032969,"BRANDON  BELL","804 CARLSBAD VILLAGE DR","CARLSBAD","CA",92008,"DENTAL","General Dentist"]
[null,260357554,1902018138,"ERNEST  JERCINOVIC","871 106TH AVE N","NAPLES","FL",34108,"DENTAL","General Dentist"]
[null,650842674,1316604747,"SANDRA N GHATTAS","1501 PRESIDENTIAL WAY STE 7","WEST PALM BEACH","FL",33401,"DENTAL","Endodontist"]
[null,541186353,1427488519,"JAMIE Y DENONCOURT","8516 PATTERSON AVE","HENRICO","VA",23229,"DENTAL","General Dentist"]
[null,300228231,1265591382,"MATHEW C GORDON","235 E HILDEBRAND AVE","SAN ANTONIO","TX",78212,"DENTAL","Oral Surgeon"]
[null,204498880,1386787935,"JEFFERY  SPILMAN","4899 5TH AVE N","SAINT PETERSBURG","FL",33713,"DENTAL","General Dentist"]
[null,990230738,1053643973,"MATTHEW C DODSON","1325 S KIHEI RD STE 102B","KIHEI","HI",96753,"DENTAL","General Dentist"]
[null,822511813,1114052446,"GREGORY H SPRAGUE","25 PARK DR","TOPSHAM","ME","04086","DENTAL","Endodontist"]
[null,541253627,1043271935,"KANYON R KEENEY","130 TOWNE CENTER WEST BLVD","HENRICO","VA",23233,"DENTAL","Oral Surgeon"]
[null,812198324,1720216070,"NEIL DAVID COHEN","700 2ND AVE N STE 303","NAPLES","FL",34102,"DENTAL","General Dentist"]
[null,824575947,1992097307,"RYAN P ROBINSON","620 CHURCHMANS RD STE 203","NEWARK","DE",19702,"DENTAL","General Dentist"]
[null,814805611,1518468503,"RAMI  ELSABEE","1215 W BALTIMORE PIKE Suite 9","MEDIA","PA",19063,"DENTAL","Endodontist"]
[null,274484180,1962413781,"AMMAR  MOUSA","4060 E STATE ROAD 44 STE 2-B","WILDWOOD","FL",34785,"DENTAL","General Dentist"]
[null,760701602,1285882977,"RUSSELL  KELLY","951 N TUSTIN ST","ORANGE","CA",92867,"DENTAL","General Dentist"]
[null,461005159,1881346740,"BLAINE E GRIFFITHS","7325 GOODING BLVD","DELAWARE","OH",43015,"DENTAL","General Dentist"]
[null,200185918,1023855640,"TU NHI NGOC NGUYEN","1986 STATE ROAD 19","TAVARES","FL",32778,"DENTAL","General Dentist"]
[null,593552670,1396759841,"WILLIAM K URSCHEL","836 SUNSET LAKE BLVD","VENICE","FL",34292,"DENTAL","General Dentist"]
[null,825209271,1881855112,"DAGON HURRICANE JONES","2800 5TH ST STE 100","DAVIS","CA",95618,"DENTAL","General Dentist"]
[null,263952294,1083863211,"JUSTIN H LINTON","2750 KINGWOOD ST","FLORENCE","OR",97439,"DENTAL","General Dentist"]
[null,852313808,1639500879,"JEREMIAH C WHETMAN","657 E COTTONWOOD ST STE 1","COTTONWOOD","AZ",86326,"DENTAL","Periodontist"]
[null,842656919,1356961700,"CHRISTOPHER J COLELLA","3572 LELAND TOWN CENTER DR STE 140","LELAND","NC",28451,"DENTAL","General Dentist"]
[null,843656975,1902397425,"MARK  KRULL","13300 S WEST BAY SHORE DR","TRAVERSE CITY","MI",49684,"DENTAL","General Dentist"]
[null,383505782,1558871558,"SHABNAM  BEHDIN","4320 ORCHARD LAKE RD","WEST BLOOMFIELD","MI",48323,"DENTAL","Periodontist"]
[null,742768009,1629285218,"MONTE B COOPER","506 N HEWITT DR","HEWITT","TX",76643,"DENTAL","General Dentist"]
[null,260788862,1013102516,"RICHARD A SCHNUR","8312 US HIGHWAY 301 N STE 101","PARRISH","FL",34219,"DENTAL","General Dentist"]
[null,203119914,1689760688,"BING  LIU","556 PLEASANT ST","BROCKTON","MA","02301","DENTAL","General Dentist"]
[null,204338151,1417167800,"SONG M YUN","4111 OKEMOS RD STE 202","OKEMOS","MI",48864,"DENTAL","General Dentist"]
[null,650216679,1679750707,"JEFFERY A CHIRILLO","130 S INDIANA AVE # B","ENGLEWOOD","FL",34223,"DENTAL","General Dentist"]
[null,823800022,1740671882,"JULIANA  SAGOR","850 S VALLEY FORGE RD STE 8","LANSDALE","PA",19446,"DENTAL","General Dentist"]
[null,460902760,1881823482,"SHEILA  CHANDRAHASA","730 THE RIALTO","VENICE","FL",34285,"DENTAL","General Dentist"]
[null,460815208,1992156764,"STEVEN J TANNER","3095 E MULLAN AVE STE 400","POST FALLS","ID",83854,"DENTAL","General Dentist"]
[null,311791567,1619260312,"ADAM  BECKER","621 LYNNHAVEN PKWY STE 170","VIRGINIA BEACH","VA",23452,"DENTAL","Endodontist"]
[null,510118944,1912120676,"G WILLIAM W KELLER","20 MONTCHANIN RD STE 150","WILMINGTON","DE",19807,"DENTAL","Periodontist"]
[null,273315503,1376682138,"ROSEMARIE G SHELINE","110 CANAL ST","LEWISTON","ME","04240","DENTAL","General Dentist"]
[null,650719035,1891142808,"NADEEN  JAMAL","2091 COLLIER PKWY","LAND O LAKES","FL",34639,"DENTAL","General Dentist"]
[null,263859326,1255426003,"RONALD L OWEN","1735 US HIGHWAY 27 S","SEBRING","FL",33870,"DENTAL","General Dentist"]
[null,871491202,1083032080,"EMILY M SINCLAIR","7820 SHRADER RD","RICHMOND","VA",23294,"DENTAL","General Dentist"]
[null,392967125,1184039034,"TIFFANY L DEATON","445 N CEDAR ST","SUMMERVILLE","SC",29483,"DENTAL","General Dentist"]
[null,921584332,1730750811,"KRISTEN  LEONG","3901 MARKET ST STE 1936","PHILADELPHIA","PA",19104,"DENTAL","General Dentist"]
[null,752993175,1801527478,"THOMAS E MOORE","1719 GRAND ARMY HIGHWAY","SWANSEA","MA","02777","DENTAL","General Dentist"]
[null,208715116,1942313986,"CHARLES A CLAYTON","130 DONELSON PIKE","NASHVILLE","TN",37214,"DENTAL","General Dentist"]
[null,221915422,1811988538,"LEONARD V INFRANCO","1318 SOUTH MAIN RD BLDG 4B","VINELAND","NJ","08360","DENTAL","Oral Surgeon"]
[null,200185918,1043886716,"RACHEL ANN SHEPARD","2532 STATE ROAD 580 STE F","CLEARWATER","FL",33761,"DENTAL","General Dentist"]
[null,591389157,1023237039,"MICHAEL D SHEFFIELD","5150 MASON CORBIN CT STE 1","FORT MYERS","FL",33907,"DENTAL","General Dentist"]
[null,813275061,1053541219,"ANDREW W RAY","1460 W ELLIOT RD # 104","GILBERT","AZ",85233,"DENTAL","Oral Surgeon"]
[null,475353332,1639308653,"JIAN  HUANG","255 S 17TH ST STE 2807","PHILADELPHIA","PA",19103,"DENTAL","General Dentist"]
[null,472197508,1700349446,"ELIZABETH  BLAISSE","264 NEW CASTLE RD","BUTLER","PA",16001,"DENTAL","General Dentist"]
[null,461267800,1306979414,"LOUIS F KRAMP","8575 164TH AVE NE STE 301","REDMOND","WA",98052,"DENTAL","Endodontist"]
[null,862883396,1982925160,"SARAH  BOUCHARD","819 COMMERCIAL STREET","ROCKPORT","ME","04856","DENTAL","General Dentist"]
[null,831614705,1376705319,"CLAIRE C TOON","77 MAIN ST N STE 209 AT PLAYHOUSE CORNER","SOUTHBURY","CT","06488","DENTAL","General Dentist"]
[null,812104257,1497388300,"AMY  COBOS","1500 WALNUT ST STE 600","PHILADELPHIA","PA",19102,"DENTAL","Endodontist"]
[null,821663075,1588787048,"MELISSA A JOHNSON","123 W FRANCIS AVE STE 104","SPOKANE","WA",99205,"DENTAL","General Dentist"]
[null,591271142,1275593980,"MARK  STREATER","8267 COLLEGE PKWY","FORT MYERS","FL",33919,"DENTAL","Oral Surgeon"]
[null,200570180,1508876574,"TIMOTHY H MIHLE","1604 PHYSICIANS DR STE 101","WILMINGTON","NC",28401,"DENTAL","Endodontist"]
[null,931598039,1225053283,"GENE  GRESS","40 TANYARD RD","ROCKY MOUNT","VA",24151,"DENTAL","General Dentist"]
[null,770036979,1346394046,"LOIS E LAGIER","550 CAMINO EL ESTERO STE 200","MONTEREY","CA",93940,"DENTAL","General Dentist"]
[null,874306976,1407995467,"FRANCES  CONDE","11938 COUNTY ROAD 101 STE 110","THE VILLAGES","FL",32162,"DENTAL","General Dentist"]
[null,882394247,1275207474,"UMAR  SHAHBAZ","9110 PHILADELPHIA RD STE 214","ROSEDALE","MD",21237,"DENTAL","General Dentist"]
[null,261922593,1053355933,"EDWARD M KAISER","102 BUTE RD","UNIONTOWN","PA",15401,"DENTAL","General Dentist"]
[null,843777559,1780612515,"MICHAEL  BASS","1031 W WILLIAMS ST STE 101","APEX","NC",27502,"DENTAL","General Dentist"]
[null,922188973,1407983612,"H KATHY  LEE","9110 PHILADELPHIA RD STE 104","BALTIMORE","MD",21237,"DENTAL","Endodontist"]
[null,922156357,1407983612,"H KATHY  LEE","22 W PADONIA RD STE A200","TIMONIUM","MD",21093,"DENTAL","Endodontist"]
[null,800422002,1720387517,"JOANNA  KEMPLER","3460 OLD WASHINGTON RD STE 102","WALDORF","MD",20602,"DENTAL","General Dentist"]
[null,592234013,1578898805,"JOHN F WHITT","121 GRIFFIN VIEW DR","LADY LAKE","FL",32159,"DENTAL","Endodontist"]
[null,273893870,1003012527,"PHILIP R HOWARD","4520 42ND AVE SW STE 23","SEATTLE","WA",98116,"DENTAL","General Dentist"]
[null,273154262,1316130727,"RAYMOND L PATE","710 TENNESSEE AVE","ETOWAH","TN",37331,"DENTAL","General Dentist"]
[null,455531039,1619110996,"BRIAN  MCCORMACK","2500 NESCONSET HWY BLDG 18A","STONY BROOK","NY",11790,"DENTAL","Endodontist"]
[null,872590565,1013587245,"SILVY  CHERIAN","1933 DELANCEY PL","PHILADELPHIA","PA",19103,"DENTAL","General Dentist"]
[null,263800267,1538456629,"ANETA A RACZYNSKA","10051 MARKET CIRCLE","MANASSAS","VA",20110,"DENTAL","General Dentist"]
[null,871295281,1588838429,"LAWRENCE A SNIDER","6711 WHITTIER AVE STE 201","MCLEAN","VA",22101,"DENTAL","Periodontist"]
[null,208647659,1306973078,"JAY  WIETECHA","98 SILVER ST","WATERVILLE","ME","04901","DENTAL","General Dentist"]
[null,334621248,1790239960,"CHRISTOPHER M BALABAN","27 BARKLEY CIRCLE","FORT MYERS","FL",33907,"DENTAL","General Dentist"]
[null,208074889,1972725141,"BRETT D BODEN","564 W UWCHLAN AVE","EXTON","PA",19341,"DENTAL","General Dentist"]
[null,474486868,1366766479,"KEVIN A REUSS","4749 W LINCOLN HWY","PARKESBURG","PA",19365,"DENTAL","General Dentist"]
[null,810871693,1346380722,"TAMMY L COOK","304 WASHINGTON ST","BATH","ME","04530","DENTAL","General Dentist"]
[null,232834879,1396816443,"TIMOTHY C BURKE","979 BROOKSIDE RD","WESCOSVILLE","PA",18106,"DENTAL","General Dentist"]
[null,465465983,1386844256,"MATTHEW J WORD","947 BYPASS 123","SENECA","SC",29678,"DENTAL","General Dentist"]
[null,263510875,1861169567,"NATHAN B SHIVER","818 NORTHWOOD PARK DR","VALDOSTA","GA",31602,"DENTAL","General Dentist"]
[null,571112922,1396268504,"MICHAEL T JAUCH","139 WHITEFORD WAY","LEXINGTON","SC",29072,"DENTAL","Orthodontist"]
[null,873532672,1255627428,"PATRICE J HARMON","2425 BOULEVARD STE 8","COLONIAL HEIGHTS","VA",23834,"DENTAL","Endodontist"]
[null,873759335,1235597477,"EVAN  RIDGE","250 GIBBSBORO ROAD DAG SOMERDALE PC","CLEMENTON","NJ","08021","DENTAL","General Dentist"]
[null,471258525,1881605293,"RONALD C TAYLOR","300 M ST SE STE 410","WASHINGTON","DC",20003,"DENTAL","Endodontist"]
[null,205157286,1639149685,"DANIEL P LAWLESS","16 WILLIAM POPE DR STE 104","BLUFFTON","SC",29909,"DENTAL","General Dentist"]
[null,812471327,1942476254,"ANDREW  LEE","2755 E GULF TO LAKE HWY","INVERNESS","FL",34453,"DENTAL","General Dentist"]
[null,262263982,1376689075,"PHAN K HUYNH","921 ATLANTIC AVE","ATLANTIC CITY","NJ","08401","DENTAL","General Dentist"]
[null,932070343,1255581674,"MARJORIE  BAPTISTE","34 FRANKLIN CORNER RD","LAWRENCEVILLE","NJ","08648","DENTAL","Periodontist"]
[null,922827927,1932429198,"JOHN P SOLIMAN","2130 ROUTE 35 STE 112","SEA GIRT","NJ","08750","DENTAL","Oral Surgeon"]
[null,841890062,1548829112,"CHRISTINE M ADAMS","900 NW 13TH ST STE 101","BOCA RATON","FL",33486,"DENTAL","General Dentist"]
[null,462406749,1710275284,"JUAN C CABRERA","1429 WALNUT ST FL 6","PHILADELPHIA","PA",19102,"DENTAL","Periodontist"]
[null,593365515,1750907564,"MASROOR AHMED  SHARIFF","10625 BIG BEND RD","RIVERVIEW","FL",33579,"DENTAL","General Dentist"]
[null,332686613,1902464084,"SNEHA A PATEL","5823 MAIN ST","NEW PORT RICHEY","FL",34652,"DENTAL","General Dentist"]
[null,300889816,1154733046,"AARON N MAMO","23100 VIA VILLAGIO","ESTERO","FL",33928,"DENTAL","General Dentist"]
[null,201711064,1053467175,"WYATT D SIMONS","2710 CAMINO CAPISTRANO","SAN CLEMENTE","CA",92672,"DENTAL","General Dentist"]
[null,830360378,1891891818,"FRANCES A JOHNSTON","160 VALLEY ST NE","ABINGDON","VA",24210,"DENTAL","General Dentist"]
[null,474805987,1588677496,"MICHAEL  MARKGRAF","301 W OLYMPIA AVE","PUNTA GORDA","FL",33950,"DENTAL","General Dentist"]
[null,883571481,1710337076,"ALEXANDER ROBERT MCCLURE","1949 COUNTY ROAD 210 W","ST JOHNS","FL",32259,"DENTAL","Endodontist"]
[null,562142302,1659711794,"CAMERON B RITTER","1117 MEDICAL CENTER DR","WILMINGTON","NC",28401,"DENTAL","Endodontist"]
[null,272171320,1154325587,"SHAHROKH  BAGHERI","2008 LAWRENCEVILLE SUWANEE RD","SUWANEE","GA",30024,"DENTAL","Oral Surgeon"]
[null,811825861,1013313915,"CHIRADIP  KAR","1643 COUNTY ROUTE 64","HORSEHEADS","NY",14845,"DENTAL","General Dentist"]
[null,550834142,1851419170,"LORI A LEBLANC","6B PASCO DR","EAST WINDSOR","CT","06088","DENTAL","General Dentist"]
[null,203221849,1447706049,"STEPHEN  MORENO","14346 WARWICK BLVD STE 418","NEWPORT NEWS","VA",23602,"DENTAL","Oral Surgeon"]
[null,843955284,1558683052,"THOMAS N DAVENPORT","7405 W GRANDRIDGE BLVD STE B","KENNEWICK","WA",99336,"DENTAL","General Dentist"]
[null,200185918,1598991101,"TRACY MURPHY RIEMLAND","1776 BLANDING BOULEVARD","MIDDLEBURG","FL",32068,"DENTAL","General Dentist"]
[null,842793075,1326491093,"JOEL S ELEY","2990 BUSINESS CENTER BLVD STE A","MELBOURNE","FL",32940,"DENTAL","General Dentist"]
[null,263339824,1730269267,"TIMOTHY  NICHOLS","32 STAYMAN DR","ROMNEY","WV",26757,"DENTAL","General Dentist"]
[null,221909919,1568581171,"JOSE  GUERRA","292 HURFFVILLE GRENLOCH RD","SEWELL","NJ","08080","DENTAL","Endodontist"]
[null,200185918,1225761869,"EMILY  INGALLS","3565 53RD AVE W","BRADENTON","FL",34210,"DENTAL","General Dentist"]
[null,232184032,1114086758,"STEVEN A APPEL","211 GEIGER RD STE A","PHILADELPHIA","PA",19115,"DENTAL","Orthodontist"]
[null,813901151,1063858603,"STEVEN D SMITH","1360 BEDFORD DR","MELBOURNE","FL",32940,"DENTAL","Endodontist"]
[null,451266532,1588118756,"KAITLYN M THOMPSON","100 DEBO DR STE 110","MYRTLE BEACH","SC",29579,"DENTAL","General Dentist"]
[null,472134493,1376648055,"GLEN B MITCHELL","900 GLADES RD STE 3A","BOCA RATON","FL",33431,"DENTAL","Endodontist"]
[null,922650055,1689082786,"DAVE  PATEL","19875 SOUTHWEST FWY STE 290","SUGAR LAND","TX",77479,"DENTAL","Endodontist"]
[null,200185918,1467864504,"ANTHONY R SEVILLA","2900 LAKE WASHINGTON RD STE 3","MELBOURNE","FL",32935,"DENTAL","General Dentist"]
[null,200185918,1700567583,"VERNA  BINIAMIN","276 BUENA VISTA BLVD","THE VILLAGES","FL",32162,"DENTAL","General Dentist"]
[null,200185918,1386484376,"CHIAYUN  LAN","4924 C 466A","WILDWOOD","FL",34785,"DENTAL","General Dentist"]
[null,232001063,1376856690,"CANA E PASIERB","3700 MARKET ST STE 101","PHILADELPHIA","PA",19104,"DENTAL","General Dentist"]
[null,921281832,1730529967,"ASHLEE P GOODMAN-TABARI","10220 STAPLES MILL RD","GLEN ALLEN","VA",23060,"DENTAL","General Dentist"]
[null,521116591,1285332742,"MEGAN  POTEAT","503 MUIR ST STE A","CAMBRIDGE","MD",21613,"DENTAL","General Dentist"]
[null,650028255,1952349789,"GREGORY  LAWRENCE","4135 TAMIAMI TRL E","NAPLES","FL",34112,"DENTAL","General Dentist"]
[null,921713555,1093901647,"PRASHANT R RAO","16615 RIVERSTONE WAY STE 200","CHARLOTTE","NC",28277,"DENTAL","General Dentist"]
[null,620811327,1538508882,"DAVID A MATHER","1203 N WILCOX DR","KINGSPORT","TN",37660,"DENTAL","General Dentist"]
[null,371516470,1952422149,"EMILIYA RAKHMINOVNA YAKUBOVA","161 MADISON AVE SUITE 8","NEW YORK","NY",10016,"DENTAL","General Dentist"]
[null,223452451,1891943486,"MONIQUE  BRAATZ","133 JACKSON RD STE E","MEDFORD","NJ","08055","DENTAL","General Dentist"]
[null,200185918,1801529219,"SAMANTHA  GRIBORIO","10070 UNIVERSITY PLAZA DR","FORT MYERS","FL",33913,"DENTAL","General Dentist"]
[null,470997983,1346519675,"HAFSA SYED TAI","1325 FLORIDA MALL AVE","ORLANDO","FL",32809,"DENTAL","General Dentist"]
[null,824233780,1487029112,"BRANDON M ANGUS","131 STANLEY AVE STE 201","ESTES PARK","CO",80517,"DENTAL","General Dentist"]
[null,200021836,1922110667,"TODD L JOLLY","629 FRANKLIN AVE","NUTLEY","NJ","07110","DENTAL","General Dentist"]
[null,371056692,1063632818,"RAYMOND C OTTE","211 N BROADWAY","GOREVILLE","IL",62939,"DENTAL","General Dentist"]
[null,221909919,1285768960,"JEFFREY  CARROLL","292 HURFFVILLE GRENLOCH RD","SEWELL","NJ","08080","DENTAL","Endodontist"]
[null,272294745,1851559843,"ERIC SCOTT JOHNSON","665 CAMINO DE LOS MARES STE 202","SAN CLEMENTE","CA",92673,"DENTAL","General Dentist"]
[null,542188705,1174658975,"LINDA C POWERS","300 COLLEGE AVE","TERRE HAUTE","IN",47802,"DENTAL","Orthodontist"]
[null,562594896,1609977891,"JOHN W OWEN","12870 STROH RANCH CT UNIT 103","PARKER","CO",80134,"DENTAL","General Dentist"]
[null,863060205,1952713547,"IVO  BUSHATI","5299 PARK BLVD N","PINELLAS PARK","FL",33781,"DENTAL","General Dentist"]
[null,473754661,1306108832,"HOANG L DO","34 NORTH MAIN ST","MANSFIELD","MA","02048","DENTAL","General Dentist"]
[null,474770871,1588079354,"RYAN A HARRIS","6323 CORPORATE CT STE A","FORT MYERS","FL",33919,"DENTAL","Endodontist"]
[null,882858612,1184870149,"ADRIANA  WELLS","3117 COLLEGE PARK DR STE 230","THE WOODLANDS","TX",77384,"DENTAL","Periodontist"]
[null,651270551,1588680268,"BRADLEY T HAMMOND","4161 N PIONEER DR STE 105","LITCHFIELD PARK","AZ",85340,"DENTAL","Oral Surgeon"]
[null,814554071,1578600318,"GREGORY J NIELSEN","1275 LAKE PLAZA DR STE 200","COLORADO SPRINGS","CO",80906,"DENTAL","Endodontist"]
[null,823489478,1427285378,"JON M WASSERBURGER","1226 STONERIDGE DR","BOZEMAN","MT",59718,"DENTAL","General Dentist"]
[null,208946972,1851788475,"ADALGISA M INFANTE","3033 WASHINGTON ST","ROXBURY","MA","02119","DENTAL","General Dentist"]
[null,273495560,1457555658,"CHRISTOPHER J JACKSON","503 JACKSON ST","BELLE FOURCHE","SD",57717,"DENTAL","General Dentist"]
[null,571104559,1356569107,"BRIAN C OLEARY","1544 OLD TAMAH RD","IRMO","SC",29063,"DENTAL","Orthodontist"]
[null,205521257,1912054412,"DANIEL A BILLS","1630 ROUTE 322","WOOLWICH TOWNSHIP","NJ","08085","DENTAL","Orthodontist"]
[null,591032858,1174856751,"AMANDA ALEXIS GOODMAN","5111 EHRLICH RD STE 130","TAMPA","FL",33624,"DENTAL","Endodontist"]
[null,621642858,1528273190,"TROY A KERBER","375 US HIGHWAY 51 BYP W","DYERSBURG","TN",38024,"DENTAL","General Dentist"]
[null,812674843,1831838572,"HUSAM  IDREES","600 FREEMASON DR","ELIZABETHTOWN","PA",17022,"DENTAL","General Dentist"]
[null,992738295,1114586369,"JACLYN  CRUZ","1500 HORIZON DR STE 112","CHALFONT","PA",18914,"DENTAL","Endodontist"]
[null,814744310,1033325154,"JULIA S CAMP-TOME","92 MAIN ST STE B","HILTON HEAD ISLAND","SC",29926,"DENTAL","General Dentist"]
[null,880714495,"NULL","MILFORD DENTAL ASSOCIATION PC","909 N DUPONT BLVD","MILFORD","DE",19963,"DENTAL","General Dentist"]
[null,870635702,1851378152,"BENJAMIN L YOUNG","10011 S CENTENNIAL PKWY STE 525","SANDY","UT",84070,"DENTAL","General Dentist"]
[null,842147850,1831125905,"FRANCINE T CWYK","1050 BALTIMORE PIKE","SPRINGFIELD","PA",19064,"DENTAL","Endodontist"]
[null,844158567,1124387683,"RUSSELL D TAYLOR","610 UPTOWN BLVD STE 3100","CEDAR HILL","TX",75104,"DENTAL","Endodontist"]
[null,200185918,1417846775,"IAN B MCLEAN","4607 COLLINA TER","CLERMONT","FL",34711,"DENTAL","General Dentist"]
[null,261370201,1376762096,"ALESSANDRA L RITTER","2900 CROASDAILE DR STE 1","DURHAM","NC",27705,"DENTAL","Endodontist"]
[null,821060744,1255583357,"LYUDMILA  KUZNETSOVA","1601 WALNUT ST STE 1111","PHILADELPHIA","PA",19102,"DENTAL","Endodontist"]
[null,222357177,1730268921,"THOMAS P KADAR","431 EGG HARBOR RD","SEWELL","NJ","08080","DENTAL","Orthodontist"]
[null,454413062,1992826333,"SANG Y KIM","6845 ELM ST STE 305","MCLEAN","VA",22101,"DENTAL","Oral Surgeon"]
[null,270478474,1497087837,"LORI VERONICA GIBBONS","7402 YORK RD STE 303","TOWSON","MD",21204,"DENTAL","General Dentist"]
[null,232071258,1003907858,"DAVID A REILLY","664 LANKENAU MEDICAL BUILDING E","WYNNEWOOD","PA",19096,"DENTAL","General Dentist"]
[null,233081753,1487676219,"CARL J HORCHOS","150 E PENNSYLVANIA AVE STE 400","DOWNINGTOWN","PA",19335,"DENTAL","General Dentist"]
[null,200185918,1508485194,"YANIEL  TORRES","42031 CYPRESS PKWY UNIT 6","PUNTA GORDA","FL",33982,"DENTAL","General Dentist"]
[null,832667203,1689120438,"TRAVIS R MOORE","2210 WRIGHTSVILLE AVE STE 5","WILMINGTON","NC",28403,"DENTAL","Endodontist"]
[null,203271987,1265459820,"SUSAN M LEMPERT","553 BECKETT RD STE 404","SWEDESBORO","NJ","08085","DENTAL","Orthodontist"]
[null,843117226,1831530724,"AARON A INNES","8053 E FLORENTINE RD","PRESCOTT VALLEY","AZ",86314,"DENTAL","Endodontist"]
[null,134229206,1285019299,"ARIANNA E MALIK","616 FREDERICK RD","CATONSVILLE","MD",21228,"DENTAL","General Dentist"]
[null,223560207,1942877253,"SETH A LEVITIN","401 KINGS HWY S STE 3A","CHERRY HILL","NJ","08034","DENTAL","Endodontist"]
[null,471123833,1225562069,"STEPHANIE  LOMELI","9509 FM 1960 RD W STE 200","HUMBLE","TX",77338,"DENTAL","General Dentist"]
[null,161647405,1578775243,"JIN  JIANG","60 WASHINGTON AVE STE 202","HAMDEN","CT","06518","DENTAL","Endodontist"]
[null,471892191,1275845240,"BORYANA S STOYANOVA","1077 RYDAL RD STE 102","JENKINTOWN","PA",19046,"DENTAL","General Dentist"]
[null,994383396,1538229083,"BRETT C DUNNILL","213 BULIFANTS BLVD STE E","WILLIAMSBURG","VA",23188,"DENTAL","General Dentist"]
[null,851570499,1003161613,"DHAVAL R SHAH","4605 STATE RD","DREXEL HILL","PA",19026,"DENTAL","General Dentist"]
[null,200185918,1902458227,"SAIRA CESARINA FERNANDEZ PEREZ","2232 US HWY 27","CLERMONT","FL",34714,"DENTAL","General Dentist"]
[null,821922260,1699955955,"ADAM J ROCA","611 S CARLIN SPRINGS RD STE 303","ARLINGTON","VA",22204,"DENTAL","General Dentist"]
[null,205090963,1457459612,"TREVOR F QUICK","2600 WEST BAY DR","LARGO","FL",33770,"DENTAL","General Dentist"]
[null,883601533,1811289374,"THOMAS H BLOUNT","9651 BREWERTON RD","BREWERTON","NY",13029,"DENTAL","General Dentist"]
[null,233024574,1144059098,"DANA  LEE","1460 RUSSELL RD STE 203","PAOLI","PA",19301,"DENTAL","Endodontist"]
[null,843066934,1902176860,"NIKKI T NGUYEN","611 CHURCH ST","CONWAY","SC",29526,"DENTAL","General Dentist"]
[null,471601631,1831402957,"MARC A MINGEL","3015 BAYVIEW DR STE C","FORT LAUDERDALE","FL",33306,"DENTAL","General Dentist"]
[null,921761711,1780605527,"BRUCE R TERRY","1220 VALLEY FORGE RD STE 40","PHOENIXVILLE","PA",19460,"DENTAL","Endodontist"]
[null,200185918,1134131089,"DAVID  ROWE","17840 TOLEDO BLADE BLVD UNIT A","PORT CHARLOTTE","FL",33948,"DENTAL","General Dentist"]
[null,452698308,1962407338,"LEV  TOMASHEVSKY","832 QUINCE ORCHARD BLVD","GAITHERSBURG","MD",20878,"DENTAL","General Dentist"]
[null,851291207,1447010822,"BHAVNEET  CHAWLA","301 S MAIN RD UNIT B-3 & B-4","VINELAND","NJ","08360","DENTAL","General Dentist"]
[null,462249685,1942400353,"MANMEET K MOODY","2999 REGENT ST STE 403","BERKELEY","CA",94705,"DENTAL","Periodontist"]
[null,510470038,1831311802,"FREDERICK J GRASSIN","2157 LITTLE RD","NEW PORT RICHEY","FL",34655,"DENTAL","Endodontist"]
[null,870929876,1679070759,"ISATA Y PANDA","20 E TIMONIUM RD STE 210","TIMONIUM","MD",21093,"DENTAL","General Dentist"]
[null,412033434,1942369814,"RESTITUTO  CHING","110 S 6TH ST STE 5","SAC CITY","IA",50583,"DENTAL","General Dentist"]
[null,270191042,1063604718,"JUDY Y MELAMED","1407 YORK RD STE 210","LUTHERVILLE","MD",21093,"DENTAL","Endodontist"]
[null,830356829,1699746867,"FRANCIS R PARREIRA","888 BESTGATE RD STE 213","ANNAPOLIS","MD",21401,"DENTAL","Endodontist"]
[null,223560207,1922287952,"ELENA V KURTZ","401 KINGS HWY S STE 3A","CHERRY HILL","NJ","08034","DENTAL","Endodontist"]
[null,462950883,1104996974,"JAMES B HUDSON","6116 ROLLING RD #201","SPRINGFIELD","VA",22152,"DENTAL","Orthodontist"]
[null,522003671,1366474272,"GERARD L SIMONEAUX","602 S ATWOOD RD STE 212","BEL AIR","MD",21014,"DENTAL","Endodontist"]
[null,871713157,1225764202,"SCOTT  POORTINGA","1580 WELLS RD STE 20","ORANGE PARK","FL",32073,"DENTAL","General Dentist"]
[null,550881215,1487652863,"MONIKA  BHATIA","267 W OLD COUNTRY RD","HICKSVILLE","NY",11801,"DENTAL","General Dentist"]
[null,522003671,1891170841,"JEFFREY  GARDYN","2328 W JOPPA RD STE 102","LUTHERVILLE","MD",21093,"DENTAL","Endodontist"]
[null,522003671,1578595609,"CHARLES P HERBERT","888 BESTGATE RD STE 220","ANNAPOLIS","MD",21401,"DENTAL","Endodontist"]
[null,832477002,1487932026,"MARJORIE L WILLIAMS","4624 CENTRAL PARK BLVD STE 102","DENVER","CO",80238,"DENTAL","General Dentist"]
[null,391908462,1326451253,"JACOB L HOPPER","131 W WASHINGTON ST","OSCEOLA","IA",50213,"DENTAL","General Dentist"]
[null,461310972,1881338804,"VANESSA  GARCIA","2116 VISTA OESTE NW STE 202","ALBUQUERQUE","NM",87120,"DENTAL","General Dentist"]
[null,275172930,1164065223,"JENISH  KIZHAKKEMURIYIL","3101 BRISTOL RD STE 1","BENSALEM","PA",19020,"DENTAL","General Dentist"]
[null,521116591,1518264415,"YIYA  ZHOU","808 S 5TH AVE","DENTON","MD",21629,"DENTAL","General Dentist"]
[null,473831321,1962716449,"DAWN K WELDON","354 SAW MILL RD","WEST HAVEN","CT","06516","DENTAL","Endodontist"]
[null,841104889,1710330147,"ELIZABETH B TREPKA","9400 STATION ST STE 175","LONE TREE","CO",80124,"DENTAL","General Dentist"]
[null,461992775,1073544672,"JOHN H MANN","395 ROUTE 940 STE 102","BLAKESLEE","PA",18610,"DENTAL","General Dentist"]
[null,383505782,1558871558,"SHABNAM  BEHDIN","155 N CANTON CENTER RD","CANTON","MI",48187,"DENTAL","Periodontist"]
[null,550760740,1841311271,"MICHAEL L SMITH","1271 ROBERT C BYRD DR","CRAB ORCHARD","WV",25827,"DENTAL","General Dentist"]
[null,571163997,1467548800,"PAYAM  HANIAN","601 EWING ST STE C16","PRINCETON","NJ","08540","DENTAL","General Dentist"]
[null,"010353137",1598971954,"TODD P MELLIN","82 COYLE ST","PORTLAND","ME","04101","DENTAL","Endodontist"]
[null,460779444,1366751976,"BOKYU  CHOI","13890 BRADDOCK RD #305","CENTREVILLE","VA",20121,"DENTAL","General Dentist"]
[null,833070724,1811956238,"MICHAEL K JEFFERSON","60 W LANDIS AVE STE A2","VINELAND","NJ","08360","DENTAL","General Dentist"]
[null,208050966,1326610957,"NATHAN R NEUHART","581 W PALMER ST","FRANKLIN","NC",28734,"DENTAL","General Dentist"]
[null,821157282,1851588677,"MARCEL J DANEAULT","1600 BRICE RD STE 2","REYNOLDSBURG","OH",43068,"DENTAL","General Dentist"]
[null,834450815,1437423282,"SURBHI  PURI","200 BELLA KATY DR","KATY","TX",77494,"DENTAL","Endodontist"]
[null,873148410,1780781351,"JOHN  HAN","24805 PINEBROOK RD STE 108","CHANTILLY","VA",20152,"DENTAL","Pediatric Dentist"]
[null,998887777,"NULL","DEFAULT PROVIDER","560 MISSION STREET","SAN FRANCISCO","CA",94105,"DENTAL","General Dentist"]
[null,454020795,1982838884,"J HUNTER  HICKLIN","1803-A AUGUSTA ST","GREENVILLE","SC",29605,"DENTAL","General Dentist"]
[null,852869564,1215135793,"NATHAN C DEWSNUP","8899 TIMBERWILDE DR STE 3","BONITA SPRINGS","FL",34135,"DENTAL","General Dentist"]
[null,851570499,1689386559,"SHUBHSANGEET  JOHAL","4605 STATE RD","DREXEL HILL","PA",19026,"DENTAL","General Dentist"]
[null,651142450,1861451171,"CHRISTOPHER R STOCK","2006 MANATEE AVE W","BRADENTON","FL",34205,"DENTAL","General Dentist"]
[null,823860206,1437445103,"KIRAN  MISTRY","4414 NE FREMONT ST","PORTLAND","OR",97213,"DENTAL","General Dentist"]
[null,464902907,1699094714,"JOHN M JOHNSON","707 PARKWAY ST STE 103","CONWAY","AR",72034,"DENTAL","Oral Surgeon"]
[null,369023779,1013035245,"SETH A VRUGGINK","925 S BEECHTREE ST STE 2","GRAND HAVEN","MI",49417,"DENTAL","General Dentist"]
[null,521788554,1538329305,"ARASH M ROSTAMI","110 WEST RD STE 200","TOWSON","MD",21204,"DENTAL","General Dentist"]
[null,200185918,1811739527,"DA-THAO  NGUYEN","6915 LONGLEAF PINE PKWY","SAINT JOHNS","FL",32259,"DENTAL","General Dentist"]
[null,260357554,1528376266,"DOUGLAS A TRIBBLE","2481 DEL PRADO BLVD N STE 114","CAPE CORAL","FL",33909,"DENTAL","General Dentist"]
[null,561072557,1811099476,"HAL  SAPP","3612 SHANNON RD STE 205","DURHAM","NC",27707,"DENTAL","General Dentist"]
[null,232005928,1619143179,"JOSHUA B WOLGIN","255 S 17TH ST STE 1806","PHILADELPHIA","PA",19103,"DENTAL","Endodontist"]
[null,862185925,1568818359,"JAMES  KORTBUS","1111 S DIXIE FWY","NEW SMYRNA BEACH","FL",32168,"DENTAL","General Dentist"]
[null,472965093,1457334302,"ERIC JOSEPH GARVER","2125 OAKLAND AVE STE 10","INDIANA","PA",15701,"DENTAL","General Dentist"]
[null,320397275,1518186576,"CHRISTOPHER J HERRICK","5797 BEECHCROFT RD STE B","COLUMBUS","OH",43229,"DENTAL","General Dentist"]
[null,883095340,1336228485,"RICHARD J STALLER","15340 JOG RD STE 100","DELRAY BEACH","FL",33446,"DENTAL","General Dentist"]
[null,863435976,1023233087,"NEHA  PANDYA","3821 WOODBRIAR TRL STE 104","PORT ORANGE","FL",32129,"DENTAL","Endodontist"]
[null,475329713,1659506657,"WILLIAM D CARMICHAEL","4704 MAIN ST","SHALLOTTE","NC",28470,"DENTAL","General Dentist"]
[null,204608925,1174804314,"BRANDON J BURKE","1228 WHITEFISH STAGE","KALISPELL","MT",59901,"DENTAL","General Dentist"]
[null,464449002,1447298898,"MELITA  ISLAMBASIC","275 96TH AVE N STE 7","SAINT PETERSBURG","FL",33702,"DENTAL","Endodontist"]
[null,262254712,1609961580,"SAMUEL C FIELDEN","115 GATEWOOD AVE","HIGH POINT","NC",27262,"DENTAL","General Dentist"]
[null,520986226,1952031668,"JAKE  HYATT","405 WILLIAMS CT STE 110","MIDDLE RIVER","MD",21220,"DENTAL","General Dentist"]
[null,262953796,1518608074,"WESLEY  GILLETTE","69 MCDOWELL ST","ASHEVILLE","NC",28801,"DENTAL","General Dentist"]
[null,159481740,1962469643,"JOSEPH G CARR","190 WELLES ST STE 201","FORTY FORT","PA",18704,"DENTAL","General Dentist"]
[null,223946051,1306165626,"LUZ MARINA D JUTRAS","6 LOUDON RD STE 6","CONCORD","NH","03301","DENTAL","Endodontist"]
[null,851397345,1558489542,"ABRAHAM  BEDER","4300 BLACK HORSE PIKE STE 212","MAYS LANDING","NJ","08330","DENTAL","Endodontist"]
[null,452410097,1215059035,"BRIAN JOSEPH DIMEO","5683 SE CROOKED OAK AVE","HOBE SOUND","FL",33455,"DENTAL","General Dentist"]
[null,364271142,1760628416,"SAMIA  KHAN","150 BROOK FOREST AVE","SHOREWOOD","IL",60404,"DENTAL","General Dentist"]
[null,823253512,1619359726,"ORHAN  SULJIC","309 SE MAIN ST PO BOX 380","GRIMES","IA",50111,"DENTAL","General Dentist"]
[null,821160645,1558390989,"CHRISTOPHER LOREN BEACH","1995 COUNTY ROAD 1","DUNEDIN","FL",34698,"DENTAL","General Dentist"]
[null,562412089,1255427035,"TERRY E CALLISON","19410 JETTON RD STE 210","CORNELIUS","NC",28031,"DENTAL","Endodontist"]
[null,273216157,1669670865,"CARINA L WOHL","61 LOCUST ST","NORTHAMPTON","MA","01060","DENTAL","General Dentist"]
[null,222832149,1740690189,"MICHAEL P COMBS","49 N SHORE RD","ABSECON","NJ","08201","DENTAL","General Dentist"]
[null,263443773,1730339292,"ANGELA B EMRICK","12133 COUNTY ROAD 103","OXFORD","FL",34484,"DENTAL","General Dentist"]
[null,591032858,1710994934,"NANCY  MEDINA","20711 STERLINGTON DR","LAND O LAKES","FL",34638,"DENTAL","Endodontist"]
[null,262989957,1457574949,"MORGAN J YOST","1435 MESA VIEW DR","DELTA","CO",81416,"DENTAL","General Dentist"]
[null,882806529,1497121651,"ARSEN A GAZARYAN","5 E JIMMIE LEEDS RD","GALLOWAY","NJ","08205","DENTAL","General Dentist"]
[null,621764699,1447552047,"MATTHEW L BOBBERA","306 PROSPERITY RD STE 201","KNOXVILLE","TN",37923,"DENTAL","Prosthodontist"]
[null,871813685,1649302423,"DAWN M ACKERMANN","750 ATTUCKS LANE","HYANNIS","MA","02601","DENTAL","General Dentist"]
[null,591466656,1386213486,"JACOB  HARRISON","1012 W 11TH ST","PANAMA CITY","FL",32401,"DENTAL","General Dentist"]
[null,883270150,1841669603,"BABAK  SALAHBIN","21785 FILIGREE CT STE 101","ASHBURN","VA",20147,"DENTAL","General Dentist"]
[null,923942215,1720316250,"NADEZHDA  POKROVSKAYA","1700 N MCMULLEN BOOTH RD STE A1","CLEARWATER","FL",33759,"DENTAL","General Dentist"]
[null,382057563,1417380387,"KATHRYN A SONPAL-TIRONI","1205 W UNIVERSITY DR","ROCHESTER HILLS","MI",48307,"DENTAL","Oral Surgeon"]
[null,884094105,1801413075,"NUPUR S PATEL","3386 MEMPHIS ST","PHILADELPHIA","PA",19134,"DENTAL","General Dentist"]
[null,202481363,1992766471,"CHAO-YUN M FAN","6850 PERIMETER DR STE C","DUBLIN","OH",43016,"DENTAL","General Dentist"]
[null,932561813,1689220295,"JULIAN N NGUYEN","907 N 130TH ST","SEATTLE","WA",98133,"DENTAL","General Dentist"]
[null,542079453,1871754630,"ANNA K PARK","50 N MAIN ST","MULLICA HILL","NJ","08062","DENTAL","Endodontist"]
[null,813793901,1669495693,"STEPHEN E GLICK","1600 HOCKETT RD","MANAKIN SABOT","VA",23103,"DENTAL","General Dentist"]
[null,472949138,1053451401,"FIRAS  MARSHEH","10 MITCHELL PL STE 102","WHITE PLAINS","NY",10601,"DENTAL","Endodontist"]
[null,943381930,1154505261,"JENNIFER D LEE","409 KEARNEY ST","EL CERRITO","CA",94530,"DENTAL","General Dentist"]
[null,270786062,1790839025,"JAMES P ANNICCHAIRICO","2027 LITTLE RD","TRINITY","FL",34655,"DENTAL","General Dentist"]
[null,844069690,1922598457,"DAVID  FINKELSTEIN","1771 KUSER RD","HAMILTON","NJ","08690","DENTAL","General Dentist"]
[null,464463463,1710147483,"MATTHEW C ROLLER","251 FRONTIER DR","STAUNTON","VA",24401,"DENTAL","General Dentist"]
[null,462959412,1699114413,"CURTIS ALLEN DEJARNATTE","2303 STARMOUNT CIR SW","HUNTSVILLE","AL",35801,"DENTAL","General Dentist"]
[null,581234014,1295824217,"ROSANNE  BRANDT","114 ALTAMA CONNECTOR","BRUNSWICK","GA",31525,"DENTAL","General Dentist"]
[null,823511781,1295280972,"DAVID R ROBBINS","636 WYNNEWOOD RD","ARDMORE","PA",19003,"DENTAL","General Dentist"]
[null,932728305,1457974214,"KEVIN  SON","5710 BELLONA AVE STE 101","BALTIMORE","MD",21212,"DENTAL","General Dentist"]
[null,814805611,1851915789,"MATTHEW  DESIDERIO","1215 W BALTIMORE PIKE STE 9","MEDIA","PA",19063,"DENTAL","Endodontist"]
[null,842619904,1013050392,"ELISE  BOLSKI","1605 TOWN CENTER BLVD STE B","WESTON","FL",33326,"DENTAL","General Dentist"]
[null,522292227,1417161936,"SIAMAK  AALEMANSOUR","4321 COLLINGTON RD STE 210","BOWIE","MD",20716,"DENTAL","General Dentist"]
[null,854279909,1326064627,"NATHAN  HAERR","100 HOUSTON SQ STE 1A","CANONSBURG","PA",15317,"DENTAL","General Dentist"]
[null,204428962,1336275924,"JEFFREY S VIGLIELMO","56 LUCAS AVE","KINGSTON","NY",12401,"DENTAL","General Dentist"]
[null,200927903,1427319706,"NAVEEN  MOHAN","151 S SPRINGFIELD RD","CLIFTON HEIGHTS","PA",19018,"DENTAL","Oral Surgeon"]
[null,873209909,1942476254,"ANDREW  LEE","3900 S SUNCOAST BLVD","HOMOSASSA","FL",34448,"DENTAL","General Dentist"]
[null,455389680,1528159399,"JOSEPH E MARKO","115 N 6TH ST","INDIANA","PA",15701,"DENTAL","General Dentist"]
[null,561133278,1598496598,"WILLIAM C GRINE","1313 EASTCHESTER DR","HIGH POINT","NC",27265,"DENTAL","General Dentist"]
[null,200185918,1780179119,"SONIA  RIVERO FERNANDEZ","625 N US HIGHWAY 441","LADY LAKE","FL",32159,"DENTAL","General Dentist"]
[null,"042652282",1538132980,"KEVIN W CHOI","342 GIFFORD ST","FALMOUTH","MA","02540","DENTAL","Endodontist"]
[null,332586998,1376160010,"SHANE R MCTIERNAN","651 NAUTICA DR UNIT 1","JACKSONVILLE","FL",32218,"DENTAL","General Dentist"]
[null,990970384,1912566134,"MICHAEL  PATTON","3473 MERCHANTS BLVD STE D","ABINGDON","MD",21009,"DENTAL","General Dentist"]
[null,874306976,1770632481,"REEM M JABER","11938 COUNTY ROAD 101 STE 110","THE VILLAGES","FL",32162,"DENTAL","General Dentist"]
[null,270120462,1356434385,"DARREN D WONG","1060 YOUNG ST STE 305","HONOLULU","HI",96814,"DENTAL","General Dentist"]
[null,521719647,1316931868,"CORNELIUS J SULLIVAN","101 SAINT CLAIRE PL Ste 100","STEVENSVILLE","MD",21666,"DENTAL","Oral Surgeon"]
[null,850994042,1649653957,"LISA MARIE  MA","5347 N SOCRUM LOOP RD","LAKELAND","FL",33809,"DENTAL","General Dentist"]
[null,710943218,1356472591,"JAMES L KENDRICK","5518 OLD HICKORY BLVD","HERMITAGE","TN",37076,"DENTAL","General Dentist"]
[null,463718652,1477239374,"EMILY  DANG","12419 SEAL BEACH BLVD","SEAL BEACH","CA",90740,"DENTAL","General Dentist"]
[null,202077879,1184280778,"JONATHAN P THOMAS","2214 W PALMETTO ST","FLORENCE","SC",29501,"DENTAL","General Dentist"]
[null,264652597,1871727404,"DUSTIN JAMES FARRIS","370 E SOUTH TEMPLE STE 220","SALT LAKE CITY","UT",84111,"DENTAL","General Dentist"]
[null,363762924,1972615847,"PERRY  DANOS","5700 DEMPSTER ST","MORTON GROVE","IL",60053,"DENTAL","General Dentist"]
[null,992404935,1467927152,"CAIXIA  LAN","15946 REDMOND WAY STE 106","REDMOND","WA",98052,"DENTAL","General Dentist"]
[null,201935897,1679502520,"ELIZABETH E RIGGS","3442 MAGAZINE ST","NEW ORLEANS","LA",70115,"DENTAL","General Dentist"]
[null,481293170,1467513200,"OLEG  ZUSIN","543A HEMPSTEAD TPKE","WEST HEMPSTEAD","NY",11552,"DENTAL","Periodontist"]
[null,221931711,1407944341,"WEI-LUN  WANG","810 NEW RD","LINWOOD","NJ","08221","DENTAL","Endodontist"]
[null,232909580,1336157577,"HERBERT L RAY JR","6530 STATE ROUTE 22 STE 305","DELMONT","PA",15626,"DENTAL","Endodontist"]
[null,273976095,1659635175,"MATTHEW F LALLI","1721 FLAGLER AVE","KEY WEST","FL",33040,"DENTAL","General Dentist"]
[null,881851312,1093145559,"MONIL D MISTRY","826 WASHINGTON RD STE 104","WESTMINSTER","MD",21157,"DENTAL","General Dentist"]
[null,860929409,1578550182,"KRYSTAL J MILES","7225 N ORACLE RD STE 201","TUCSON","AZ",85704,"DENTAL","Periodontist"]
[null,874330129,1427897446,"ANTHONY  MAZZONE","2271 N 2ND ST","MILLVILLE","NJ","08332","DENTAL","General Dentist"]
[null,461213085,1376879445,"ANDRES DAVID VILLASENOR","2802 WHITE OAK DR Ste 300","HOUSTON","TX",77007,"DENTAL","General Dentist"]
[null,873145016,1609215896,"SALEH  RAJAEIAN","825 TOWN CENTER DR STE 105","LANGHORNE","PA",19047,"DENTAL","Endodontist"]
[null,471432639,1477769727,"DAVID S SAMSON","1116 WEST ST","ANNAPOLIS","MD",21401,"DENTAL","General Dentist"]
[null,341788436,1265662902,"SARAH L WILLMANN","1304 MEADOWVIEW DR","CELINA","OH",45822,"DENTAL","General Dentist"]
[null,"043674473",1891890802,"FRANCIS B DAVIS","304 PENNY LN","MOREHEAD CITY","NC",28557,"DENTAL","General Dentist"]
[null,861613595,1831350834,"DAVID S BLUESTONE","1829 NEW HOLLAND RD STE 7","READING","PA",19607,"DENTAL","General Dentist"]
[null,205311454,1578636510,"SHADI  GHOZATI","7226 LEE DEFOREST DR STE 208","COLUMBIA","MD",21046,"DENTAL","General Dentist"]
[null,873886038,1982008959,"JONG RYUL  KIM","4750 TOWNSHIP LINE RD","DREXEL HILL","PA",19026,"DENTAL","Endodontist"]
[null,814862577,1003088774,"SCOTT  LOPSHIRE","4090 21ST AVE SW","CEDAR RAPIDS","IA",52404,"DENTAL","General Dentist"]
[null,811709168,1508165887,"WILLIAM T GOODWIN","3344 EMMAUS RD","HARRISONBURG","VA",22801,"DENTAL","Oral Surgeon"]
[null,810869220,1578932323,"EVAN TUAN TRAN","100 S BROAD ST STE 1530","PHILADELPHIA","PA",19110,"DENTAL","Orthodontist"]
[null,871396870,1659661247,"SCOTT C ROEMER","2130 S TAMIAMI TRL","SARASOTA","FL",34239,"DENTAL","General Dentist"]
[null,454129845,1497987457,"CASEY D WITTY","704 N MAIN ST","NICHOLASVILLE","KY",40356,"DENTAL","General Dentist"]
[null,844764206,1457729659,"MOSHE  EIZDI","2511 ARTESIA BLVD","REDONDO BEACH","CA",90278,"DENTAL","General Dentist"]
[null,851397345,1497279004,"AARON  BURNETT","530 BERLIN CROSS KEYS RD","SICKLERVILLE","NJ","08081","DENTAL","General Dentist"]
[null,994989830,1750011094,"FRANSISCA  CASTILLO","2412 N SALISBURY BLVD STE A","SALISBURY","MD",21801,"DENTAL","General Dentist"]
[null,"016020406",1518698026,"JACQUELINE L AUGER","15 OAK ST","SPRINGVALE","ME","04083","DENTAL","General Dentist"]
[null,823848445,1639242761,"ERICA  PATTHOFF","300 FOXCROFT AVE STE 302","MARTINSBURG","WV",25401,"DENTAL","General Dentist"]
[null,871538990,1801589346,"SEONG HWAN  PARK","294 UPPER MAIN ST","MORRISVILLE","VT","05661","DENTAL","General Dentist"]
[null,561101594,1730253766,"PAUL N TOLMIE","3535 RANDOLPH RD STE 103R","CHARLOTTE","NC",28211,"DENTAL","Periodontist"]
[null,270858899,1881752061,"RAYMOND A KIM","251 MONMOUTH RD","OAKHURST","NJ","07755","DENTAL","Orthodontist"]
[null,872625487,1902236375,"KATHERINE  MA","3016 TOWNSHIP LINE RD","DREXEL HILL","PA",19026,"DENTAL","General Dentist"]
[null,921581342,1891312211,"SAUMYA  VULLAGANTI","241 BYERS RD","CHESTER SPRINGS","PA",19425,"DENTAL","General Dentist"]
[null,850849636,1134439144,"MIRA  DELLA CROCE","20785 PROFESSIONAL PARK BLVD","GEORGETOWN","DE",19947,"DENTAL","General Dentist"]
[null,264073695,1275703308,"CHRISTOPHER HEALY FLEMING","1660 JESSE JEWELL PKWY STE B","GAINESVILLE","GA",30501,"DENTAL","Endodontist"]
[null,811231274,1316293848,"HIEU TIN NGUYEN PHAM","5547 HIGHWAY 6 N","HOUSTON","TX",77084,"DENTAL","General Dentist"]
[null,993945661,1790167906,"ANDREW D SIEGER","119 W MAIN ST","NEW HOLLAND","PA",17557,"DENTAL","General Dentist"]
[null,611417470,1598438764,"BRODIE  ORR","285 ELM ST STE 200","CUMMING","GA",30040,"DENTAL","General Dentist"]
[null,853715519,1033808555,"STEVEN  JASKIEL","801 SE 6TH AVE STE 105","DELRAY BEACH","FL",33483,"DENTAL","General Dentist"]
[null,522256432,1598966228,"PARVIN R MADANI","338 N CHARLES ST","BALTIMORE","MD",21201,"DENTAL","General Dentist"]
[null,881893543,1699396978,"JOSEPH  LEGG II","514 N BLAKELY ST","DUNMORE","PA",18512,"DENTAL","Endodontist"]
[null,810530878,1033432737,"JEFFERY M HAMLING","3997 VALLEY COMMONS DR STE B","BOZEMAN","MT",59718,"DENTAL","General Dentist"]
[null,208584491,1245278647,"ANDREW C ALTHAUSER","237 SW HIGGINS AVE STE C","MISSOULA","MT",59803,"DENTAL","General Dentist"]
[null,814756646,1326206814,"JOHN J MELTON","141 PASEO DE PERALTA STE C","SANTA FE","NM",87501,"DENTAL","Periodontist"]
[null,854126399,1457323974,"SCOTT A WENK","7005 S TAMIAMI TRL","SARASOTA","FL",34231,"DENTAL","Oral Surgeon"]
[null,591299709,1295255461,"WILLIAM C CLEMISHIRE","210 JACKSON AVE","SATELLITE BEACH","FL",32937,"DENTAL","General Dentist"]
[null,232109545,1942249545,"RICHARD J CLARK","1050 BALTIMORE PIKE STE 1","SPRINGFIELD","PA",19064,"DENTAL","Oral Surgeon"]
[null,233024574,1548490451,"LINDI  ORLIN","1460 RUSSELL RD STE 203","PAOLI","PA",19301,"DENTAL","Endodontist"]
[null,471951499,1093003733,"TARYN K HARRELD","3579 HENRY ST STE 120","NORTON SHORES","MI",49441,"DENTAL","Endodontist"]
[null,824091757,1457449142,"LISA J LUMPKIN","4270 CARMICHAEL RD","MONTGOMERY","AL",36106,"DENTAL","General Dentist"]
[null,356001673,1699841270,"HARVEY  WEINGARTEN","1121 W MICHIGAN ST","INDIANAPOLIS","IN",46202,"DENTAL","Public Health Dentist"]
[null,800596918,1750347498,"JASON H LUSTIG","940 KEYSER AVE","NATCHITOCHES","LA",71457,"DENTAL","General Dentist"]
[null,300521667,1821437203,"JULIEN N BELLAVANCE","34 JEFFERSON CT SUITE A","ZION CROSSROADS","VA",22942,"DENTAL","General Dentist"]
[null,271414142,1831329812,"JEFFREY S BANICH","775 S MAIN ST STE C","COLVILLE","WA",99114,"DENTAL","General Dentist"]
[null,412192328,1720046493,"MICHAEL  WILL","3280 URBANA PIKE STE 201","IJAMSVILLE","MD",21754,"DENTAL","General Dentist"]
[null,831045848,1215467881,"RACHAEL E CREISHER","1750 POST RD","WELLS","ME","04090","DENTAL","General Dentist"]
[null,331302970,1639805104,"CHRISTOPHER K CHAFFIN","3165 S ALMA SCHOOL RD STE 26","CHANDLER","AZ",85248,"DENTAL","General Dentist"]
[null,"010565357",1821336314,"DEREK J KLEPSKY","1000 GAMMA DR STE 108","PITTSBURGH","PA",15238,"DENTAL","Endodontist"]
[null,473317550,1780717397,"KARI L BRAWLEY","110 N WASHINGTON ST","LA GRANGE","TX",78945,"DENTAL","General Dentist"]
[null,201923011,1174675615,"STEPHEN X HUANG","1 W ASHLAND AVE","GLENOLDEN","PA",19036,"DENTAL","General Dentist"]
[null,453647189,1336234251,"NICHOLAS S AGAPIS","1475 BANNISTER ST","YORK","PA",17404,"DENTAL","General Dentist"]
[null,522259263,1679766794,"LISA S COHEN","1300 SPRING ST # 350","SILVER SPRING","MD",20910,"DENTAL","Oral Surgeon"]
[null,411981429,1235202466,"TASHA T STRAIT","201 W RAVEN ST","BELLE PLAINE","MN",56011,"DENTAL","General Dentist"]
[null,562284847,1174731467,"BONNIE  KUNG","432 STATE ROUTE 34 STE 1","MATAWAN","NJ","07747","DENTAL","General Dentist"]
[null,203167069,1710313697,"DIPAK V CHAUDHARI","1685 CROWN AVE STE 200","LANCASTER","PA",17601,"DENTAL","General Dentist"]
[null,263126437,1912173253,"WILLIAM W LYONS","31 WILLOWBROOK RD","QUEENSBURY","NY",12804,"DENTAL","General Dentist"]
[null,473807276,1255765756,"AZADEH  SHAHAB","63 GREAT RD STE 105","MAYNARD","MA","01754","DENTAL","General Dentist"]
[null,473127616,1992967236,"FRANCO  MIELE","18593 BEACH BLVD STE B","HUNTINGTON BEACH","CA",92648,"DENTAL","General Dentist"]
[null,822272495,1588963292,"SCOTT E DORAN","185 DRUM POINT RD","BRICK","NJ","08723","DENTAL","General Dentist"]
[null,561580925,1245242718,"RICHARD A KAPITAN","8840 BLAKENEY PROFESSIONAL DR STE 300","CHARLOTTE","NC",28277,"DENTAL","Oral Surgeon"]
[null,461545957,1598741548,"FRANK  STRICKLAND","1503 DODONA TER STE 105","LEESBURG","VA",20175,"DENTAL","Oral Surgeon"]
[null,453566874,1154489771,"POORNIMA  MADANAPALLI","163 US HIGHWAY 130N BUILDING 1 STE C","BORDENTOWN","NJ","08505","DENTAL","General Dentist"]
[null,900003653,1003301599,"JOSEPH  LAUKAITIS","7650 BELAIR RD","BALTIMORE","MD",21236,"DENTAL","General Dentist"]
[null,263264815,1710024013,"DONGJIN  SHIN","658 N BLACK HORSE PIKE","RUNNEMEDE","NJ","08078","DENTAL","General Dentist"]
[null,862626121,1932630035,"DAVID  ROE","10009 SOUTHPOINT PKWY STE 201A","FREDERICKSBURG","VA",22407,"DENTAL","Oral Surgeon"]
[null,461204502,1952622433,"JUN H CHUNG","19440 GOLF VISTA PLZ STE 250","LEESBURG","VA",20176,"DENTAL","General Dentist"]
[null,912184217,1548379290,"TODD R IRWIN","620 E 8TH ST","PORT ANGELES","WA",98362,"DENTAL","General Dentist"]
[null,883445673,1083076707,"NEHA  GREWAL","447 ROUTE 10 EAST STE 5","RANDOLPH","NJ","07869","DENTAL","Oral Surgeon"]
[null,473988433,1902894041,"JASON F BAKER","8234 FAIRVIEW RD","MINT HILL","NC",28227,"DENTAL","General Dentist"]
[null,261635589,1477624989,"ANTONIO L DEL VALLE","16 E 52ND ST STE 1101","NEW YORK","NY",10022,"DENTAL","Oral Surgeon"]
[null,814626707,1598805608,"FRANKLYN  SCOTT","1 WINDING DR STE 105","PHILADELPHIA","PA",19131,"DENTAL","Oral Surgeon"]
[null,811932732,1114119260,"REID L CHANEY","5000 NC HIGHWAY 49 S","HARRISBURG","NC",28075,"DENTAL","General Dentist"]
[null,270425189,1285613562,"RICHARD W STEVENS","4251 ARENDELL ST STE H","MOREHEAD CITY","NC",28557,"DENTAL","Endodontist"]
[null,880971137,1619031440,"ALISON J MCMILLIAN","1126 N CHURCH ST STE 100","GREENSBORO","NC",27401,"DENTAL","Orthodontist"]
[null,874323815,1346651874,"ANDREW S MCNEAL","101 REDFORD PLACE DR STE 300","ROLESVILLE","NC",27571,"DENTAL","General Dentist"]
[null,454395247,1831535640,"JENNIFER B TIPOGRAPH","5809 NICHOLSON LN STE T123","NORTH BETHESDA","MD",20852,"DENTAL","General Dentist"]
[null,860562804,1952616062,"TIMOTHY H CROSS","7493 N ORACLE RD STE 217","TUCSON","AZ",85704,"DENTAL","Endodontist"]
[null,452671661,1437484128,"BETHANY A DOUGLAS","228 SOUTHPARK CIR E","SAINT AUGUSTINE","FL",32086,"DENTAL","Endodontist"]
[null,862496016,1215466826,"AMANDA L HURLEY","1501 S CLINTON ST STE 335","BALTIMORE","MD",21224,"DENTAL","General Dentist"]
[null,383063197,1366051146,"TAESU  PAK","415 W COMMERCE RD","COMMERCE TOWNSHIP","MI",48382,"DENTAL","General Dentist"]
[null,270235791,1023243649,"CHRISTOPHER W PARSONS","14333 JARRETTSVILLE PIKE STE 101","PHOENIX","MD",21131,"DENTAL","General Dentist"]
[null,232511384,1831295914,"THOMAS R LAMBERT","2299 BRODHEAD RD STE E","BETHLEHEM","PA",18020,"DENTAL","General Dentist"]
[null,392156287,1538645445,"JOHN C ABRAHAMSON","619 SW HIGGENS AVE STE P","MISSOULA","MT",59803,"DENTAL","General Dentist"]
[null,454598657,1699753608,"ERICH P HEITMAN","409 CARTERET ST","BEAUFORT","SC",29902,"DENTAL","Endodontist"]
[null,884139525,1952832321,"ANGELA P URRUCHI","198 S NOVA RD","ORMOND BEACH","FL",32174,"DENTAL","General Dentist"]
[null,450834274,1902472012,"BARBARA A MOORE","1147 STONECREST BLVD","TEGA CAY","SC",29708,"DENTAL","General Dentist"]
[null,200647278,1699789172,"CLAYTON  OWEN","1306 S PINE ST","CABOT","AR",72023,"DENTAL","Orthodontist"]
[null,550779560,1720381981,"CRAIG A ATCHISON","10 PROFESSIONAL VILLAGE CIRCLE","BEAUFORT","SC",29907,"DENTAL","Endodontist"]
[null,844533929,1548044365,"MITUL  AHMED","9031 US HIGHWAY 42 STE A","UNION","KY",41091,"DENTAL","General Dentist"]
[null,611772086,1164125712,"REY G CARANDANG","1234 S HOVER ST STE 100","LONGMONT","CO",80501,"DENTAL","General Dentist"]
[null,850784189,1568735785,"VIKAS  PURI","140 GAGE BLVD STE 200","RICHLAND","WA",99352,"DENTAL","Periodontist"]
[null,843336045,1801278189,"MELISSA JOYCE NIXON","8101 SOUTHSIDE BLVD STE 8","JACKSONVILLE","FL",32256,"DENTAL","General Dentist"]
[null,232264147,1841370798,"BRYAN E LAUER","102 W HIGH ST","ELIZABETHTOWN","PA",17022,"DENTAL","General Dentist"]
[null,470997983,1154904563,"AASHIN  GOKAL","1325 FLORIDA MALL AVE","ORLANDO","FL",32809,"DENTAL","General Dentist"]
[null,562185627,1477637114,"JASON A CAPUTO","191 COOPER CREEK DR STE 106","MOCKSVILLE","NC",27028,"DENTAL","General Dentist"]
[null,431762476,1437229739,"SCOTT D NEWLIN","303 JUNGERMANN RD STE A","SAINT PETERS","MO",63376,"DENTAL","Endodontist"]
[null,231995431,1285628040,"KIM  THOMAS","2301 E ALLEGHENY AVE STE 201","PHILADELPHIA","PA",19134,"DENTAL","Pediatric Dentist"]
[null,873133746,1104478189,"MEERA  SAHNI","2130 NJ 35 STE 121","SEA GIRT","NJ","08750","DENTAL","Periodontist"]
[null,232869062,1467760694,"JUDEE  HASHEM RAPOZA","880 TOWNSHIP LINE RD","PLYMOUTH MEETING","PA",19462,"DENTAL","General Dentist"]
[null,830859425,1407269079,"ANDREW S KLOCH","1602 HWY 17 N","SURFSIDE BEACH","SC",29575,"DENTAL","General Dentist"]
[null,521719647,1124018460,"LUBOR L HLOUSEK","101 SAINT CLAIRE PL Ste 100","STEVENSVILLE","MD",21666,"DENTAL","Oral Surgeon"]
[null,834238774,1356836761,"MEGHA H AGRAWAL","8815 CHRISTENBURY PKWY STE 40","CONCORD","NC",28027,"DENTAL","General Dentist"]
[null,461658599,1740487578,"ZACHARY T DODSON","135 S WAKEA AVE STE 211","KAHULUI","HI",96732,"DENTAL","Endodontist"]
[null,542072703,1639857659,"DYLAN  HOLLOWAY","200 12TH ST W STE A","TIFTON","GA",31794,"DENTAL","General Dentist"]
[null,465767371,1821258310,"TIMOTHY J GOSLEE","48 N MAIN ST","NEWMARKET","NH","03857","DENTAL","General Dentist"]
[null,541674333,1376617217,"CAROLYN C HERRING","9 PINNACLE DR STE #101","FISHERSVILLE","VA",22939,"DENTAL","Endodontist"]
[null,834506914,1922551688,"ALEX J MERCADO","1315 ALHAMBRA BLVD STE 220","SACRAMENTO","CA",95816,"DENTAL","General Dentist"]
[null,591360433,1508839861,"DANIEL J CROFTON","265 HATTERAS AVE","CLERMONT","FL",34711,"DENTAL","Oral Surgeon"]
[null,200084011,1801419536,"KARINA  ALOIAN","10108 BUSTLETON AVE","PHILADELPHIA","PA",19116,"DENTAL","General Dentist"]
[null,208672835,1437369493,"EUGENE K OLSEN","9920 COULOAK DR STE 100","CHARLOTTE","NC",28216,"DENTAL","General Dentist"]
[null,273276136,1578699088,"YVETTE T WEIR","1329 PENNSYLVANIA AVE STE 201","HAGERSTOWN","MD",21742,"DENTAL","General Dentist"]
[null,383087957,1073596508,"JENEEN M MARTIN","821 PYLE DR","KINGSFORD","MI",49802,"DENTAL","General Dentist"]
[null,593735922,1609805357,"DEREK A SLOSSER","430 N MILLS AVE STE 2","ORLANDO","FL",32803,"DENTAL","Endodontist"]
[null,830987180,1891429270,"TIMOTHY  MESSERLY","4358 W CHEYENNE AVE","NORTH LAS VEGAS","NV",89032,"DENTAL","General Dentist"]
[null,251771565,1891853867,"DAVID R ENGLEHART","220 REGENT CT STE D","STATE COLLEGE","PA",16801,"DENTAL","General Dentist"]
[null,824885953,1427153840,"BRETT Z GODLEWSKI","1223 N PROVIDENCE RD STE 1","MEDIA","PA",19063,"DENTAL","Oral Surgeon"]
[null,453168367,1659555001,"RAPHAEL A ASON","3172 BILL BECK BLVD","KISSIMMEE","FL",34744,"DENTAL","Oral Surgeon"]
[null,333616943,1760101752,"KHUSHBU S PATEL","200 N LESLIE ST","GOLDSBORO","NC",27530,"DENTAL","General Dentist"]
[null,660805555,1902886476,"SAMMY E RIVERA ADAMES","CALLE LOPEZ HORMAZABAL C-42 URB MADRID","JUNCOS","PR","00777","DENTAL","General Dentist"]
[null,270895943,1619060217,"BRAD A LIPKIN","2751 ENTERPRISE RD #211","ORANGE CITY","FL",32763,"DENTAL","Endodontist"]
[null,273609825,1952389744,"AARON M SWENSON","618 S PEABODY ST STE A","PORT ANGELES","WA",98362,"DENTAL","General Dentist"]
[null,455417510,1659481554,"MARK E BUFALINI","52 OFFICE PARK DR STE A","JACKSONVILLE","NC",28546,"DENTAL","Oral Surgeon"]
[null,561133278,1609435379,"ANDREW  SCHWEIZER","1602 BENJAMIN PKWY STE A","GREENSBORO","NC",27408,"DENTAL","General Dentist"]
[null,200185918,1518605781,"MARY  DIXON","7385 UNIVERSITY PKWY","BRADENTON","FL",34202,"DENTAL","General Dentist"]
[null,873267744,1508451485,"JUSTIN R SMITH","345 SAXONY RD STE 103","ENCINITAS","CA",92024,"DENTAL","General Dentist"]
[null,232850863,1720191703,"CATHY M SALAK","615 ROOSEVELT HWY","WAYMART","PA",18472,"DENTAL","General Dentist"]
[null,933528512,1487263067,"LORI S GRUSKIN","8351 S JOHN YOUNG PKWY","ORLANDO","FL",32819,"DENTAL","General Dentist"]
[null,822852923,1609373059,"COLE  MURBACH","2611 SE 17TH ST STE A","OCALA","FL",34471,"DENTAL","Oral Surgeon"]
[null,251320584,1730693227,"KATELYN M PETRAGLIA","117 FOX PLAN RD","MONROEVILLE","PA",15146,"DENTAL","Endodontist"]
[null,813838756,1487100897,"ERFAN  IMENI KASHANI","5318 NC-55 STE 101","DURHAM","NC",27713,"DENTAL","General Dentist"]
[null,851484893,1689895815,"JEFFREY G MINCHAU","85 THOMAS JOHNSON CT STE A","FREDERICK","MD",21702,"DENTAL","Endodontist"]
[null,300468816,1306836028,"MARC J HERTZBERG","2590 PARK CENTER BLVD STE 102","STATE COLLEGE","PA",16801,"DENTAL","Endodontist"]
[null,593659081,1679636849,"JOSEPH M KILMAN","161 COLONY PARK RD","NEW SMYRNA BEACH","FL",32168,"DENTAL","General Dentist"]
[null,933316144,1083282883,"ALEKSANDR  KITAYGORODSKIY","255 S 17TH ST STE 1206","PHILADELPHIA","PA",19103,"DENTAL","Periodontist"]
[null,263975070,1619538832,"GEORGE E TOLSON","50 PLAZA DR STE 201","PALM COAST","FL",32137,"DENTAL","Periodontist"]
[null,851570499,1730873688,"RIYA  SABU","4605 STATE RD","DREXEL HILL","PA",19026,"DENTAL","General Dentist"]
[null,842765128,1538699202,"SVETLANA  WAIBEL","545 N BETHLEHEM PIKE STE 202","AMBLER","PA",19002,"DENTAL","General Dentist"]
[null,262989957,1811440423,"MARK  JENSEN","1435 MESA VIEW DR","DELTA","CO",81416,"DENTAL","General Dentist"]
[null,832025842,1619200508,"SIRISHA  MUPPIDI","410 SOUTH MAIN ST","CONCORD","NH","03301","DENTAL","General Dentist"]
[null,593365515,1487492278,"OKSANA  BAILEY","237 E INTERNATIONAL SPEEDWAY BLVD STE 1B","DELAND","FL",32724,"DENTAL","General Dentist"]
[null,274172895,1659516920,"KENNEDY  DELE","161 JENNIFER ROAD #B","ANNAPOLIS","MD",21401,"DENTAL","General Dentist"]
[null,203167069,1326889221,"JANELLE  NASSAR","1685 CROWN AVE STE 200","LANCASTER","PA",17601,"DENTAL","General Dentist"]
[null,475577858,1609910249,"JAMES E SCHALL","333 GREEN ST","HAVRE DE GRACE","MD",21078,"DENTAL","General Dentist"]
[null,200185918,1790347250,"NICOLE  GRIFFITH","1200 TAMIAMI TRL N","NOKOMIS","FL",34275,"DENTAL","General Dentist"]
[null,920741428,1851456941,"RICHARD E FELDHAKE","5310 W THUNDERBIRD RD STE 111","GLENDALE","AZ",85306,"DENTAL","General Dentist"]
[null,844652783,1730530874,"DUSTIN R PLUNKETT","154 GARDENERS CIRCLE","KIAWAH ISLAND","SC",29455,"DENTAL","General Dentist"]
[null,231966639,1134227036,"LYNNETTE  MESINA","19 MORRIS AVE","BRYN MAWR","PA",19010,"DENTAL","General Dentist"]
[null,320453960,1710211958,"QUAN  NGHIEM","273 SOUTHWEST CUTOFF","NORTHBOROUGH","MA","01532","DENTAL","Endodontist"]
[null,201990392,1750734703,"JASON  ALTER","2185 UPTON DR","VIRGINIA BEACH","VA",23454,"DENTAL","General Dentist"]
[null,175688243,1518383900,"JACQUELINE  MILONE","601 EWING ST STE 4B","PRINCETON","NJ","08540","DENTAL","General Dentist"]
[null,710902611,1952770703,"BRIAN D HALL","604 SOLAREX CT UNT 202","FREDERICK","MD",21703,"DENTAL","Endodontist"]
[null,341493923,1700060027,"MICHAEL A KIMBERLY","1852 MERRIMAN RD","AKRON","OH",44313,"DENTAL","General Dentist"]
[null,844797574,1033573209,"KENNETH S DONAHUE","1517 PACKER AVE","PHILADELPHIA","PA",19145,"DENTAL","General Dentist"]
[null,272620863,1073642195,"KAREN F KENNY","3719 OLD FOREST RD","LYNCHBURG","VA",24501,"DENTAL","General Dentist"]
[null,860562804,1902959521,"JUSTIN S HUGHES","7395 S HOUGHTON RD BLDG 5","TUCSON","AZ",85747,"DENTAL","Endodontist"]
[null,522199075,1174361026,"JIHYE  PARK","11404 OLD GEORGETOWN RD STE 204","NORTH BETHESDA","MD",20852,"DENTAL","General Dentist"]
[null,824414227,1295437887,"JENNIFER MARIE CRUZ","18851 UNIVERSITY BLVD #210","SUGAR LAND","TX",77479,"DENTAL","General Dentist"]
[null,813536737,1801937594,"RASMI  AKEL","3935 S JOG RD STE 16","GREENACRES","FL",33467,"DENTAL","General Dentist"]
[null,222218302,1962841205,"KRISTINE A GLEASON","213 N BROADWAY","PENNSVILLE","NJ","08070","DENTAL","Oral Surgeon"]
[null,232347052,1023756988,"KAILIN E GUTTMAN","1581 MCDANIEL DR","WEST CHESTER","PA",19380,"DENTAL","General Dentist"]
[null,822698076,1225254816,"DONNA  SPARKS","420 24TH AVE SW","NORMAN","OK",73069,"DENTAL","General Dentist"]
[null,454879929,1801594924,"CHRISTINE MARIE DEROSA","902 KITTY HAWK RD STE 100","UNIVERSAL CITY","TX",78148,"DENTAL","General Dentist"]
[null,752286149,1962452581,"PHILIP M DUNN","1016 STONEWALL ST","GARLAND","TX",75043,"DENTAL","General Dentist"]
[null,262775992,1164031613,"REBECCA  TSAI","323 BOSTON POST RD","SUDBURY","MA","01776","DENTAL","Endodontist"]
[null,862339513,1811335938,"BRITNI L KEARNS","1029 SYCAMORE AVE","TINTON FALLS","NJ","07724","DENTAL","Pediatric Dentist"]
[null,920178900,1366659203,"ALLEN J WEI","5308 LAKE MURRAY BLVD STE A","LA MESA","CA",91942,"DENTAL","Endodontist"]
[null,251236859,1023249786,"DAVID ADAM MYERS","702 W 34TH ST","ERIE","PA",16508,"DENTAL","General Dentist"]
[null,760666128,1851302301,"THAO H NGUYEN","5042 AVENUE H # 428","ROSENBERG","TX",77471,"DENTAL","General Dentist"]
[null,472086220,1619265618,"COLLIN T LINN","2039 LYCOMING CREEK RD","WILLIAMSPORT","PA",17701,"DENTAL","General Dentist"]
[null,813536737,1104596121,"HELYA  SEDATI","3935 S JOG RD STE 16","GREENACRES","FL",33467,"DENTAL","General Dentist"]
[null,364737737,1518174028,"BO A BYUN","11015 STRATFIELD CT","MARRIOTTSVILLE","MD",21104,"DENTAL","General Dentist"]
[null,721399428,1609985365,"TRES H MANASCO","27695 US HIGHWAY 98","DAPHNE","AL",36526,"DENTAL","Endodontist"]
[null,461105396,1043835549,"NEYSHA  PATEL","111 BROADWAY RM 1304","NEW YORK","NY",10006,"DENTAL","General Dentist"]
[null,844743601,1558538421,"ALAN M WONG","1455 E HIGHWAY 50","CLERMONT","FL",34711,"DENTAL","Orthodontist"]
[null,990670834,1508286170,"PERNELL M ROGERS","8150 MT HOLLY HUNTERSVILLE RD","CHARLOTTE","NC",28216,"DENTAL","General Dentist"]
[null,471226661,1508024787,"BRIAN T SHAUGHNESSY","6532 ANTHONY DR STE C","VICTOR","NY",14564,"DENTAL","General Dentist"]
[null,201691777,1487640801,"JOHN A MADDOX","8076B SPRING RUN DR","FAIRHOPE","AL",36532,"DENTAL","General Dentist"]
[null,200418100,1801942594,"KELLEE L STONE","1315 BELL ROAD","ANTIOCH","TN",37013,"DENTAL","General Dentist"]
[null,"020658383",1417087347,"BRIDGET M RYAN","23203 LORAIN RD STE 1","NORTH OLMSTED","OH",44070,"DENTAL","General Dentist"]
[null,431970131,1780853135,"PHILLIP J GOFF","8620 STERLING LN","PORT RICHEY","FL",34668,"DENTAL","General Dentist"]
[null,593432739,1083955819,"SAMUEL  LANDRIAN","6731 MADISON ST","NEW PORT RICHEY","FL",34652,"DENTAL","Oral Surgeon"]
[null,"030609351",1972662906,"TRISHA A KRAUSE","5318 B PATTERSON AVE","RICHMOND","VA",23226,"DENTAL","Endodontist"]
[null,481294333,1831287929,"TIMOTHY M HALE","23922 CINCO VILLAGE CENTER BLVD STE 220","KATY","TX",77494,"DENTAL","Periodontist"]
[null,270587395,1194840934,"ROSS S FULLER","4097 IRONBOUND RD STE C","WILLIAMSBURG","VA",23188,"DENTAL","General Dentist"]
[null,331116467,1972523678,"JOSEPH V VAUGHAN","130 CEDAR KNOLL DR","RONCEVERTE","WV",24970,"DENTAL","General Dentist"]
[null,831695805,1518496652,"MARCELO D URIEGAS","2201 W HIGHWAY 290 BLDG A","DRIPPING SPRINGS","TX",78620,"DENTAL","General Dentist"]
[null,452546142,1265091870,"EMERSON JEFFREY BOOGAARD","10484 STRINGFELLOW RD STE 3","ST JAMES CITY","FL",33956,"DENTAL","General Dentist"]
[null,830632145,1225410533,"KEVIN  TO","18275 N 59TH AVE # A-102","GLENDALE","AZ",85308,"DENTAL","General Dentist"]
[null,824969204,1033559281,"SEAN ABRAHAM TOMALTY","10229 OKEECHOBEE BLVD STE C1","ROYAL PALM BEACH","FL",33411,"DENTAL","General Dentist"]
[null,873209909,1174059679,"SOUREN  HAJJAR","3900 S SUNCOAST BLVD","HOMOSASSA","FL",34448,"DENTAL","Oral Surgeon"]
[null,200120892,1184151714,"CHANDNI  PATEL","130 S STATE RD STE 300","SPRINGFIELD","PA",19064,"DENTAL","Pediatric Dentist"]
[null,922309960,1760809149,"ABELARDO  HEREDIA","3398 FORUM BLVD STE 102","FORT MYERS","FL",33905,"DENTAL","General Dentist"]
[null,231981313,1043339674,"ROBERT L RAPINE","491 ALLENDALE RD STE 306","KING OF PRUSSIA","PA",19406,"DENTAL","General Dentist"]
[null,811205650,1073193819,"JULIA  LECAVALIER","16 INDUSTRIAL BLVD, STE 216","PAOLI","PA",19301,"DENTAL","General Dentist"]
[null,510376139,1154536464,"MICHAEL T ALOE","750 KINGS HWY","LEWES","DE",19958,"DENTAL","Endodontist"]
[null,393966858,1497987457,"CASEY D WITTY","704 N MAIN STREET","NICHOLASVILLE","KY",40356,"DENTAL","General Dentist"]
[null,992420978,1821440942,"HOJIN  KIM","16 W VINE ST","MILLVILLE","NJ","08332","DENTAL","General Dentist"]
[null,232939632,1467814699,"CHRISTOPHER  PAOLINO","15 REGENCY PLZ","GLEN MILLS","PA",19342,"DENTAL","Oral Surgeon"]
[null,364749860,1124320585,"NICHOLAS BRAD ROWLEY","205 W NEW HAVEN AVE","MELBOURNE","FL",32901,"DENTAL","General Dentist"]
[null,825295341,1598020539,"TARLAN  ARSHIAN","4133 OGLETOWN STANTON RD","NEWARK","DE",19713,"DENTAL","General Dentist"]
[null,873209909,1427320407,"KARINE  CALIXTE","3900 S SUNCOAST BLVD","HOMOSASSA","FL",34448,"DENTAL","General Dentist"]
[null,863342866,1881263481,"RAUL  ISTURIZ","720 JOHNSVILLE BLVD STE 1210","WARMINSTER","PA",18974,"DENTAL","General Dentist"]
[null,454315789,1003051541,"CUONG CHI HO","156 WEST PORTAL AVE STE C","SAN FRANCISCO","CA",94127,"DENTAL","General Dentist"]
[null,710901828,1285783118,"JEONG-YUP  KIM","14044 W CAMELBACK RD STE 106","LITCHFIELD PARK","AZ",85340,"DENTAL","General Dentist"]
[null,202414969,1477567584,"TODD P ROTH","4724 WOODMERE BLVD","MONTGOMERY","AL",36106,"DENTAL","General Dentist"]
[null,223013130,1710211388,"PETER E WIESEL","222 NEW RD STE 401","LINWOOD","NJ","08221","DENTAL","Prosthodontist"]
[null,330786025,1659430247,"VALENTINA  OBRADOVIC","2345 S MELROSE DR","VISTA","CA",92081,"DENTAL","General Dentist"]
[null,"020618170",1275664641,"PETER G VEALE","45 SLOCUM RD","NORTH DARTMOUTH","MA","02747","DENTAL","General Dentist"]
[null,825499609,1013069491,"MICHAEL B BUSH","904 SPIVEY RD","WHITEVILLE","NC",28472,"DENTAL","General Dentist"]
[null,200265650,1083761282,"KEVIN G EUBANKS","174 CREPE MYRTLE DR","AIKEN","SC",29803,"DENTAL","General Dentist"]
[null,863270868,1396364535,"RUWAYDAH A SHALASH","2708 CLEMSON RD STE A","COLUMBIA","SC",29229,"DENTAL","General Dentist"]
[null,274595811,1619743382,"STEPHEN V WHITEKO","1408 SKIBO RD","FAYETTEVILLE","NC",28303,"DENTAL","General Dentist"]
[null,872914677,1093801490,"TAMEKO D ALFORD","1589 SKEET CLUB RD STE 150","HIGH POINT","NC",27265,"DENTAL","General Dentist"]
[null,900588430,1699941096,"RYAN K GRAVER","115 FARLEY CIR STE 201","LEWISBURG","PA",17837,"DENTAL","Endodontist"]
[null,231981717,1699983452,"JASON P DEVEY","4661 TRINDLE RD","CAMP HILL","PA",17011,"DENTAL","Endodontist"]
[null,854222892,1598458929,"MARIA  LINARES","2940 MALLORY CIR STE 101","KISSIMMEE","FL",34747,"DENTAL","General Dentist"]
[null,271577629,1720184575,"BRYAN C DUNSTON","55 AMARILLO LN","SANFORD","NC",27332,"DENTAL","Pediatric Dentist"]
[null,611772086,1265620561,"JASON E MAINES","1234 S HOVER ST STE 100","LONGMONT","CO",80501,"DENTAL","Endodontist"]
[null,810915238,1740249390,"RODRIGO P VALLAR","109 OLD PADONIA RD","COCKEYSVILLE","MD",21030,"DENTAL","General Dentist"]
[null,853286960,1902280076,"SIMAR  KAUR","1315 S ALLEN ST STE 204","STATE COLLEGE","PA",16801,"DENTAL","General Dentist"]
[null,813727438,1205157567,"EKTA  SAGAR","7975 W GRAND PKWY S STE 120","RICHMOND","TX",77407,"DENTAL","General Dentist"]
[null,263800267,1558569012,"BHAVINKUMAR P PATEL","9859 PATRIOT HWY","FREDERICKSBURG","VA",22407,"DENTAL","General Dentist"]
[null,853055745,1851609820,"SVETLANA  USHERENKO","940 S LEGACY DR SUITE 10","PROSPER","TX",75078,"DENTAL","General Dentist"]
[null,814626707,1811372477,"PETER  KRUMBHAAR","1 WINDING DR STE 105","PHILADELPHIA","PA",19131,"DENTAL","General Dentist"]
[null,521719647,1093036782,"CHRISTOPHER B CHAMBERS","101 RIDGELY AVE STE 21","ANNAPOLIS","MD",21401,"DENTAL","Oral Surgeon"]
[null,412224822,1972709756,"ANDREW  KIM","6741 MYRTLE AVE","GLENDALE","NY",11385,"DENTAL","General Dentist"]
[null,872153197,1568984847,"YASSAMIN  LENZI","3705 CHIQUITA BLVD S","CAPE CORAL","FL",33914,"DENTAL","General Dentist"]
[null,462717793,1043397805,"DANIEL L LEE","4569 DALLAS ST","ACWORTH","GA",30101,"DENTAL","General Dentist"]
[null,222192716,1033841713,"TAKSH  SHAH","2610 FEDERAL ST","CAMDEN","NJ","08105","DENTAL","General Dentist"]
[null,831572005,1356917215,"GABRIEL  RODRIGUEZ","6839 COLLIER BLVD STE 103","NAPLES","FL",34114,"DENTAL","General Dentist"]
[null,201080270,1598846768,"VINCENT  MONTGOMERY","1112 RAMBLING OAKS DR","NORMAN","OK",73072,"DENTAL","Oral Surgeon"]
[null,832876455,1942939830,"MAXIE G JOLLEY","208 PROFESSIONAL CIR","MOREHEAD CITY","NC",28557,"DENTAL","General Dentist"]
[null,770527949,1518958248,"JACOB H PHAM","6212 PETERS CREEK RD NW","ROANOKE","VA",24019,"DENTAL","General Dentist"]
[null,451266532,1013299221,"WILLIAM C HARDING","107 LANSFORD CT","MYRTLE BEACH","SC",29588,"DENTAL","General Dentist"]
[null,474245682,1790005866,"ASHLEY W LAMAY","110 MACTANLY PL STE A","STAUNTON","VA",24401,"DENTAL","General Dentist"]
[null,842464644,1558654525,"LARRY D EPSTEIN","810 LANDMARK DR STE 124","GLEN BURNIE","MD",21061,"DENTAL","General Dentist"]
[null,200185918,1174148928,"FERNANDO EMILIO MARTINEZ ESCOBAR","1509 SW PINE ISLAND ROAD","CAPE CORAL","FL",33991,"DENTAL","General Dentist"]
[null,263234229,1518036524,"JASON R MARTIN","409 W LUDINGTON AVE STE 101","LUDINGTON","MI",49431,"DENTAL","General Dentist"]
[null,454361286,1750693024,"ANVARALI  MOHAMMADH","8 W BROOKHAVEN RD","BROOKHAVEN","PA",19015,"DENTAL","General Dentist"]
[null,571206179,1336251578,"MEGAN J GRACY","1204 NW 69TH TER STE C","GAINESVILLE","FL",32605,"DENTAL","Endodontist"]
[null,450697074,1134299472,"SEAN  MORIARTY","245 BLOOMFIELD DR STE 211","LITITZ","PA",17543,"DENTAL","General Dentist"]
[null,510321801,1134565963,"AHMAD  ELTEJAYE","2001 CONCORD PIKE STE 200","WILMINGTON","DE",19803,"DENTAL","Oral Surgeon"]
[null,232775224,1609103423,"RICHARD  BERMAN","34 BERKLEY RD","DEVON","PA",19333,"DENTAL","General Dentist"]
[null,465108932,1639864937,"NAFTALI  AMSEL","134 ROUTE 25A","SHOREHAM","NY",11786,"DENTAL","General Dentist"]
[null,851503546,1215010012,"OWEN W ALLISON","100 S 18TH ST","COLUMBIA","PA",17512,"DENTAL","General Dentist"]
[null,205996747,1952714552,"PATRICIA B ZEFFERT","7801 YORK RD STE 218","TOWSON","MD",21204,"DENTAL","General Dentist"]
[null,232956246,1841209996,"ROBERT E LESNIAK","550 3RD AVE STE 2","KINGSTON","PA",18704,"DENTAL","Endodontist"]
[null,"020503522",1407884224,"STEPHEN  ANANIAN","278 LAFAYETTE RD BLDG E","PORTSMOUTH","NH","03801","DENTAL","General Dentist"]
[null,934682353,1447605951,"JOEL S BUTTERWORTH","2330 PLANK RD","FREDERICKSBURG","VA",22401,"DENTAL","General Dentist"]
[null,270417013,1154008704,"JONATHON WILLIAM COTTONE","1250 PEOPLES PLZ","NEWARK","DE",19702,"DENTAL","General Dentist"]
[null,870386059,1922790179,"JENNIFER L KNICKERBOCKER","726 N GREENFIELD RD STE 126","GILBERT","AZ",85234,"DENTAL","General Dentist"]
[null,873209909,1972975548,"CELIA  ANUEZ MORFFI","3900 S SUNCOAST BLVD","HOMOSASSA","FL",34448,"DENTAL","General Dentist"]
[null,920571444,1588912646,"FRANK W WOLF","7241 N THORNYDALE RD","TUCSON","AZ",85741,"DENTAL","General Dentist"]
[null,113627101,1003081811,"HAROLD  GUERRERO","1355 E 3RD AVE","BAY SHORE","NY",11706,"DENTAL","General Dentist"]
[null,871396870,1093282972,"MARKUS  RICHARD","2300 TAMIAMI TRAIL, UNIT 13 & 14","PORT CHARLOTTE","FL",33952,"DENTAL","General Dentist"]
[null,882521540,1225421092,"JULITA S MARASIGAN","1131 PROFESSIONAL DR","WILLIAMSBURG","VA",23185,"DENTAL","General Dentist"]
[null,900878121,1174582522,"SANDEEP P MAMMEN","23123 CINCO RANCH BLVD STE 230","KATY","TX",77494,"DENTAL","General Dentist"]
[null,471595754,1952375339,"WALTER F HAMPE","32919 US HIGHWAY 19 N","PALM HARBOR","FL",34684,"DENTAL","General Dentist"]
[null,471103697,1316355431,"ERIC R KUSHION","305 SUPERIOR AVE","CRYSTAL FALLS","MI",49920,"DENTAL","General Dentist"]
[null,474982361,1841689932,"DAVID J KIM","435 4TH AVE","SAN DIEGO","CA",92101,"DENTAL","General Dentist"]
[null,991925787,1093027344,"TRAVIS J FIEGLE","3901 C MAIN STREET","HILTON HEAD ISLAND","SC",29926,"DENTAL","Orthodontist"]
[null,630811931,1316031578,"LINDSAY  LIMBAUGH","600 AIRPORT RD SW","HUNTSVILLE","AL",35802,"DENTAL","General Dentist"]
[null,814367899,1144057688,"NINA  GOLOJUCH","400 MCFARLAN RD STE 200","KENNETT SQUARE","PA",19348,"DENTAL","General Dentist"]
[null,842438017,1013170018,"JESSICA R BOWEN","7 MYERS DR # B","MULLICA HILL","NJ","08062","DENTAL","Orthodontist"]
[null,871534276,1447788955,"LEAH  YI","74 OMEGA DR","NEWARK","DE",19713,"DENTAL","Orthodontist"]
[null,871534276,1740625094,"JOSEPH T FACCIOLO","1405 SILVERSIDE RD","WILMINGTON","DE",19810,"DENTAL","Orthodontist"]
[null,232075602,1689914848,"KENDRA SMEDLEY ADEY","797 E LANCASTER AVE STE 4","DOWNINGTOWN","PA",19335,"DENTAL","Orthodontist"]
[null,271666462,1245487909,"KURTIS A KACER","6450 N ORACLE RD","TUCSON","AZ",85704,"DENTAL","Orthodontist"]
[null,161247930,1376676866,"BARRY A ENTERLINE","1100 LONG POND RD STE 115","ROCHESTER","NY",14626,"DENTAL","General Dentist"]
[null,822081293,1619669744,"JETT  ANGELES","1820 E CRAIG RD SUITE 102","LAS VEGAS","NV",89030,"DENTAL","General Dentist"]
[null,232744085,1396872123,"T M SMITH","195 W LANCASTER AVE","PAOLI","PA",19301,"DENTAL","General Dentist"]
[null,550816317,1639599715,"HALEY JOELLE FREYMILLER","5445 VILLAGE DR STE 100","ROCKLEDGE","FL",32955,"DENTAL","General Dentist"]
[null,270684068,1316389703,"SETH M JONES","7841 ALEXANDER PROMENADE PL STE 100","RALEIGH","NC",27617,"DENTAL","General Dentist"]
[null,200185918,1184469835,"SOUMYA  KAVULURI","5837 SEVEN MILE DR","WILDWOOD","FL",34785,"DENTAL","General Dentist"]
[null,871631915,1760832380,"CORY D MCMAHAN","491 WILLIAMSON RD STE 205","MOORESVILLE","NC",28117,"DENTAL","General Dentist"]
[null,934933631,1841713526,"MELINDA R LEE","3033 NEWCASTLE LOOP","MYRTLE BEACH","SC",29588,"DENTAL","Endodontist"]
[null,814841918,1528366473,"DAVID  MONTGOMERY","212 S MAGNOLIA AVE","OCALA","FL",34471,"DENTAL","Oral Surgeon"]
[null,822272495,1912570094,"TARONN L SIMPSON","320 EVESBORO MEDFORD RD UNIT 101","MARLTON","NJ","08053","DENTAL","General Dentist"]
[null,200185918,1275211088,"ADDISON  HENDRICKS","1301 US HIGHWAY 41 BYP S","VENICE","FL",34285,"DENTAL","General Dentist"]
[null,261669779,1265455356,"LEONID  GOFMAN","1200 BUSTLETON PIKE STE 5","FEASTERVILLE TREVOSE","PA",19053,"DENTAL","General Dentist"]
[null,260506210,1548443369,"ABRAHAM  STEIN","1327 PROVIDENCE RD","BRANDON","FL",33511,"DENTAL","General Dentist"]
[null,231995431,1114137478,"NOAH A QUINN","5629 VINE ST STE C9","PHILADELPHIA","PA",19139,"DENTAL","Pediatric Dentist"]
[null,990544469,1083189179,"SAURABH  MANKOTIA","825 N TRAVIS ST","LIBERTY","TX",77575,"DENTAL","General Dentist"]
[null,"010708550",1124236278,"ANGEL K RAY","100 CHICUREL LANE","WAYNESBORO","VA",22980,"DENTAL","Periodontist"]
[null,592207423,1306072863,"MICHAEL W DELUCIA","14185 BEACH BLVD STE 2","JACKSONVILLE","FL",32250,"DENTAL","General Dentist"]
[null,383652805,1083889661,"AMY D KUHMICHEL","5505 PEACHTREE DUNWOODY RD # 660","ATLANTA","GA",30342,"DENTAL","Oral Surgeon"]
[null,461360035,1366522534,"RYAN C DUNN","915 OLD FERN HILL RD BLDG B Ste 302","WEST CHESTER","PA",19380,"DENTAL","General Dentist"]
[null,204150838,"NULL","PARK PLACE DENTAL","210 W PARK PL","NEWARK","DE",19711,"DENTAL","General Dentist"]
[null,410977720,1780266882,"HALLIE C SCHLEY","2221 FORD PKWY STE 201","SAINT PAUL","MN",55116,"DENTAL","General Dentist"]
[null,870880913,1750741302,"ANDREW  ROCKAFELLOW","133 S PEBBLE BEACH BLVD","SUN CITY CENTER","FL",33573,"DENTAL","Oral Surgeon"]
[null,262656934,1871834945,"YALING  LIU","2785 NW 49TH AVE UNIT 102","OCALA","FL",34482,"DENTAL","General Dentist"]
[null,822886177,1437443306,"DANIELLE L ROWLAND","506 PARK HILL CT STE 3","HENDERSONVILLE","NC",28739,"DENTAL","General Dentist"]
[null,522122194,1679732283,"MICHAEL R POLLOWITZ","4910 MASSACHUSETTS AVE NW","WASHINGTON","DC",20016,"DENTAL","General Dentist"]
[null,232136953,1710028857,"WILLIAM W WU","131 N 9TH ST STE 100","PHILADELPHIA","PA",19107,"DENTAL","General Dentist"]
[null,883354305,1740240472,"KARL D LEWIS","5215 MANATEE AVE W","BRADENTON","FL",34209,"DENTAL","General Dentist"]
[null,294449040,1386767325,"FRED D KINSEY","229 CAROLINA AVE","CHESTER","WV",26034,"DENTAL","General Dentist"]
[null,473402621,1326283771,"LEILY  RAZAVI","1352 SOUTH ST UNIT C2","PHILADELPHIA","PA",19147,"DENTAL","General Dentist"]
[null,850876234,1902467186,"JAMES M SCOTT","142 LEISURE LN","COLUMBIA","SC",29210,"DENTAL","General Dentist"]
[null,920812816,1669163648,"MORGAN W JACKSON","3015 MAPLEWOOD AVE","WINSTON SALEM","NC",27103,"DENTAL","General Dentist"]
[null,882674913,1669000980,"OMAR M DAWERI","1194 BIG BETHEL RD STE B","HAMPTON","VA",23666,"DENTAL","Periodontist"]
[null,871253120,1922466580,"SAMANTHA L KNIGHT","2405 SATELLITE BLVD STE 115","DULUTH","GA",30096,"DENTAL","General Dentist"]
[null,824886202,1205521150,"SANG  KIM","101 PELHAM DR","WAYNESBORO","VA",22980,"DENTAL","General Dentist"]
[null,455402141,1093855504,"JENNIFER R WATERMAN","879 LYNNHAVEN PKWY STE 109","VIRGINIA BEACH","VA",23452,"DENTAL","General Dentist"]
[null,932595142,1710662895,"MICHAEL  WILLIAMSON","118 MILLSTONE DR","HILLSBOROUGH","NC",27278,"DENTAL","General Dentist"]
[null,812998147,1205184371,"LISBETH  PULASKI","1710 DEKALB PIKE","BLUE BELL","PA",19422,"DENTAL","General Dentist"]
[null,472400453,1174844690,"ADAM  BULLEIGH","1840 E MAIN ST","PAWHUSKA","OK",74056,"DENTAL","General Dentist"]
[null,832512496,1588760490,"MARGARET  STUBBLEFIELD","9070 DEVLIN RD STE 120","BRISTOW","VA",20136,"DENTAL","General Dentist"]
[null,843417585,1134796659,"KEVIN C DAVIS","311 S MAIN ST","NORWOOD","NC",28128,"DENTAL","General Dentist"]
[null,872114367,1780995043,"HETAL S PATEL","2340 E STADIUM BLVD STE 6","ANN ARBOR","MI",48104,"DENTAL","General Dentist"]
[null,822405565,1558565408,"JENNIFER  STEWART","7600 RITCHIE HWY","GLEN BURNIE","MD",21061,"DENTAL","General Dentist"]
[null,203304460,1205999018,"SCOTT S HEYING","13406 NW MILITARY HWY","SAN ANTONIO","TX",78231,"DENTAL","General Dentist"]
[null,461005159,1568624245,"KYLE D BOGAN","7325 GOODING BLVD","DELAWARE","OH",43015,"DENTAL","General Dentist"]
[null,208533765,1144668732,"BART A STEARS","1060 S HARRISON RD STE 110","TUCSON","AZ",85748,"DENTAL","General Dentist"]
[null,"043133104",1982707253,"LOUIS  STYLOS","13 VILLAGE SQ","CHELMSFORD","MA","01824","DENTAL","General Dentist"]
[null,811205650,1073193819,"JULIA  LECAVALIER","16 INDUSTRIAL BLVD, STE 216","PAOLI","PA",19301,"DENTAL","General Dentist"]
[null,591779529,1568475226,"TODD R DENSON","2191 GARDEN ST","TITUSVILLE","FL",32796,"DENTAL","General Dentist"]
[null,421361721,1962597468,"ROBERT A DOSTAL","118 N BLOSSOM ST","SHENANDOAH","IA",51601,"DENTAL","General Dentist"]
[null,843138346,1275795353,"RACHEL C CLAY","1289 CEDAR SHOALS DR","ATHENS","GA",30605,"DENTAL","General Dentist"]
[null,871988033,1174048383,"JAMES B PLUMMER","10266 TWO NOTCH ROAD STE C","COLUMBIA","SC",29229,"DENTAL","General Dentist"]
[null,831271373,1205244043,"JARON P VANMETER","1995 BROADWAY STE 200","NEW YORK","NY",10023,"DENTAL","General Dentist"]
[null,824714004,1003161613,"DHAVAL R SHAH","9027 W CHESTER PIKE","UPPER DARBY","PA",19082,"DENTAL","General Dentist"]
[null,200185918,1710497474,"MARY  TA","2203 EVERGLADES LN","THE VILLAGES","FL",32163,"DENTAL","General Dentist"]
[null,260496307,1740621705,"LISA T NGUYEN","750 ROUTE 73 S STE 110","MARLTON","NJ","08053","DENTAL","General Dentist"]
[null,510196935,1639510522,"MICHAEL V CONTE","17068 LANKFORD HWY","EASTVILLE","VA",23347,"DENTAL","General Dentist"]
[null,202081532,1750498382,"MARIA C CHILA","100 CHURCH RD STE 302","ARDMORE","PA",19003,"DENTAL","General Dentist"]
[null,274592809,1609768035,"SHARV  AHUJA","1575 N 52ND ST STE 705","PHILADELPHIA","PA",19131,"DENTAL","General Dentist"]
[null,863076415,1013074426,"LEON S KULINSKI","1763 ALLEGHENY BLVD","RENO","PA",16343,"DENTAL","General Dentist"]
[null,462308131,1588191787,"MILAN VINOD DHANANI","7544 BELAIR RD","NOTTINGHAM","MD",21236,"DENTAL","Oral Surgeon"]
[null,990698377,1104959642,"GEORGE V GATZONIS","3316 DITMARS BLVD","ASTORIA","NY",11105,"DENTAL","General Dentist"]
[null,510501070,1194995399,"MAMLE O MANTE","555 WILLIAMS RD","WYNNEWOOD","PA",19096,"DENTAL","General Dentist"]
[null,465570092,1649563206,"HADI MOWAFFAK SHBEEB","3033 BRISTOL ST UNIT 103","COSTA MESA","CA",92626,"DENTAL","Endodontist"]
[null,341225841,1952504219,"JUSTIN B CLEMOW","2500 W STRUB RD STE A","SANDUSKY","OH",44870,"DENTAL","Oral Surgeon"]
[null,811234407,1447042437,"JULIE  LU","2326 S 3RD ST","PHILADELPHIA","PA",19148,"DENTAL","General Dentist"]
[null,232148658,1235258120,"HOWARD P FRAIMAN","100 S BROAD ST STE 2000","PHILADELPHIA","PA",19110,"DENTAL","General Dentist"]
[null,222350719,1962683953,"CHARA E PASTERNACK","1 BRITTON PL STE 11","VOORHEES","NJ","08043","DENTAL","Pediatric Dentist"]
[null,"014481502",1306913439,"GERALD M ROAN","205 WORCESTER CT","FALMOUTH","MA","02540","DENTAL","General Dentist"]
[null,814761709,1689922080,"ALIREZA  HAMIDZADEH","1896 URBANA PIKE STE 3","CLARKSBURG","MD",20871,"DENTAL","General Dentist"]
[null,932598983,1649957358,"MACIE  LONG","10015 BROADWAY ST STE A","PEARLAND","TX",77584,"DENTAL","General Dentist"]
[null,232001368,1619468022,"DAVID A YOUNG","1075 BERKSHIRE BLVD STE 800","WYOMISSING","PA",19610,"DENTAL","Oral Surgeon"]
[null,873173825,1386130805,"CAMILLE  BURNES","17 NELSON AVE","MELBOURNE","FL",32935,"DENTAL","General Dentist"]
[null,311403095,1093212581,"VICTORIA R VERGARA","5155 BRADENTON AVE STE 100","DUBLIN","OH",43017,"DENTAL","Oral Surgeon"]
[null,463718652,1881207009,"JORDAN J BELDEN","12419 SEAL BEACH BLVD","SEAL BEACH","CA",90740,"DENTAL","General Dentist"]
[null,883662023,1699896944,"ROLLIN  SARRADET","6211 W WILLIAM CANNON DR","AUSTIN","TX",78749,"DENTAL","General Dentist"]
[null,880948632,1538668199,"ALAN  SEIDENFELD","7479 LAKE WORTH RD STE B","LAKE WORTH","FL",33467,"DENTAL","General Dentist"]
[null,203296691,1194839472,"SILVANA  CUMANI","2200 MONTROSE ST","PHILADELPHIA","PA",19146,"DENTAL","General Dentist"]
[null,883312844,1235662776,"ATOUSSA  HALARY","5 HARRISON STREET","NEW YORK","NY",10013,"DENTAL","General Dentist"]
[null,873497814,1033648373,"RADHA D PATEL","1701 FUTURE WAY","CELEBRATION","FL",34747,"DENTAL","General Dentist"]
[null,232815882,1760178560,"SALINA  CHOWDHURY","2455 GRANT AVE","PHILADELPHIA","PA",19114,"DENTAL","General Dentist"]
[null,843695004,1508061946,"CHRISTINA  CHO","5413 W CEDAR LN STE 205C","BETHESDA","MD",20814,"DENTAL","General Dentist"]
[null,883873658,1326353673,"SAMANTHA  KOFLER","217 S 2ND AVE","WALLA WALLA","WA",99362,"DENTAL","General Dentist"]
[null,383775013,1235544024,"ANNE K BOLLMEIER","2010 W HIGHWAY 50","O FALLON","IL",62269,"DENTAL","General Dentist"]
[null,650404100,1235320292,"DENNIS S SIDDIQI","3440 TAMIAMI TRL UNIT 3","PORT CHARLOTTE","FL",33952,"DENTAL","Endodontist"]
[null,311579524,1760602494,"ROBIN C FORD","6890 PERIMETER DR STE A","DUBLIN","OH",43016,"DENTAL","General Dentist"]
[null,832212913,1285286930,"MARK C BEHM","7423 SPRING HILL DR","SPRING HILL","FL",34606,"DENTAL","General Dentist"]
[null,200185918,1780246207,"SARA  RIFAI","27417 US HIGHWAY 27","LEESBURG","FL",34748,"DENTAL","General Dentist"]
[null,271099652,1881664712,"FERAS  AWAD","61 COUNTY RD","MATTAPOISETT","MA","02739","DENTAL","General Dentist"]
[null,812569715,1720570559,"ALEJANDRO  QUESADA GARCIA","870 N US HIGHWAY 27 STE A","LADY LAKE","FL",32159,"DENTAL","General Dentist"]
[null,"043646981",1164575213,"CEDRIC C CHENET","7331 OFFICE PARK PL STE 100","MELBOURNE","FL",32940,"DENTAL","General Dentist"]
[null,810966671,1043995863,"SHANSHAN  SUN","4675 E STATE ROAD 44 STE 104","WILDWOOD","FL",34785,"DENTAL","General Dentist"]
[null,881304555,1265928675,"KAITLYN B RUCKER","1825 GADSDEN STREET","COLUMBIA","SC",29201,"DENTAL","General Dentist"]
[null,430922754,1124275151,"CHRISTOPHER M WOLKEN","8888 LADUE RD STE 200","SAINT LOUIS","MO",63124,"DENTAL","General Dentist"]
[null,621703855,1417063140,"MARTY W LINDAHL","2625 OLD NILES FERRY RD","MARYVILLE","TN",37803,"DENTAL","General Dentist"]
[null,260357554,1932529450,"JASON  SNYDER","37221 MERIDIAN AVE","DADE CITY","FL",33525,"DENTAL","General Dentist"]
[null,208199366,1063628022,"JAMES J MAHOOTI","731 OCEANA BLVD","PACIFICA","CA",94044,"DENTAL","General Dentist"]
[null,650719035,1720607559,"INA  HAN","9109 BAYMEADOWS RD STE 2","JACKSONVILLE","FL",32256,"DENTAL","Endodontist"]
[null,274592809,1811696123,"EPIPHANY  FITZPATRICK","1575 N 52ND ST STE 705","PHILADELPHIA","PA",19131,"DENTAL","General Dentist"]
[null,833313083,1447147814,"NAFIS  HAQUE","1189 E PULASKI HWY","ELKTON","MD",21921,"DENTAL","General Dentist"]
[null,203947113,1336274752,"JAYME D TOMCHIK","4624 PEMBROKE BLVD STE 103","VIRGINIA BEACH","VA",23455,"DENTAL","General Dentist"]
[null,260706839,1316930233,"JENNIFER K WALLACE","40 KEMMERLIN LN","BEAUFORT","SC",29907,"DENTAL","General Dentist"]
[null,921584332,1710275284,"JUAN C CABRERA","3901 MARKET ST STE 1936","PHILADELPHIA","PA",19104,"DENTAL","Periodontist"]
[null,463718652,1821104340,"BACH XUAN NGUYEN","12419 SEAL BEACH BLVD","SEAL BEACH","CA",90740,"DENTAL","General Dentist"]
[null,202077111,1801976113,"DOROTHY E DRAIN","601 LIBERTY PL","SICKLERVILLE","NJ","08081","DENTAL","General Dentist"]
[null,271563493,1659443117,"TIMOTHY P GROSS","15 BOW CIRCLE STE 104","HILTON HEAD","SC",29928,"DENTAL","General Dentist"]
[null,233035093,1396819595,"DAVID P DIGIALLORENZO","184 W MAIN ST","COLLEGEVILLE","PA",19426,"DENTAL","Periodontist"]
[null,932764801,1851487078,"SREE L NADELLA","1010 HIGH HOUSE RD STE 201","CARY","NC",27513,"DENTAL","General Dentist"]
[null,161563700,1851482988,"MARK G CONNERS","3592 MONROE AVE","PITTSFORD","NY",14534,"DENTAL","General Dentist"]
[null,611764181,1750020798,"DANIEL  BLOOM","11015 N SCOTTSDALE RD STE 101","SCOTTSDALE","AZ",85254,"DENTAL","General Dentist"]
[null,331830312,1518190800,"MICHAEL B RILEY","3709 OLD FOREST RD","LYNCHBURG","VA",24501,"DENTAL","General Dentist"]
[null,391391738,1316347131,"LAURA M GOLL","4453 HWY B","LAND O LAKES","WI",54540,"DENTAL","General Dentist"]
[null,541238464,1629054473,"JAMES E VANGILDER","100 PROFESSIONAL PARK DR  #1","BLACKSBURG","VA",24060,"DENTAL","Oral Surgeon"]
[null,844966372,1457646408,"JENNIFER A IBURG","106 DOUGLAS ST","SAINT PAUL","MN",55102,"DENTAL","General Dentist"]
[null,861634780,1710976600,"DENNIS R FEE","1420 LOCUST ST STE 100","PHILADELPHIA","PA",19102,"DENTAL","General Dentist"]
[null,472965093,1457334302,"ERIC JOSEPH GARVER","3420 PLEASANT VALLEY BLVD","ALTOONA","PA",16602,"DENTAL","General Dentist"]
[null,811928313,1548330988,"KARL  KRAUSE","1095 TEXAS PALMYRA HWY STE M","HONESDALE","PA",18431,"DENTAL","Oral Surgeon"]
[null,371735828,1346689155,"ASTRID IOVANNA CORTES","21685 STATE ROAD 7","BOCA RATON","FL",33428,"DENTAL","General Dentist"]
[null,823261469,1114656006,"HARDIKKUMAR  DALSANIA","3230 LAWRENCEVILLE SUWANEE RD STE 300","SUWANEE","GA",30024,"DENTAL","General Dentist"]
[null,205860113,1962924860,"EMILY V DAVIS","49 ROCK SPRINGS RD","CONOWINGO","MD",21918,"DENTAL","General Dentist"]
[null,813348108,1306250626,"JOSE LUIS YABER","7800 S RED ROAD Ste 228","SOUTH MIAMI","FL",33143,"DENTAL","General Dentist"]
[null,851291207,1023431004,"THEODORE G BELL","1375 DELSEA DR","DEPTFORD","NJ","08096","DENTAL","General Dentist"]
[null,650578373,1932292232,"GEORGIA M HERNANDEZ","1680 MICHIGAN AVE STE 1020","MIAMI BEACH","FL",33139,"DENTAL","General Dentist"]
[null,232827259,1700858966,"BRENDA A JENKINS","1447 W MARKET ST","POTTSVILLE","PA",17901,"DENTAL","General Dentist"]
[null,200478116,1447882303,"CHASE W RICHARDS","6755 E SUPERSTITION SPRINGS BLVD STE 102","MESA","AZ",85206,"DENTAL","Periodontist"]
[null,223783144,1104944545,"SANJANA  GULATI","3 KELLY DRIVERS RD","LAUREL SPRINGS","NJ","08021","DENTAL","General Dentist"]
[null,874652270,1831353028,"KATHERINE L DIVELY","1230 E MAIN ST","PALMYRA","PA",17078,"DENTAL","General Dentist"]
[null,262002088,1346687514,"SAMUEL E WOOLWINE","2229 MURRELL RD","LYNCHBURG","VA",24501,"DENTAL","General Dentist"]
[null,871437101,1447740097,"PAULINE  SOU","84 THOMAS JOHNSON CT Ste A","FREDERICK","MD",21702,"DENTAL","General Dentist"]
[null,132420483,1538274964,"DONALD R RUCH","1231 DREXEL AVE","DREXEL HILL","PA",19026,"DENTAL","General Dentist"]
[null,861532070,1780892208,"HOMAYON  BERENJI","600 LOUIS DR STE 105","WARMINSTER","PA",18974,"DENTAL","Endodontist"]
[null,593365515,1003918111,"RAMON  ORTIZ-ROLDAN","2803 JAMES L REDMAN PKWY STE 1","PLANT CITY","FL",33566,"DENTAL","General Dentist"]
[null,475299484,1730589474,"SEAN  SHKOLNIK","1501 CORPORATE DR STE 140","BOYNTON BEACH","FL",33426,"DENTAL","General Dentist"]
[null,931314684,1972504710,"TAMARA K ABBETT","940 ELLENDALE DR","MEDFORD","OR",97504,"DENTAL","General Dentist"]
[null,562269204,1639256480,"PAUL A CRANDALL","19735 KUNKLEMAN DR","CORNELIUS","NC",28031,"DENTAL","General Dentist"]
[null,273472761,1639376288,"MURAD F RASHID","250 N BELCHER RD STE 100","CLEARWATER","FL",33765,"DENTAL","General Dentist"]
[null,592882996,1912030586,"KURT KENTON WEBER","5901 SUN BLVD STE 115","ST PETERSBURG","FL",33715,"DENTAL","General Dentist"]
[null,921207616,1194936054,"JONATHAN A SANDERSON","827 MAGNOLIA BLVD STE 1","MAGNOLIA","TX",77355,"DENTAL","General Dentist"]
[null,841908657,1386216349,"VALERIE L LARGEN","5484 LORKEY LANE STE 101","VIERA","FL",32940,"DENTAL","General Dentist"]
[null,830376449,1972652444,"EDWARD S PARKER","1541 THE GREENS WAY","JACKSONVILLE","FL",32250,"DENTAL","General Dentist"]
[null,223115261,1780107540,"KEVIN T MORRISON","1765 SPRINGDALE RD STE C2","CHERRY HILL","NJ","08003","DENTAL","General Dentist"]
[null,202131814,1366591588,"KIMBERLY A RICE","529 N HEWITT RD","YPSILANTI","MI",48197,"DENTAL","General Dentist"]
[null,453413567,1205157385,"MICHAEL J HALLOCK","7210 VIRGINIA PKWY STE 110","MCKINNEY","TX",75071,"DENTAL","General Dentist"]
[null,113698411,1710075999,"KRISTINA S MARTINEZ","5374 COX SMITH RD STE C","MASON","OH",45040,"DENTAL","General Dentist"]
[null,853443617,1558579433,"SUZANNE M WILBUR","9920 SOUTHSIDE BLVD","JACKSONVILLE","FL",32256,"DENTAL","General Dentist"]
[null,141661393,1386937209,"ROBERT E DORIOT","2 EXECUTIVE PARK DR","ALBANY","NY",12203,"DENTAL","Oral Surgeon"]
[null,454395247,1831535640,"JENNIFER B TIPOGRAPH","3206 TOWER OAKS BLVD STE 350","ROCKVILLE","MD",20852,"DENTAL","General Dentist"]
[null,262231139,1134109069,"WENDELL  HOLDBROOK","499 BECKETT RD STE 101","LOGAN","NJ","08085","DENTAL","Pediatric Dentist"]
[null,881199757,1033733324,"SARAH  AL MOUSSALLY","2140 LAKE EUSTIS DR","TAVARES","FL",32778,"DENTAL","General Dentist"]
[null,934155828,1730666918,"SHAHRAM  BAHRAMI","1101 WOOTTON PARKWAY, SUITE 540","ROCKVILLE","MD",20852,"DENTAL","General Dentist"]
[null,223615476,1801922059,"MICHAEL S HOFFMASTER","202 ROUTE 130 N","CINNAMINSON","NJ","08077","DENTAL","General Dentist"]
[null,810742415,1659692028,"AGNIESZKA E SHANAHAN","239 MAIN ST","SPENCER","MA","01562","DENTAL","General Dentist"]
[null,862253233,1629382981,"KEITH E WOLFENDEN","430 BIMSON AVE","BERTHOUD","CO",80513,"DENTAL","General Dentist"]
[null,521910382,1992399893,"CASEY ALLYN WHITE","1507 RITCHIE HWY STE 201","ARNOLD","MD",21012,"DENTAL","Pediatric Dentist"]
[null,273646423,1215188982,"JEFFERY  SKUPNY","1044 CASTELLO DR STE 110","NAPLES","FL",34103,"DENTAL","General Dentist"]
[null,260220557,1962427567,"TIMOTHY KEITH RIESZ","4153 TAMIAMI TRAIL S UNIT B","VENICE","FL",34293,"DENTAL","General Dentist"]
[null,300020238,1700992740,"YOUNG W KIM","1105 KAIGHNS AVE","CAMDEN","NJ","08103","DENTAL","General Dentist"]
[null,274191418,1881197754,"TANDEEP S MALHOTRA","217 BROADWAY RM 612","NEW YORK","NY",10007,"DENTAL","General Dentist"]
[null,200185918,1669994232,"GEORGE  KHAZOUM","4530 GRAND BLVD","NEW PORT RICHEY","FL",34652,"DENTAL","General Dentist"]
[null,472546684,1982062139,"ABNEY S KILCOLLIN ADAMO","247 HEALTH CENTER DR","UNION","WV",24983,"DENTAL","General Dentist"]
[null,822272495,1740734672,"JOEL  HASBUN","209 WHITE HORSE PIKE","HADDON HEIGHTS","NJ","08035","DENTAL","General Dentist"]
[null,873477504,1265845838,"DALTON C HUNT","3600 HAWORTH DR","RALEIGH","NC",27609,"DENTAL","General Dentist"]
[null,811205650,1811062995,"RAJEEV  GOWDA","16 INDUSTRIAL BLVD, STE 216","PAOLI","PA",19301,"DENTAL","General Dentist"]
[null,593284768,1598868614,"JOHN F CERVENKA","8801 COMMODITY CIRCLE","ORLANDO","FL",32819,"DENTAL","General Dentist"]
[null,471640527,1306270491,"NIMA  REZAIYAN","1111 SPRING ST STE 120","SILVER SPRING","MD",20910,"DENTAL","General Dentist"]
[null,"049680609",1609845288,"ALISON  KLEIN","40 W 86TH ST STE 1C","NEW YORK","NY",10024,"DENTAL","General Dentist"]
[null,934395758,1437574050,"GRIGORIY  GELFAND","3530 FRANCIS LEWIS BLVD STE 203","FLUSHING","NY",11358,"DENTAL","General Dentist"]
[null,832879238,1346566759,"JAMES A PARELLI","102 WAXHAW PROFESSIONAL PARK DR STE G","WAXHAW","NC",28173,"DENTAL","Oral Surgeon"]
[null,823633598,1013355213,"STEPHEN A HASSLER","1003 W BALTIMORE PIKE","MEDIA","PA",19063,"DENTAL","General Dentist"]
[null,"042482501",1477544609,"BART F BLAESER","6 ESSEX CENTER DR 112A","PEABODY","MA","01960","DENTAL","Oral Surgeon"]
[null,272104379,1558406447,"NATHAN E FRENCH","6620 GORDON RD UNIT L","WILMINGTON","NC",28411,"DENTAL","General Dentist"]
[null,562200189,1275190522,"SARAH  COOK","3450 FORESTDALE DR","BURLINGTON","NC",27215,"DENTAL","General Dentist"]
[null,640932949,1093128894,"JAMES P WEBB","15503 OAK LN STE 300B","GULFPORT","MS",39503,"DENTAL","General Dentist"]
[null,472071683,1396367207,"AARON M MIYAMOTO","4211 WAIALAE AVE #500","HONOLULU","HI",96816,"DENTAL","General Dentist"]
[null,823879886,1265726863,"CHRISTOPHER  KERNS","114 S MAIN ST","CYNTHIANA","KY",41031,"DENTAL","General Dentist"]
[null,813398991,1629325675,"JAMES  MARTIN","110 OLD LARAMIE TRL STE 100","LAFAYETTE","CO",80026,"DENTAL","General Dentist"]
[null,833524242,1205040680,"CHARLES C WALKER","4405 JUNCTION PARK DR","WILMINGTON","NC",28412,"DENTAL","General Dentist"]
[null,721535493,1629599840,"JOANNA  MANGAR","1220 W CHESTER PIKE","HAVERTOWN","PA",19083,"DENTAL","Pediatric Dentist"]
[null,274642670,1588867006,"MOHAMMAD A GHANI","555 E CITY AVE Ste 610","BALA CYNWYD","PA",19004,"DENTAL","General Dentist"]
[null,300962053,1750681094,"DONNA  AFSHAR","4530 WISCONSIN AVE NW STE 200","WASHINGTON","DC",20016,"DENTAL","General Dentist"]
[null,474891582,1306159645,"MATTHEW M KIKUCHI","5765 S FORT APACHE RD STE 110","LAS VEGAS","NV",89148,"DENTAL","Oral Surgeon"]
[null,812569715,1548714090,"JERIN  JOSEPH","870 N US HIGHWAY 27 STE A","LADY LAKE","FL",32159,"DENTAL","General Dentist"]
[null,473723220,1205816402,"MARC A BARRETT","710 DENBIGH BLVD BLDG 1 STE C","NEWPORT NEWS","VA",23608,"DENTAL","General Dentist"]
[null,814698226,1851672182,"GRAHAM  MENG","2315 MCDONALD AVE STE 310","MISSOULA","MT",59801,"DENTAL","General Dentist"]
[null,522147398,1801962030,"RICHARD B GARDEN","555 BENFIELD RD","SEVERNA PARK","MD",21146,"DENTAL","Oral Surgeon"]
[null,222735455,1447319371,"CRAIG S DONN","1939 RT 70 E","CHERRY HILL","NJ","08003","DENTAL","General Dentist"]
[null,831211887,1174919047,"ANDREW  SACCO","29 ELM ST","MORRISTOWN","NJ","07960","DENTAL","General Dentist"]
[null,862960552,1215547864,"TAYLOR  TRUNCALI","3671 US HIGHWAY 9W","HIGHLAND","NY",12528,"DENTAL","General Dentist"]
[null,933332494,1003914326,"JASON J ARMSTRONG","7630 W 159TH ST","ORLAND PARK","IL",60462,"DENTAL","General Dentist"]
[null,132799072,1225325830,"ANDREW W BOYD","515 MADISON AVE RM 1616","NEW YORK","NY",10022,"DENTAL","General Dentist"]
[null,462058769,1285895789,"OTTO M CHOI","501 SPRINGFIELD AVE","BERKELEY HEIGHTS","NJ","07922","DENTAL","Pediatric Dentist"]
[null,994990272,1265915508,"ANDREW J BAEK","1321 S ELSEO DR UNIT 270","GREENBRAE","CA",94904,"DENTAL","General Dentist"]
[null,453746624,1457482812,"YEUN-JUNE  PARK","1528 WALNUT ST STE 1201","PHILADELPHIA","PA",19102,"DENTAL","Prosthodontist"]
[null,930954252,1336496264,"KELLY J RILEY","7725 NE HIGHWAY 99 STE A","VANCOUVER","WA",98665,"DENTAL","General Dentist"]
[null,451266532,1821208448,"SCOTT R CAYOUETTE","1040 SAVANNAH HWY","CHARLESTON","SC",29407,"DENTAL","General Dentist"]
[null,881224580,1912047739,"THOMAS J FRANCHETTI","145 BRINTON LAKE RD STE 300","GLEN MILLS","PA",19342,"DENTAL","Orthodontist"]
[null,813855907,1346835196,"JULIANNA L KO","20785 PROFESSIONAL PARK BLVD","GEORGETOWN","DE",19947,"DENTAL","Periodontist"]
[null,813855907,1346835196,"JULIANNA L KO","20785 PROFESSIONAL PARK BLVD","GEORGETOWN","DE",19947,"DENTAL","Periodontist"]
[null,"043330114",1497182091,"MARIANA  HAUGHEY","269 LOCUST ST","FLORENCE","MA","01062","DENTAL","Orthodontist"]
[null,"061829793",1235122490,"IOSIF I UVAYDOV","2101 KINGS HWY","BROOKLYN","NY",11229,"DENTAL","General Dentist"]
[null,201932296,1730896101,"FARAZ  SHAMSI","11855 HOLLY LN STE 103","WALDORF","MD",20601,"DENTAL","General Dentist"]
[null,231935566,1487190096,"ALLEN P SHAPIRO","9501 ROOSEVELT BLVD STE 207","PHILADELPHIA","PA",19114,"DENTAL","General Dentist"]
[null,812984508,1689969016,"BOBBY L COCKERHAM","6743 FAIRVIEW RD","CHARLOTTE","NC",28210,"DENTAL","Periodontist"]
[null,263976500,1881805489,"GARY L WRIGHT","8 MARTICVILLE RD","LANCASTER","PA",17603,"DENTAL","General Dentist"]
[null,"050576955",1972512713,"MATTHEW T ANKRUM","3708 S MAIN ST #H","BLACKSBURG","VA",24060,"DENTAL","Endodontist"]
[null,541519724,1609516673,"CHARLETON  GOODMAN","727 25TH ST","NEWPORT NEWS","VA",23607,"DENTAL","General Dentist"]
[null,273575441,1609496371,"GAGE  EBERLY","6800 W CENTRAL AVE STE A1","TOLEDO","OH",43617,"DENTAL","General Dentist"]
[null,"020636237",1013007111,"MICHELE  TURNER-WOOD","500 MULLICA HILL RD","GLASSBORO","NJ","08028","DENTAL","General Dentist"]
[null,141885390,1255461406,"BIJU  CYRIAC","36 LEADERS HEIGHTS RD","YORK","PA",17403,"DENTAL","General Dentist"]
[null,233030556,1912522327,"DHARA  PATEL","501 PLEASANT VIEW RD","LEWISBERRY","PA",17339,"DENTAL","General Dentist"]
[null,820773966,1538218938,"JAY W HUSTEAD","1739 B MAYBANK HWY","CHARLESTON","SC",29412,"DENTAL","General Dentist"]
[null,264712594,1821279852,"ABIGAIL T TUBIO","942 SAXON BLVD","ORANGE CITY","FL",32763,"DENTAL","General Dentist"]
[null,650597030,1114900198,"IRIS M CRUZ DALECCIO","8500 SW 92ND ST STE 104","MIAMI","FL",33156,"DENTAL","General Dentist"]
[null,461869750,1588178263,"ALICE G LIU","107 YALE ST STE 300","HOUSTON","TX",77007,"DENTAL","General Dentist"]
[null,274392978,1760611545,"ANDREW B CHRISTENSEN","1350 N 7TH ST","LAKE CITY","MN",55041,"DENTAL","General Dentist"]
[null,473718544,1518042043,"ALEXANDER  LOBAINA","5756 S STAPLES ST STE I","CORPUS CHRISTI","TX",78413,"DENTAL","General Dentist"]
[null,863266258,1578944807,"ELIZABETH L TODD","2300 21ST AVE S STE 104","NASHVILLE","TN",37212,"DENTAL","General Dentist"]
[null,351928753,1902359441,"ZACKERY D HELSLEY","2810 S WALNUT STREET PIKE","BLOOMINGTON","IN",47401,"DENTAL","General Dentist"]
[null,810532338,1255496717,"BRANDON  WRIGHT","108 TYLER WAY","LOLO","MT",59847,"DENTAL","General Dentist"]
[null,742802915,1669514212,"ROBERT A KIRK","105 WILDWOOD DR STE 216","GEORGETOWN","TX",78633,"DENTAL","General Dentist"]
[null,831075351,1922521822,"ALYSSA LYNN BENITEZ","654 W INDIANTOWN RD STE 102","JUPITER","FL",33458,"DENTAL","Pediatric Dentist"]
[null,821335793,1871652750,"GREGORY L BIRCH","1111 COLUMBIA ST","PORT ANGELES","WA",98362,"DENTAL","General Dentist"]
[null,571122172,1447900261,"DARCY  NIRENSTEIN","1211 44TH AVE N STE 100","MYRTLE BEACH","SC",29577,"DENTAL","General Dentist"]
[null,931400178,1003335506,"TREVOR F MAPLES","2100 OLD FARM DR STE 1F Ste 1F","FREDERICK","MD",21702,"DENTAL","General Dentist"]
[null,475184873,1386144764,"MEHVEEN R QURESHI","31 OLEANDER DR","CLAYTON","NC",27527,"DENTAL","Pediatric Dentist"]
[null,200185918,1942594627,"KATARZYNA J PLOWER","2275 20TH ST","VERO BEACH","FL",32960,"DENTAL","General Dentist"]
[null,204331128,1336157098,"NICK S MORROW","216 FOUNTAIN CT STE 110","LEXINGTON","KY",40509,"DENTAL","Oral Surgeon"]
[null,843336045,1295393437,"SHERRY  SHARMA","8101 SOUTHSIDE BLVD STE 8","JACKSONVILLE","FL",32256,"DENTAL","General Dentist"]
[null,271559296,1609510296,"BRITTNEY C GANT","7351 ASSATEAGUE DR STE 480","JESSUP","MD",20794,"DENTAL","General Dentist"]
[null,873818765,1194176263,"BRADLEY WILLIAM COX","2135 NOLL DR STE B","LANCASTER","PA",17603,"DENTAL","General Dentist"]
[null,471302605,1982918652,"KRISTA T MCDANIEL","913 E BROAD ST","FUQUAY VARINA","NC",27526,"DENTAL","General Dentist"]
[null,260296842,1689889586,"JOHN M SCHMIDT","1755 OREGON PIKE STE 102","LANCASTER","PA",17601,"DENTAL","General Dentist"]
[null,113348275,1861518755,"THOMAS P BEAGUE","476 ELMONT RD","ELMONT","NY",11003,"DENTAL","General Dentist"]
[null,472532794,1558930222,"MELORIN  BURSTEIN","3486C EMMORTON RD","ABINGDON","MD",21009,"DENTAL","General Dentist"]
[null,201756342,1790123941,"YUVIKA  CHOUDHARY","2985 NAVAJO ST","YORKTOWN HEIGHTS","NY",10598,"DENTAL","General Dentist"]
[null,541867141,1629119078,"BRENT  DRYDEN","2166 MAGNOLIA AVE","BUENA VISTA","VA",24416,"DENTAL","General Dentist"]
[null,"030367541",1275544140,"NATHAN  MAKAY","11 MARKET PL","ESSEX JCT","VT","05452","DENTAL","General Dentist"]
[null,231986486,1033149893,"MARK G NICHOLS","222 N DECATUR ST","STRASBURG","PA",17579,"DENTAL","General Dentist"]
[null,651090929,1639402753,"JAVIER  MENDEZ","9132 STRADA PL STE 11101","NAPLES","FL",34108,"DENTAL","General Dentist"]
[null,371834882,1871149120,"DAMIEN P BLANCO","329 CYPRESS GARDENS BLVD","WINTER HAVEN","FL",33880,"DENTAL","General Dentist"]
[null,920567840,1437630068,"SOPHIE R DIEPENHEIM","61583 SE 27TH ST STE 170","BEND","OR",97702,"DENTAL","General Dentist"]
[null,874236234,1740205434,"JANICE  BELL","23 BRANFORD PL","NEWARK","NJ","07102","DENTAL","General Dentist"]
[null,202962204,1346463148,"MICHAEL K WONG","651 RT 73 N STE 305","MARLTON","NJ","08053","DENTAL","General Dentist"]
[null,462978356,1023370087,"RAHA  MOZAFFARI","244 E GIRARD AVE","PHILADELPHIA","PA",19125,"DENTAL","General Dentist"]
[null,262207907,1679694855,"CHRIS J GIULIANI","4 W PARK AVE","WESTOVER","WV",26501,"DENTAL","General Dentist"]
[null,591389858,1386812667,"JERRY W KRAPE","700 N FEDERAL HWY","LAKE PARK","FL",33403,"DENTAL","General Dentist"]
[null,411854946,1407948060,"KRISTY L PETERSEN","10150 CITY WALK DR APT C","WOODBURY","MN",55129,"DENTAL","General Dentist"]
[null,264544970,1295055127,"CAROL A IGLESIA","2613 GREEN LEVEL WEST RD","CARY","NC",27519,"DENTAL","General Dentist"]
[null,474972764,1619141579,"JONI A MACNEILL","1575 ONTARIO ST","SANDPOINT","ID",83864,"DENTAL","General Dentist"]
[null,260483549,1720148786,"ROBERT J BANKS","12925 BOOKER T WASHINGTON HWY STE 202","HARDY","VA",24101,"DENTAL","General Dentist"]
[null,741699140,1144841347,"JASSEL  FERNANDEZ RUIZ","235 HILLIARD RD","TEMPLE","TX",76502,"DENTAL","Oral Surgeon"]
[null,371834882,1942537311,"ANA V AVILES","329 CYPRESS GARDENS BLVD","WINTER HAVEN","FL",33880,"DENTAL","General Dentist"]
[null,522247632,1104848209,"LUCINDA S KELLER","1430 SOLOMONS ISLAND RD","HUNTINGTOWN","MD",20639,"DENTAL","General Dentist"]
[null,860654841,1174598916,"PAUL  KOGAN","8436 E SHEA BLVD STE 101","SCOTTSDALE","AZ",85260,"DENTAL","Endodontist"]
[null,474512109,1689763245,"RICHARD G GROSS","601 GORDON DR","EXTON","PA",19341,"DENTAL","General Dentist"]
[null,463354890,1720632946,"ELIZABETH B MCMICHAEL","4013 VILLAGE PARK DR","KNIGHTDALE","NC",27545,"DENTAL","Oral Medicine"]
[null,900735717,1295935138,"THUY T NGUYEN","625 MEDICAL CARE DR","BRANDON","FL",33511,"DENTAL","General Dentist"]
[null,450477605,1497815070,"KEITH A KYE","8936 N POINTE EXECUTIVE PARK DR STE 120","HUNTERSVILLE","NC",28078,"DENTAL","General Dentist"]
[null,261082438,1407889306,"SHANE R COSTA","10135 COLVIN RUN RD STE 101","GREAT FALLS","VA",22066,"DENTAL","General Dentist"]
[null,205923618,1619943099,"ALICE M CHARLAND-BASSFORD","10301 GEORGIA AVE STE 207","SILVER SPRING","MD",20902,"DENTAL","General Dentist"]
[null,462097739,1821135260,"JONATHAN L MCCARTNEY","2569 N TOLEDO BLADE BLVD","NORTH PORT","FL",34289,"DENTAL","General Dentist"]
[null,273026583,1306074976,"LOUIS C BERGER","2404 VIRGINIA BEACH BLVD STE 106","VIRGINIA BEACH","VA",23454,"DENTAL","General Dentist"]
[null,223083754,1174620991,"SCOTT K LOZIER","6 VILLAGE DR","CAPE MAY C H","NJ","08210","DENTAL","General Dentist"]
[null,861220923,1962788091,"ISABEL  BASTOS","879 BROADWAY","WEST LONG BRANCH","NJ","07764","DENTAL","General Dentist"]
[null,831053763,1174692479,"MARCIA L LEWIS","505 N MAIN ST","CREEDMOOR","NC",27522,"DENTAL","General Dentist"]
[null,222239859,1376115907,"THIN S KHINE","1301 ROUTE 72 W STE 230","MANAHAWKIN","NJ","08050","DENTAL","General Dentist"]
[null,461542387,1366569907,"MICHELLE  SCHWARTZ","326 W ILLINOIS ST","CHICAGO","IL",60654,"DENTAL","General Dentist"]
[null,843842730,1609165521,"SETH  MATTON","314 FLANDERS RD STE 1B","EAST LYME","CT","06333","DENTAL","Oral Surgeon"]
[null,"043660274",1255340303,"SHELLY E MONTES","520 PIRKLE FERRY RD STE B","CUMMING","GA",30040,"DENTAL","Periodontist"]
[null,901119494,1154559268,"TREVOR D HARTWELL","64-5191 KINOHOU ST, SUITE C","KAMUELA","HI",96743,"DENTAL","General Dentist"]
[null,251381800,1629811815,"BAN  AL QAZZAZ","30 PINNACLE DR","CLARION","PA",16214,"DENTAL","General Dentist"]
[null,364844916,1881842615,"CHELSEA BERGERON FENTON","4040 UPPER CREEK DR STE 101","SUN CITY CENTER","FL",33573,"DENTAL","General Dentist"]
[null,831670256,1811523129,"MIGUEL A ROQUE MARTINEZ","1765 DUNLAWTON AVE STE 103","PORT ORANGE","FL",32127,"DENTAL","General Dentist"]
[null,148784182,1316106040,"ANDREW M HOFFMAN","608 GORDON DR","EXTON","PA",19341,"DENTAL","General Dentist"]
[null,464593914,1770155574,"CHRISTINA  KLUG","9975 POPLAR TENT RD STE 100","CONCORD","NC",28027,"DENTAL","General Dentist"]
[null,833095905,1063606903,"MICHELLE  BERNREUTHER","600 E MARSHALL ST STE 204","WEST CHESTER","PA",19380,"DENTAL","General Dentist"]
[null,831218525,1316468325,"KARANDEEP SINGH BRAR","7330 FRANKFORD AVE","PHILADELPHIA","PA",19136,"DENTAL","General Dentist"]
[null,232830040,1932326428,"ALAN M ATLAS","1420 LOCUST ST STE 120","PHILADELPHIA","PA",19102,"DENTAL","General Dentist"]
[null,834711039,1306473459,"RUCHI  TRAMBADIA","344 COMMONS DR","PARKESBURG","PA",19365,"DENTAL","General Dentist"]
[null,872243222,1831347665,"NICHOLAS JOSEPH KIRKPATRICK","8701 KNOX BRIDGE HWY","CANTON","GA",30114,"DENTAL","General Dentist"]
[null,205406103,1235104688,"BRUCE S ABE","501 WASHINGTON ST STE 740 Ste","SAN DIEGO","CA",92103,"DENTAL","General Dentist"]
[null,462672877,1306094644,"ELSIE V JOEL-MORSE","10840 LITTLE PATUXENT PKWY STE 401","COLUMBIA","MD",21044,"DENTAL","General Dentist"]
[null,611764181,1043646698,"ROZBEH  HOSSIENI","11015 N SCOTTSDALE RD STE 101","SCOTTSDALE","AZ",85254,"DENTAL","Oral Surgeon"]
[null,452972575,1457672602,"KYLE A SMITS","5647 CALIFORNIA AVE SW","SEATTLE","WA",98136,"DENTAL","General Dentist"]
[null,874533714,1376708255,"ALEJANDRO R MONTALVO","845 KEDRON AVE","MORTON","PA",19070,"DENTAL","General Dentist"]
[null,200623055,1225486814,"EMAN  CARREON","61 ROUTE 27 PO BOX 958","RAYMOND","NH","03077","DENTAL","General Dentist"]
[null,813795466,1124360961,"KAZUKO  NISHISAKI","106 N ESSEX AVE Suite C","NARBERTH","PA",19072,"DENTAL","General Dentist"]
[null,271623920,1891147914,"DILLON ALEXANDER DAVIS","13107 ATLANTIC BLVD STE 101","JACKSONVILLE","FL",32225,"DENTAL","General Dentist"]
[null,881768383,1720484165,"JACQUELINE M SZCZUPAKOWSKI","59 ELIZABETH DR","LOCKPORT","NY",14094,"DENTAL","General Dentist"]
[null,273900278,1871705616,"MONIRA MOMTAJ UDDIN","635 DACULA RD STE 105","DACULA","GA",30019,"DENTAL","General Dentist"]
[null,261150518,1528072022,"DAVID  BROWN","7 DAVIS AVE","BROOMALL","PA",19008,"DENTAL","General Dentist"]
[null,201753878,1881773257,"DANIEL J HOCH","2021A EMMORTON RD STE 222","BEL AIR","MD",21015,"DENTAL","General Dentist"]
[null,233101899,1932353422,"ERIC  SCHLESINGER","860 FIRST AVE SUITE 3","KING OF PRUSSIA","PA",19406,"DENTAL","Oral Surgeon"]
[null,463105032,1154323202,"STEPHEN P PORTER","9522 OAK BAY RD STE 400","PORT LUDLOW","WA",98365,"DENTAL","General Dentist"]
[null,912189932,1831209899,"AMY  SMITH","403 E 11TH SREET","PANAMA CITY","FL",32401,"DENTAL","General Dentist"]
[null,814530661,1720460165,"RICHARD  MCCOY","325 MCLAWS CIR STE 1","WILLIAMSBURG","VA",23185,"DENTAL","General Dentist"]
[null,861243088,1205383924,"PATRICK  SHOCK","920 GERMANTOWN PIKE STE 104","PLYMOUTH MEETING","PA",19462,"DENTAL","General Dentist"]
[null,521836287,1568816510,"LANI  YAP-ENCOMIENDA","2500 WALLINGTON WAY","MARRIOTTSVILLE","MD",21104,"DENTAL","General Dentist"]
[null,232314043,1417042417,"ALBERT A HAZZOURI","600 LACKAWANNA AVE","SCRANTON","PA",18503,"DENTAL","General Dentist"]
[null,541393769,1710328273,"SEYED M TOFIGHBAKHSH","11107 SUNSET HILLS RD STE 111","RESTON","VA",20190,"DENTAL","Prosthodontist"]
[null,223655547,1891719779,"KENNETH P PRESS","95 MADISON AVE STE 108","MORRISTOWN","NJ","07960","DENTAL","Oral Surgeon"]
[null,831182701,1447737614,"JOSEPH  FANELLI","435 PINE ST","ROCHESTER","MI",48307,"DENTAL","General Dentist"]
[null,834433620,1558498493,"MICHAEL A BONOMO","127 S 5TH ST STE 310","QUAKERTOWN","PA",18951,"DENTAL","General Dentist"]
[null,460652194,1508091398,"BRIAN E MCMANUS","8301 BRIER CREEK PKWY STE 103","RALEIGH","NC",27617,"DENTAL","General Dentist"]
[null,570977847,1215067707,"PATRICIA L WARNER","167 D BLUFFTON RD","BLUFFTON","SC",29910,"DENTAL","General Dentist"]
[null,561313401,1609070002,"ROBERT T ARMSTRONG","501 PENNY LN","MOREHEAD CITY","NC",28557,"DENTAL","Oral Surgeon"]
[null,815286342,1467708313,"SAMIRA M DAVIS","523 KIRKLAND WAY","KIRKLAND","WA",98033,"DENTAL","General Dentist"]
[null,863119749,1336332493,"DIANE GAFFNEY DEACON","1550 MATTHEW DR","FORT MYERS","FL",33907,"DENTAL","General Dentist"]
[null,263665946,1669867230,"SCOTT K KOO","15234 WASHINGTON ST","HAYMARKET","VA",20169,"DENTAL","General Dentist"]
[null,882521540,1790749323,"LOREN K MASUOKA","1131 PROFESSIONAL DR","WILLIAMSBURG","VA",23185,"DENTAL","General Dentist"]
[null,571035807,1780898353,"JOHN M CORELLA","100 HARTH PL","SUMMERVILLE","SC",29485,"DENTAL","General Dentist"]
[null,812095388,1598748568,"SANDY E HARMON","3007 GARRETT RD 3009","DREXEL HILL","PA",19026,"DENTAL","General Dentist"]
[null,522031865,1982817748,"ORAANN  REINHEIMER","101 SAINT CLAIRE PL","STEVENSVILLE","MD",21666,"DENTAL","Orthodontist"]
[null,824989342,1679735740,"STORM B BRIGGS","3401 W FLETCHER AVE STE A","TAMPA","FL",33618,"DENTAL","General Dentist"]
[null,854240514,1437686565,"RONAK SHRIKANT PARIKH","28868 STATE ROAD 54","WESLEY CHAPEL","FL",33543,"DENTAL","General Dentist"]
[null,200436087,1689719841,"FORREST L ARNOULD","7311 S LEWIS AVE","TULSA","OK",74136,"DENTAL","General Dentist"]
[null,651314186,1376678581,"WILLIAM P GROHOL","999 W CHESTER PIKE STE 104","WEST CHESTER","PA",19382,"DENTAL","General Dentist"]
[null,592931812,1285018465,"GUNESHI  DE MEL","7555 SW HIGHWAY 200 STE A","OCALA","FL",34476,"DENTAL","General Dentist"]
[null,621720264,1356754402,"LAURA P GART","670 LYNNWOOD DR","ATHENS","TN",37303,"DENTAL","Oral Surgeon"]
[null,"061414699",1841449196,"LINDA J ROBSON","64 WASHINGTON ST","MYSTIC","CT","06355","DENTAL","General Dentist"]
[null,833389349,1831581412,"MITCHELL  ZIENTZ","136 E 57TH ST STE 1604","NEW YORK","NY",10022,"DENTAL","General Dentist"]
[null,541210721,1720271026,"SUMIT  SHARMA","1890 PRESTON WHITE DR STE 200","RESTON","VA",20191,"DENTAL","General Dentist"]
[null,862565288,1245756675,"ADETUNJI  SIJUWADE","1316 F ST NW","WASHINGTON","DC",20004,"DENTAL","General Dentist"]
[null,710917042,1811059520,"CURTIS CHARLTON WILLIAMS","2496 JETT FERRY RD STE 100","ATLANTA","GA",30338,"DENTAL","General Dentist"]
[null,852354648,1871028035,"KRUPA  PATEL","1165 MANTUA PIKE","WEST DEPTFORD","NJ","08051","DENTAL","General Dentist"]
[null,510398102,1760043079,"RODION  KRYZHANOVSKIY","5301 LIMESTONE RD STE 212","WILMINGTON","DE",19808,"DENTAL","General Dentist"]
[null,452480350,1306076617,"DAWN M KELLY","277 WHITE HORSE PIKE STE 104","ATCO","NJ","08004","DENTAL","General Dentist"]
[null,510398102,1205914652,"BRUCE G FAY","5301 LIMESTONE RD STE 212","WILMINGTON","DE",19808,"DENTAL","General Dentist"]
[null,341911980,1558553842,"SABRINA E MICKEL","24100 CHAGRIN BLVD STE 170","BEACHWOOD","OH",44122,"DENTAL","General Dentist"]
[null,204428962,1164041935,"PAIGE  BACKENSTOSE","56 LUCAS AVE","KINGSTON","NY",12401,"DENTAL","General Dentist"]
[null,473310725,1295995314,"RAYMOND O LEE","1515 IRVING ST","SAN FRANCISCO","CA",94122,"DENTAL","General Dentist"]
[null,843935336,1659111789,"JUSTIN T ARCHER","210 LORETTO DR","WYTHEVILLE","VA",24382,"DENTAL","General Dentist"]
[null,463778054,1144060492,"HORYEONG  LEE","7320 FOREST OAKS BLVD","SPRING HILL","FL",34606,"DENTAL","General Dentist"]
[null,863736314,1205277191,"EDMOND J ALLISON","3001 DEL PRADO BLVD S","CAPE CORAL","FL",33904,"DENTAL","General Dentist"]
[null,460964437,1699811901,"KARL O PILGRIM","3611 BRANCH AVE STE 301","TEMPLE HILLS","MD",20748,"DENTAL","General Dentist"]
[null,222004723,1548375280,"STEVEN J GARIN","475 OLD MARLTON PIKE W","MARLTON","NJ","08053","DENTAL","Oral Surgeon"]
[null,260357554,1912698010,"RAMON  ERBELLA OCANA","18000 TOLEDO BLADE BLVD","PORT CHARLOTTE","FL",33948,"DENTAL","General Dentist"]
[null,333623685,1154816338,"RYAN  WALTERS","850 NORMAN DR","LEBANON","PA",17042,"DENTAL","General Dentist"]
[null,452808061,1427264746,"JOHN  HABIB","169 PARK AVE","YONKERS","NY",10703,"DENTAL","General Dentist"]
[null,814822592,1700630035,"MOHYUN  PARK","1135 HIGHWAY 85 N STE A","FAYETTEVILLE","GA",30214,"DENTAL","General Dentist"]
[null,900935286,1295704625,"TODD W CAHOON","115 COMMONS WAY STE 101","KALISPELL","MT",59901,"DENTAL","General Dentist"]
[null,232542264,1457490823,"DAVID D SNYDER","4525 SPRING HILL DR","SCHNECKSVILLE","PA",18078,"DENTAL","General Dentist"]
[null,203042732,1144341488,"NANETTE L MICK","3924 SYLVAN LAKES BLVD","SYLVANIA","OH",43560,"DENTAL","General Dentist"]
[null,200185918,1366878696,"MINE  TURHAN","5853 DEREK AVE","SARASOTA","FL",34238,"DENTAL","General Dentist"]
[null,233024574,1629168026,"MING LUNG  YANG","135 S BRYN MAWR AVE STE 340","BRYN MAWR","PA",19010,"DENTAL","Endodontist"]
[null,300769028,1447471727,"CLIFFORD W GROSS","699 DOLORO DR","MORRISVILLE","PA",19067,"DENTAL","General Dentist"]
[null,262843884,1942407812,"CLAY H KIM","406 N FRUITLAND BLVD","SALISBURY","MD",21801,"DENTAL","Oral Surgeon"]
[null,232635775,1508085192,"DAVID W HARSHAW","780 W LANCASTER AVE","BRYN MAWR","PA",19010,"DENTAL","Pediatric Dentist"]
[null,851397345,1518457969,"EKATERINA  BAGAEVA","530 BERLIN CROSS KEYS RD","SICKLERVILLE","NJ","08081","DENTAL","General Dentist"]
[null,463011514,1710060322,"DAVID M CLARK","5205 COURTHOUSE RD STE 201","SPOTSYLVANIA","VA",22551,"DENTAL","General Dentist"]
[null,814773343,1588009427,"KOUROSH  KARIMI-ARDEKANI","2440 M ST NW STE 709","WASHINGTON","DC",20037,"DENTAL","General Dentist"]
[null,994600527,1023156635,"JOSEPH M SERRA","700 RUTLEDGE AVE","CHARLESTON","SC",29403,"DENTAL","General Dentist"]
[null,273900278,1902255136,"ANDREW TYLER CUPP","340 EISENHOWER DR STE 400","SAVANNAH","GA",31406,"DENTAL","General Dentist"]
[null,743074742,1902993827,"JERRY W BAUTSCH","2815 W LAKE HOUSTON PKWY STE 107","KINGWOOD","TX",77339,"DENTAL","General Dentist"]
[null,200185918,1720508393,"AHMED  JAWAD","7344 GALL BLVD","ZEPHYRHILLS","FL",33541,"DENTAL","General Dentist"]
[null,834101831,1871977686,"AMRITA  SINGH","180 PARK ST","N READING","MA","01864","DENTAL","General Dentist"]
[null,233040949,1699828806,"JAY J LIU","1601 WALNUT ST STE 822","PHILADELPHIA","PA",19102,"DENTAL","General Dentist"]
[null,823991290,1275272528,"SUCHETA  BANSAL","8919 RIDGE AVE STE 9","PHILADELPHIA","PA",19128,"DENTAL","General Dentist"]
[null,450713714,1689735987,"SWETA  GUNNELL","1024 HWY A1A #108","SATELLITE BEACH","FL",32937,"DENTAL","General Dentist"]
[null,474606929,1245547603,"DEREK J CONOVER","1601 WALNUT ST STE 1101","PHILADELPHIA","PA",19102,"DENTAL","General Dentist"]
[null,743045434,1790990281,"ANTHONY J CALANDRA","100 HERITAGE VALLEY DR SUITE #3","SEWELL","NJ","08080","DENTAL","General Dentist"]
[null,262589590,1679644009,"THOMAS M ZACCARIA","67 DOWLIN FORGE RD STE C","EXTON","PA",19341,"DENTAL","General Dentist"]
[null,271863150,1952586471,"RICHARD WILLIAM WILCOX","5306 CORTEZ RD W STE 1","BRADENTON","FL",34210,"DENTAL","General Dentist"]
[null,922751867,1386104792,"DANIEL S HALEY","5 CHENELL DR","CONCORD","NH","03301","DENTAL","General Dentist"]
[null,851273150,1801309968,"LLOYD A AKPUAKA","3715 EASTERN AVE","BALTIMORE","MD",21224,"DENTAL","General Dentist"]
[null,820593947,1962633214,"SUVIDHA  SACHDEVA","365 MARKET PL STE 100","ROSWELL","GA",30075,"DENTAL","General Dentist"]
[null,812579801,1730443946,"ASHISH  PATEL","2087 CRUSE RD NW, SUITE A","LAWRENCEVILLE","GA",30044,"DENTAL","General Dentist"]
[null,510321801,1487008397,"HABIB T ASMARO","2001 CONCORD PIKE STE 200","WILMINGTON","DE",19803,"DENTAL","Oral Surgeon"]
[null,371431846,1477613818,"EDWARD B DELGADO","8230 LEESBURG PIKE STE 720","VIENNA","VA",22182,"DENTAL","Oral Surgeon"]
[null,820548650,1629110150,"ALAN C EBERHARDT","739 MILFORD RD","EAST STROUDSBURG","PA",18301,"DENTAL","General Dentist"]
[null,261843741,1558578773,"ANDREW W BURNS","1 W AGATE AVE","GRANBY","CO",80446,"DENTAL","General Dentist"]
[null,521395875,1013083252,"GARLAND K DAVIS","8730 CHERRY LN STE 6","LAUREL","MD",20707,"DENTAL","General Dentist"]
[null,510321801,1548527104,"FADI N KOSA","4133 OGLETOWN STANTON RD","NEWARK","DE",19713,"DENTAL","Oral Surgeon"]
[null,844295736,1235797143,"GALIA LEILANI RAMIREZ","310 E HIGHLAND DR","LAKELAND","FL",33813,"DENTAL","General Dentist"]
[null,814129731,1932461621,"TIMOTHY P PEREZ","1609 PLEASURE HOUSE RD","VIRGINIA BEACH","VA",23455,"DENTAL","General Dentist"]
[null,453458048,1700778735,"SARA ELIZABETH MOORE","26540 ACE AVE #G-105","LEESBURG","FL",34748,"DENTAL","General Dentist"]
[null,133957165,1518225614,"LEORA  WALTER","30 CENTRAL PARK S RM 11C","NEW YORK","NY",10019,"DENTAL","General Dentist"]
[null,521105347,1285914028,"MICHAEL J RIBERA","1899 L ST NW STE 300","WASHINGTON","DC",20036,"DENTAL","Endodontist"]
[null,475075728,1386003523,"DEBRA A COHEN","301 RIVERFRONT BLVD STE 2","ELMWOOD PARK","NJ","07407","DENTAL","Pediatric Dentist"]
[null,474928991,1487916557,"NATHEN  ELLIS","7206 AUSTIN SMILES CT STE 103","DENVER","NC",28037,"DENTAL","General Dentist"]
[null,223595588,1942472477,"PATRICIA  SWAINTEK-LAMB","10 ANDERSON HILL RD","BERNARDSVILLE","NJ","07924","DENTAL","General Dentist"]
[null,521116591,1972126761,"YENISEY  VALDES TORRES","933 S TALBOT ST STE 4","SAINT MICHAELS","MD",21663,"DENTAL","General Dentist"]
[null,872287291,1851909956,"BENJAMIN  ROWLAND","40 JOSHUA LN","PALMYRA","VA",22963,"DENTAL","General Dentist"]
[null,232628134,1003592668,"MADELINE  KEPNER","1150 VALLEY FORGE RD STE 101","PHOENIXVILLE","PA",19460,"DENTAL","General Dentist"]
[null,562037094,1619180924,"TODD G GLAZENER","3465 POLO RD","WINSTON SALEM","NC",27106,"DENTAL","General Dentist"]
[null,203966011,1184638157,"GEORGE  MANTIKAS","142 E HIGH ST","EAST HAMPTON","CT","06424","DENTAL","General Dentist"]
[null,260431627,1215494430,"LAUREN MEEHAE CHOI","43 WARREN ST FL 1","NEW YORK","NY",10007,"DENTAL","General Dentist"]
[null,541471634,1235350885,"ROY L SAUNDERS","3200 WATERLICK ROAD","LYNCHBURG","VA",24502,"DENTAL","General Dentist"]
[null,203929658,1629232947,"BRADLEY A DORSCH","1055 NIMITZVIEW DR","CINCINNATI","OH",45230,"DENTAL","General Dentist"]
[null,611772086,1679337588,"DAVE  ANCION","1234 S HOVER ST STE 100","LONGMONT","CO",80501,"DENTAL","General Dentist"]
[null,994737890,1265140024,"PRIYAM  KUMAR","2075 L ST NW","WASHINGTON","DC",20036,"DENTAL","General Dentist"]
[null,831266756,1417525163,"LAUREN P CUCULINO","4245 N COURTENAY PKWY","MERRITT ISLAND","FL",32953,"DENTAL","General Dentist"]
[null,920872729,1639579626,"KELLY  GUTHRIE","510 ENGLE DR SE","RUSSELLVILLE","AL",35653,"DENTAL","General Dentist"]
[null,823231156,1700023082,"SARU  SAINI","4373 JIMMY LEE SMITH PKWY STE 105","HIRAM","GA",30141,"DENTAL","General Dentist"]
[null,541146055,1336386325,"FREDERICK  LIU","6211 CENTREVILLE RD STE 800","CENTREVILLE","VA",20121,"DENTAL","Oral Surgeon"]
[null,320582571,1891225983,"JUSTIN S MITCHELL","26908 FOGGY CREEK RD STE 101","WESLEY CHAPEL","FL",33544,"DENTAL","General Dentist"]
[null,541210721,1245423516,"LUIS J MARTINEZ","1890 PRESTON WHITE DR STE 200","RESTON","VA",20191,"DENTAL","Prosthodontist"]
[null,134229206,1740805258,"FARANAK  HAMEDOONI","616 FREDERICK RD","CATONSVILLE","MD",21228,"DENTAL","General Dentist"]
[null,273706455,1881709236,"TYSON W ANDERSON","13531 WATERFORD PL STE A","MIDLOTHIAN","VA",23112,"DENTAL","General Dentist"]
[null,990287263,1821575937,"TOMMY E BAE","92-605 MAKAKILO DR","KAPOLEI","HI",96707,"DENTAL","General Dentist"]
[null,510321801,1972948198,"MICHAEL D D'AMICO","4133 OGLETOWN STANTON RD","NEWARK","DE",19713,"DENTAL","Oral Surgeon"]
[null,363921299,1073683561,"ESTES H BOSHES","3200 GRANT ST","EVANSTON","IL",60201,"DENTAL","General Dentist"]
[null,453698739,1831736883,"MEREDITH W COX","1663 GLENNS BAY RD","SURFSIDE BEACH","SC",29575,"DENTAL","General Dentist"]
[null,800188961,1427216530,"MARCI S GUTHRIE","2805 MCRAE RD","NORTH CHESTERFIELD","VA",23235,"DENTAL","General Dentist"]
[null,270500276,1811238447,"KIMANI A BETHEA","10451 MILL RUN CIR STE 310","OWINGS MILLS","MD",21117,"DENTAL","General Dentist"]
[null,200185918,1215589247,"KENDA  ALBAREE","4289 S HIGHWAY 27","CLERMONT","FL",34711,"DENTAL","General Dentist"]
[null,811205650,1811062995,"RAJEEV  GOWDA","16 INDUSTRIAL BLVD, STE 216","PAOLI","PA",19301,"DENTAL","General Dentist"]
[null,461227455,1538545652,"PETER F SERRATELLI","942 AVENUE C","BAYONNE","NJ","07002","DENTAL","General Dentist"]
[null,873737615,1841643640,"KARI R MANN","3201 DEL PRADO BLVD S STE 120","CAPE CORAL","FL",33904,"DENTAL","General Dentist"]
[null,521953617,1134287493,"SCOTT  FISHER","15 C ST","LAUREL","MD",20707,"DENTAL","General Dentist"]
[null,453113931,1154472983,"SUNNY S CHUNG","796 EAST ST","PITTSBORO","NC",27312,"DENTAL","General Dentist"]
[null,851356346,1083857783,"RIINA  ELSEY","770 MILES RD UNIT 2","WEST CHESTER","PA",19380,"DENTAL","Pediatric Dentist"]
[null,842464644,1740345743,"CRAIG W STOUT","2191 DEFENSE HWY STE 210","CROFTON","MD",21114,"DENTAL","General Dentist"]
[null,831943793,1104930924,"ARDEN M STERLING","2500 MONUMENT AVE","RICHMOND","VA",23220,"DENTAL","General Dentist"]
[null,522000263,1275657744,"PAUL R FRIEDMAN","6 PARK CENTER CT STE 204","OWINGS MILLS","MD",21117,"DENTAL","Periodontist"]
[null,871458007,1386081016,"ARIADNE V HERNANDEZ","3400 HAYDENPARK LN STE 203","HENRICO","VA",23233,"DENTAL","General Dentist"]
[null,232054483,1497282768,"DANIEL  SIERRA-VASQUEZ","995 OLD EAGLE SCHOOL RD STE 317","WAYNE","PA",19087,"DENTAL","Oral Surgeon"]
[null,472678579,1770708356,"JOSEPH  CARIELLO","12 MAIN ST","CENTER HARBOR","NH","03226","DENTAL","General Dentist"]
[null,830542906,1427403237,"CHRISTOPHER  PARKER","2337 WHITESBURG DR SE","HUNTSVILLE","AL",35801,"DENTAL","Pediatric Dentist"]
[null,262547292,1609088160,"GREGORY WADE GOODREAU","17350 PANAMA CITY BEACH PKWY","PANAMA CITY BEACH","FL",32413,"DENTAL","General Dentist"]
[null,650568845,1851730477,"VIVIAN S MORAD","8950 SW 74TH CT STE 1910","MIAMI","FL",33156,"DENTAL","General Dentist"]
[null,"061654506",1629545637,"JOSE M HORAK","1001 10TH AVE S UNT 218","NAPLES","FL",34102,"DENTAL","General Dentist"]
[null,851340230,1326669078,"ROBERT  MADRIGAL","929 RIDGE RD","WILMETTE","IL",60091,"DENTAL","General Dentist"]
[null,832340897,1336301670,"URVI P RAVINDRAN","13220 STRICKLAND RD STE 166","RALEIGH","NC",27613,"DENTAL","General Dentist"]
[null,222192716,1629112057,"DEBRA  FULTON","813 FERRY AVE","CAMDEN","NJ","08104","DENTAL","General Dentist"]
[null,474199813,1679860852,"MIKHAIL L SITKOVETSKIY","1350 E LYCOMING ST","PHILADELPHIA","PA",19124,"DENTAL","General Dentist"]
[null,843979612,1184958639,"RANIA  LIVADA","1950 LAUREL MANOR DR STE 174","THE VILLAGES","FL",32162,"DENTAL","General Dentist"]
[null,872522658,1205177961,"ANNA ELISE BAILEY","3349 NIAGARA FALLS BLVD","NORTH TONAWANDA","NY",14120,"DENTAL","General Dentist"]
[null,831358809,1962667576,"KAVI  SAGUNARTHY","6257 CAROLINA COMMONS DR STE 100","FORT MILL","SC",29707,"DENTAL","General Dentist"]
[null,510483319,1063631869,"ERIC  HARTZELL","3931 TINSLEY DR","HIGH POINT","NC",27265,"DENTAL","General Dentist"]
[null,200185918,1831712637,"RITA DEE M RAFFOUL","4530 GRAND BLVD","NEW PORT RICHEY","FL",34652,"DENTAL","General Dentist"]
[null,454888689,1992018766,"ANATOLIY  KONOVALOV","3002 MERMAID AVE","BROOKLYN","NY",11224,"DENTAL","General Dentist"]
[null,232896915,1841585916,"HECTOR C SIORDIA","4341 LINGLESTOWN RD","HARRISBURG","PA",17112,"DENTAL","Oral Surgeon"]
[null,264792089,1982898482,"MARIANNA  EVANS","500 EVERGREEN DR STE 11","GLEN MILLS","PA",19342,"DENTAL","General Dentist"]
[null,465348284,1912570094,"TARONN L SIMPSON","285 S CHURCH ST STE 8","MOORESTOWN","NJ","08057","DENTAL","General Dentist"]
[null,473468698,1851078539,"MONICA B HUYNH","907 NW 18TH AVE","PORTLAND","OR",97209,"DENTAL","General Dentist"]
[null,200441252,1164478624,"PETER P TONG","20 COURTHOUSE SQ STE 105","ROCKVILLE","MD",20850,"DENTAL","General Dentist"]
[null,471276485,1104133263,"CECIL F RITER","3045 MONSARRAT AVE STE 7","HONOLULU","HI",96815,"DENTAL","General Dentist"]
[null,853879634,1699339937,"DAVID  MAZOR","931 E HAVERFORD RD","BRYN MAWR","PA",19010,"DENTAL","General Dentist"]
[null,570893174,1053804658,"MATTHEW B WINTER","1204 TWO ISLAND COURT","MT  PLEASANT","SC",29466,"DENTAL","General Dentist"]
[null,320285314,1689102030,"JENNALEE  DICICCO","729 FRANKLINVILLE RD","MULLICA HILL","NJ","08062","DENTAL","General Dentist"]
[null,994677775,1598294753,"ANNIE  SMITH","12497 S TAMIAMI TRL, STE 2","NORTH PORT","FL",34287,"DENTAL","General Dentist"]
[null,562185627,1952077794,"SEHIE O KOH","2783 NC HIGHWAY 68 S STE 107","HIGH POINT","NC",27265,"DENTAL","General Dentist"]
[null,862496016,1902451008,"MELISSA  ANDERSON","1501 S CLINTON ST STE 335","BALTIMORE","MD",21224,"DENTAL","General Dentist"]
[null,951959423,1578818134,"DEREK J HAVAS","150 W MADISON AVE","EL CAJON","CA",92020,"DENTAL","Oral Surgeon"]
[null,471302605,1609529775,"ERIN E DISKIN","913 E BROAD ST","FUQUAY VARINA","NC",27526,"DENTAL","General Dentist"]
[null,863912687,1104944982,"KENNETH  BROWNING PRINCE","5435 KIETZKE LN","RENO","NV",89511,"DENTAL","General Dentist"]
[null,"010728047",1093927527,"DAVID J OSULLIVAN","991 HIGH POINT DR","NAPLES","FL",34103,"DENTAL","General Dentist"]
[null,232460701,1205839149,"ROBBIN L CRAMER","978 DEKALB PIKE","BLUE BELL","PA",19422,"DENTAL","General Dentist"]
[null,452948335,1962782961,"MICHAEL J MASER","3512 CADUCEUS DR","MYRTLE BEACH","SC",29588,"DENTAL","General Dentist"]
[null,472415560,1861541872,"BILL W ROE","2492 HELENA RD","HELENA","AL",35080,"DENTAL","General Dentist"]
[null,232900712,1255472544,"PHILLIP M HALPER","170 S MAIN ST STE C","YARDLEY","PA",19067,"DENTAL","General Dentist"]
[null,521013680,1831273846,"MARIA T MARANTO","300 E JOPPA RD STE 316","TOWSON","MD",21286,"DENTAL","General Dentist"]
[null,992778475,1336200591,"AMINDA  OSORIO-MODRELL","8805 COLUMBIA 100 PKWY STE 104","COLUMBIA","MD",21045,"DENTAL","General Dentist"]
[null,610677946,1336232826,"GREGORY E STRULL","4122 SHELBYVILLE RD STE A","LOUISVILLE","KY",40207,"DENTAL","Oral Surgeon"]
[null,260516948,1992909261,"DMITRY  KARAGODSKY","1775 STREET RD","SOUTHAMPTON","PA",18966,"DENTAL","General Dentist"]
[null,843973627,1386002046,"ERICK  CRESPO","4900 LINTON BLVD STE 11","DELRAY BEACH","FL",33445,"DENTAL","General Dentist"]
[null,221909919,1134770365,"OLIVIA A ROTONDI","292 HURFFVILLE GRENLOCH RD","SEWELL","NJ","08080","DENTAL","Endodontist"]
[null,991174851,1043654098,"ANIL V SHAH","356 N POTTSTOWN PIKE STE 100","EXTON","PA",19341,"DENTAL","Pediatric Dentist"]
[null,823290682,1730888231,"ELIZABETH  GROTHE","2102 SW H K DODGEN LOOP STE 130","TEMPLE","TX",76504,"DENTAL","General Dentist"]
[null,920519279,1013268416,"BRETT A VOEGELE","13875 HWY 13 FRONTAGE RD STE 50","SAVAGE","MN",55378,"DENTAL","Oral Surgeon"]
[null,562185627,1114067154,"LUCAS J NAZARIO-CORREA","1001 WIDEWATERS PKWY","KNIGHTDALE","NC",27545,"DENTAL","General Dentist"]
[null,"061742291",1154453504,"STEVEN H GHIM","8912 BLAKENEY PROFESSIONAL DR STE 400","CHARLOTTE","NC",28277,"DENTAL","General Dentist"]
[null,820939044,1639142755,"ANDREW S DELLAPIETRA","291 KNICKERBOCKER AVE","BROOKLYN","NY",11237,"DENTAL","General Dentist"]
[null,522265469,1114905569,"JANICE I BLOUGH-LABUDA","444 NATIONAL HWY","LAVALE","MD",21502,"DENTAL","General Dentist"]
[null,813501419,1306252887,"STEVEN R DEATON","209 WEST 5TH NORTH ST","SUMMERVILLE","SC",29483,"DENTAL","General Dentist"]
[null,334367318,1184105645,"MATTHEW C GRAHAM","1107 WESTBRIAR DR","HENRICO","VA",23238,"DENTAL","General Dentist"]
[null,874106316,1760799845,"MARGARITA J ELIAS","1712 I ST NW STE 906","WASHINGTON","DC",20006,"DENTAL","General Dentist"]
[null,861460891,1568091387,"ANDREW P POWELL","10C YORKSHIRE ST","ASHEVILLE","NC",28803,"DENTAL","General Dentist"]
[null,334341853,1750806394,"KRUPA  PARIKH","1330 W CHESTER PIKE","HAVERTOWN","PA",19083,"DENTAL","General Dentist"]
[null,934646304,1407203615,"JENNIFER  GAGNON","324 GANNETT DR STE 500","S PORTLAND","ME","04106","DENTAL","General Dentist"]
[null,920674315,1518027804,"JASON H GOODCHILD","200 YORKTOWN PLZ","ELKINS PARK","PA",19027,"DENTAL","General Dentist"]
[null,832781042,1023531597,"JILLIAN E EAVES","1807 CROWNE COMMONS WAY SUITE F6 & F7","JOHNS ISLAND","SC",29455,"DENTAL","General Dentist"]
[null,204243161,1811635915,"JOSE  ABREU PEREZ","1130 OLD YORK RD","ABINGTON","PA",19001,"DENTAL","General Dentist"]
[null,260806223,1457535502,"LALEH  TAVABI","324 W PARK AVE","LONG BEACH","NY",11561,"DENTAL","General Dentist"]
[null,852396113,1417173535,"SANDRA L KAPLAN","301 N HARRISON ST STE 440","PRINCETON","NJ","08540","DENTAL","General Dentist"]
[null,542134851,1083772685,"DANNY H DINH","5950 FREDERICK CROSSING LN","FREDERICK","MD",21704,"DENTAL","General Dentist"]
[null,815119639,1437599552,"JONATHAN A STOPYAK","902 10TH AVE","PORT HURON","MI",48060,"DENTAL","General Dentist"]
[null,521860379,1033709530,"ARIEL K SNELL","1615 TREE SAP CT STE A","SALISBURY","MD",21804,"DENTAL","General Dentist"]
[null,521302423,1003939430,"STEPHEN T YOUNISS","19 FONTANA LN STE 202","BALTIMORE","MD",21237,"DENTAL","General Dentist"]
[null,593416509,1508053109,"NICK L KAVOUKLIS","6421 SHELDON RD","TAMPA","FL",33615,"DENTAL","General Dentist"]
[null,541522599,1720265820,"BRADLEY R ANDERSON","11420 W BROAD ST","GLEN ALLEN","VA",23060,"DENTAL","General Dentist"]
[null,208923970,1952529067,"THOMAS J SARDINA","405 MAIN ST","LANDISVILLE","PA",17538,"DENTAL","General Dentist"]
[null,881224580,1275710592,"DON C GIBSON","327 TOWNSHIP LINE RD","ELKINS PARK","PA",19027,"DENTAL","General Dentist"]
[null,812017267,1285857979,"GENE  GUTMAN","2312 WHITEHORSE MERCERVILLE RD STE 202","MERCERVILLE","NJ","08619","DENTAL","General Dentist"]
[null,550767614,1770892705,"JOHN M GREEN","895 E WASHINGTON AVE","VINTON","VA",24179,"DENTAL","Oral Surgeon"]
[null,475123746,1144502451,"DANIELLE MARIE LOTZE","8142 TEZEL RD","SAN ANTONIO","TX",78250,"DENTAL","General Dentist"]
[null,871721210,1467127092,"JUNED ALI  MOHAMMED","6160 S CASS AVE STE E","WESTMONT","IL",60559,"DENTAL","General Dentist"]
[null,540506332,1255821443,"MICHELLE C HUMBLE","4348 ELECTRIC RD","ROANOKE","VA",24018,"DENTAL","General Dentist"]
[null,822680330,1518362706,"SIMON L CHIANG","720 ROUTE 202 206 NORTH","BRIDGEWATER","NJ","08807","DENTAL","General Dentist"]
[null,884417384,1356467930,"SURENDRA GOPAL SIRIVOLU","240 E NEW YORK AVE","DELAND","FL",32724,"DENTAL","General Dentist"]
[null,271195394,1942377304,"LYDIA C WYATT","4245 S GRAND CANYON DR STE 108","LAS VEGAS","NV",89147,"DENTAL","General Dentist"]
[null,833107264,1881264281,"TAMEEM  AZIZ","16689 RIVER RIDGE BLVD","WOODBRIDGE","VA",22191,"DENTAL","General Dentist"]
[null,"061001051",1477078707,"YUVIKA RAJ  KUMAR","250 LAMBERTON RD","WINDSOR","CT","06095","DENTAL","General Dentist"]
[null,382801920,1285172213,"MATTHEW S DEMERLE","35050 23 MILE RD","NEW BALTIMORE","MI",48047,"DENTAL","Oral Surgeon"]
[null,593599071,1003921099,"MARCOS  DIAZ","2239 N COMMERCE PKWY STE 2","WESTON","FL",33326,"DENTAL","Oral Surgeon"]
[null,822536222,1326654591,"LAKESHA N RICHARDSON","21534 GREAT MILLS RD","LEXINGTON PARK","MD",20653,"DENTAL","General Dentist"]
[null,463312030,1063461341,"RYAN C THOMAS","4059 W HUNT HWY STE 2","SAN TAN VALLEY","AZ",85144,"DENTAL","General Dentist"]
[null,"020558412",1427127265,"MARIA C FERRIOL","5152 BLAZER PKWY","DUBLIN","OH",43017,"DENTAL","Periodontist"]
[null,831910714,1023532298,"JARED  GIBBY","499 E CENTRAL PKWY STE 200","ALTAMONTE SPRINGS","FL",32701,"DENTAL","General Dentist"]
[null,451266532,1093232480,"JOHNATHAN  STEPPE","568 INTERNATIONAL DR","MYRTLE BEACH","SC",29579,"DENTAL","General Dentist"]
[null,455181393,1386874378,"NEIL R PATEL","212 BROWN ST","PHILADELPHIA","PA",19123,"DENTAL","General Dentist"]
[null,921386119,1023530029,"MICHAEL A DIEZ","5010 GUNN HWY","TAMPA","FL",33624,"DENTAL","General Dentist"]
[null,204116177,1487482170,"DANA  KARKOUTLI","100 SHEPPARD RD","VOORHEES","NJ","08043","DENTAL","General Dentist"]
[null,261586792,1689711467,"FATIMA T ZOHRA","1414 MARKS CHURCH RD","AUGUSTA","GA",30909,"DENTAL","General Dentist"]
[null,833271525,1386873800,"ONYINYECHUKWU C MYERS","355 ROUTE 41","GAP","PA",17527,"DENTAL","General Dentist"]
[null,822272495,1265125330,"ALLISON  SEIGEL","214 NEW RD","LINWOOD","NJ","08221","DENTAL","General Dentist"]
[null,232759125,1568840601,"MICHAEL  RUSSO","2 CIRCLE AVE","WEST CHESTER","PA",19382,"DENTAL","General Dentist"]
[null,465108932,1760971592,"AMY  HAN","24 W 14TH ST","NEW YORK","NY",10011,"DENTAL","General Dentist"]
[null,300962053,1710909130,"MARGARET H IRVIN","4530 WISCONSIN AVE NW STE 200","WASHINGTON","DC",20016,"DENTAL","General Dentist"]
[null,862271222,1700240652,"ISHAK  SAID","254 E GIBBSBORO RD","LINDENWOLD","NJ","08021","DENTAL","General Dentist"]
[null,510271539,1912298738,"BRIAN T MATTHEWS","1403 SILVERSIDE RD STE A","WILMINGTON","DE",19810,"DENTAL","General Dentist"]
[null,862529574,1477100105,"DAVID COLIN STONE","4205 N POINT PKWY STE E","ALPHARETTA","GA",30022,"DENTAL","General Dentist"]
[null,472366576,1225714538,"YOLEIDY T JOHNSTONE","1529 ROUTE 206 UNIT D","TABERNACLE","NJ","08088","DENTAL","General Dentist"]
[null,273803146,1528871233,"BHAKTI  VACHHANI","432 ROLLING RIDGE DR STE 1","STATE COLLEGE","PA",16801,"DENTAL","General Dentist"]
[null,842567230,1053802702,"KIMIA  EFTEKHARGHORAISHI","9709 REDSTONE DR SUITE 500","FORT MILL","SC",29707,"DENTAL","General Dentist"]
[null,821867336,1023204419,"BIVIN  PHILLIPS","1201 AGORA DR STE 2B","BEL AIR","MD",21014,"DENTAL","General Dentist"]
[null,223838315,1407475445,"MICHAEL C ROMANKO","736 W SOMERDALE RD","SOMERDALE","NJ","08083","DENTAL","General Dentist"]
[null,271565534,1295211258,"RACHEL E FOGARTY","151 DEEP WOOD DR","ROUND ROCK","TX",78681,"DENTAL","General Dentist"]
[null,320059779,1740490168,"MICHAEL  MORTAZIE","3301 NEW MEXICO AVE NW STE 108","WASHINGTON","DC",20016,"DENTAL","General Dentist"]
[null,650665173,1649331505,"KEUM H PARK","10500 ULMERTON RD STE 210","LARGO","FL",33771,"DENTAL","General Dentist"]
[null,270587395,1376814780,"CORYDON B BUTLER","4097 IRONBOUND RD STE C","WILLIAMSBURG","VA",23188,"DENTAL","General Dentist"]
[null,264458626,1548493174,"TINA M KAO REASONER","1130 17TH ST","FULTON","IL",61252,"DENTAL","General Dentist"]
[null,820371242,1700095957,"NICHOLAS A MCNAMARA","13997 W HIGHWAY 53","RATHDRUM","ID",83858,"DENTAL","General Dentist"]
[null,842407765,1528486800,"CLAUDIA L QUAN","1533 S ST FRANCIS DR STE B","SANTA FE","NM",87505,"DENTAL","General Dentist"]
[null,232740938,1821218629,"GEORGE J REINHART","4714 BETHLEHEM PIKE","TELFORD","PA",18969,"DENTAL","General Dentist"]
[null,834356461,1811686256,"YAOXI  LI","2260 MAIN ST","WEST BARNSTABLE","MA","02668","DENTAL","General Dentist"]
[null,571087008,1922164706,"GROVER E RABON","669 B W WESMARK","SUMTER","SC",29150,"DENTAL","General Dentist"]
[null,204510562,1922164417,"QIN  HUANG","331 W BOOT RD","WEST CHESTER","PA",19380,"DENTAL","General Dentist"]
[null,541186353,1093121808,"KEITH W ELDRIDGE","6441 IRONBRIDGE RD","NORTH CHESTERFIELD","VA",23234,"DENTAL","General Dentist"]
[null,455473033,1003073610,"MONICA K SINGH","500 INDEPENDENCE BLVD","SICKLERVILLE","NJ","08081","DENTAL","General Dentist"]
[null,860910154,1063418044,"JEFFREY D CLARK","8765 E BELL RD STE 201","SCOTTSDALE","AZ",85260,"DENTAL","General Dentist"]
[null,854222892,1770611790,"JOSEPH  NORDMANN","741 FRONT ST STE 310","CELEBRATION","FL",34747,"DENTAL","General Dentist"]
[null,593365515,1518033380,"ROSANNA  HILARIO","2907 VINELAND RD","KISSIMMEE","FL",34746,"DENTAL","General Dentist"]
[null,474233197,1477083277,"EMILY R C HALLAM","145 N NARBERTH AVE","NARBERTH","PA",19072,"DENTAL","General Dentist"]
[null,474411158,1902907066,"EDWARD  SLOYER","26 HOLYOKE RD","HICKSVILLE","NY",11801,"DENTAL","General Dentist"]
[null,208643759,1407803398,"OTTO F TIDWELL","9096 RIVERSIDE DR","SEAFORD","DE",19973,"DENTAL","Oral Surgeon"]
[null,465754024,1487035606,"JEFFREY  KNITTEL","18560 US HIGHWAY 441","MOUNT DORA","FL",32757,"DENTAL","Oral Surgeon"]
[null,813793901,1093994162,"BENJAMIN J CROWLEY","6808 STONEMAN RD","RICHMOND","VA",23228,"DENTAL","General Dentist"]
[null,200185918,1467133397,"HENRY  GUILARTE-FERNANDEZ","1425 6TH ST NW","WINTER HAVEN","FL",33881,"DENTAL","General Dentist"]
[null,822081293,1245065309,"HEIDI  KIM","1820 E CRAIG RD SUITE 102","LAS VEGAS","NV",89030,"DENTAL","General Dentist"]
[null,203167069,1114921475,"TRACY LYNN SULC","1685 CROWN AVE STE 200","LANCASTER","PA",17601,"DENTAL","General Dentist"]
[null,471123833,1376929257,"UMAR  SYED","6610 SEAWALL BLVD","GALVESTON","TX",77551,"DENTAL","General Dentist"]
[null,200223615,1043394711,"JAMES H MCCREARY","4502 SPANISH TRL","PENSACOLA","FL",32504,"DENTAL","General Dentist"]
[null,264609067,1619666716,"NIKETA  PATEL","105 E BELT LINE RD STE 900","CEDAR HILL","TX",75104,"DENTAL","General Dentist"]
[null,273900278,1609889930,"LEO  WHEAT","155 TRADERS WAY STE 400","POOLER","GA",31322,"DENTAL","General Dentist"]
[null,474126096,1952032120,"LINDSEY  CRNALIC","2939 US ALT 19","PALM HARBOR","FL",34683,"DENTAL","General Dentist"]
[null,194389092,1073729299,"SHAWN H PIPER","9720 3RD AVE","STONE HARBOR","NJ","08247","DENTAL","General Dentist"]
[null,264797614,1831391283,"WAN SUK  SEO","200 W RIDGE PIKE STE 129","CONSHOHOCKEN","PA",19428,"DENTAL","General Dentist"]
[null,562185627,1598110546,"CLAYTON L ROGERS","301 S WILLIS DR STE 100","SHALLOTTE","NC",28470,"DENTAL","General Dentist"]
[null,916551049,1851447122,"TIMOTHY M TERLAJE","930 VALKENBURGH ST STE 209","HONOLULU","HI",96818,"DENTAL","General Dentist"]
[null,263920159,1942794987,"MOLLY W JOHNSON","3951 MARY ELIZA TRCE NW STE 200","MARIETTA","GA",30064,"DENTAL","General Dentist"]
[null,874366322,1992859128,"JENNIFER L STAAS","1600 WESTBROOK AVE","RICHMOND","VA",23227,"DENTAL","General Dentist"]
[null,222326278,1649764473,"SARA  ENGLEMAN","40 E ATLANTIC AVE","AUDUBON","NJ","08106","DENTAL","General Dentist"]
[null,932809508,1558571836,"TODD B HARRIS","811 MAIN ST","DENNIS","MA","02638","DENTAL","General Dentist"]
[null,842782656,1417300666,"JULIA  BATY FRIGO","31 E MACK BAYOU DRIVE","SANTA ROSA BEACH","FL",32459,"DENTAL","General Dentist"]
[null,932721525,1629020649,"H CLARK  STURDIVANT","608 POLK ST","PORT TOWNSEND","WA",98368,"DENTAL","General Dentist"]
[null,994664301,1164420758,"VINCENT E SMITH","6925 WILLOW ST NW STE B106","WASHINGTON","DC",20012,"DENTAL","General Dentist"]
[null,842364077,1144865445,"LAURENCE P EGGART","200 BEVERLY HANKS CTR STE B","HENDERSONVILLE","NC",28792,"DENTAL","General Dentist"]
[null,990601365,1427199181,"JEFFREY S ROSENTHAL","1930 E CARSON ST.","PITTSBURGH","PA",15203,"DENTAL","General Dentist"]
[null,833064424,1730120825,"ERICA  SOIFER","130 E BLACK HORSE PIKE STE 318","AUDUBON","NJ","08106","DENTAL","General Dentist"]
[null,383850699,1871572479,"JEFFREY H SCOTT","202 WB MCLEAN DR","CAPE CARTERET","NC",28584,"DENTAL","General Dentist"]
[null,881199757,1083636344,"STEPHANIE A MCRAE","2140 LAKE EUSTIS DR","TAVARES","FL",32778,"DENTAL","General Dentist"]
[null,833246828,1003109877,"JILL L GARRIDO","2000 FOULK RD STE G","WILMINGTON","DE",19810,"DENTAL","Pediatric Dentist"]
[null,232383112,1760575377,"RICHARD C MANDEL","200 E WOODLAND AVE","SPRINGFIELD","PA",19064,"DENTAL","General Dentist"]
[null,870911587,1811317076,"STEVEN C CHRISTOFAKIS","14420 SOMMERVILLE CT","MIDLOTHIAN","VA",23113,"DENTAL","General Dentist"]
[null,900621547,1154630341,"CHERYL LYNN PISANO","8575 NE 138TH LN STE 105","LADY LAKE","FL",32159,"DENTAL","General Dentist"]
[null,463158368,1245466374,"KENIA  CAMPOS","14255 COLLIER BLVD STE 100","NAPLES","FL",34119,"DENTAL","General Dentist"]
[null,841217150,1871608422,"LEROY W GERRY","13606 XAVIER LN STE B","BROOMFIELD","CO",80023,"DENTAL","General Dentist"]
[null,880980331,1528598208,"ALBANO  ZENELAJ","483 S OXFORD VALLEY RD","FAIRLESS HILLS","PA",19030,"DENTAL","General Dentist"]
[null,832743356,1710097811,"RHONDA H NORRIS","720 W CORBETT AVE","SWANSBORO","NC",28584,"DENTAL","General Dentist"]
[null,542003970,1508910886,"DINA P PORTER","1340 CENTRAL PARK BLVD STE 200","FREDERICKSBURG","VA",22401,"DENTAL","General Dentist"]
[null,334341853,1861948796,"HARDIK J VYAS","1330 W CHESTER PIKE","HAVERTOWN","PA",19083,"DENTAL","General Dentist"]
[null,911835295,1689635484,"ROBERT V HANKS","1800 C ST STE 225","BELLINGHAM","WA",98225,"DENTAL","General Dentist"]
[null,820608477,1346619657,"JENNIFER M DROSSNER","1274 RIBAUT RD","BEAUFORT","SC",29902,"DENTAL","General Dentist"]
[null,"020470324",1215045273,"ALBERT J SANDLER","386 MERRIMACK ST STE 3B","METHUEN","MA","01844","DENTAL","General Dentist"]
[null,882056507,1134643786,"PHILLIP S MCABEE","655 S MAIN ST","GREENVILLE","SC",29601,"DENTAL","General Dentist"]
[null,461430525,1942468590,"KHALFANI  WALKER","6925 WILLOW ST NW STE B106","WASHINGTON","DC",20012,"DENTAL","General Dentist"]
[null,883667508,1710432521,"CHRISTOPHER E SPEARS","2832A CHURCHVILLE RD","CHURCHVILLE","MD",21028,"DENTAL","General Dentist"]
[null,200120892,1942706304,"STEPHANIE  CALORA","2361 BRISTOL RD","BENSALEM","PA",19020,"DENTAL","Pediatric Dentist"]
[null,"010713058",1700061777,"JASON  CATALDO","3505 UNIVERSITY DR","DURHAM","NC",27707,"DENTAL","Periodontist"]
[null,932472173,1245910785,"CHRISTINE NICOLE GONZALEZ CACHO","4782 MARIGOLD AVE","KISSIMMEE","FL",34758,"DENTAL","General Dentist"]
[null,465260232,1205358173,"DENNIS  CAO","460 KELLER PKWY STE C 2","KELLER","TX",76248,"DENTAL","General Dentist"]
[null,200185918,1659461077,"CHARLES H HELMS","2620 E HIGHWAY 50 STE 100","CLERMONT","FL",34711,"DENTAL","General Dentist"]
[null,371052009,1982609087,"PHILIP R BANGHART","102 PROFESSIONAL PLAZA","MATTOON","IL",61938,"DENTAL","Oral Surgeon"]
[null,203951010,1740295674,"CHRISTOPHER T WUJICK","8475 SEMINOLE BLVD","SEMINOLE","FL",33772,"DENTAL","General Dentist"]
[null,832271337,1194253690,"ADAM  L'ITALIEN","10 GRANITE WAY","ROCKPORT","ME","04856","DENTAL","General Dentist"]
[null,453685615,1578746913,"SCOTT A MUTSCHLER","720 LIMEKILN RD","NEW CUMBERLAND","PA",17070,"DENTAL","General Dentist"]
[null,463358957,1386059772,"MICAH J CROWLEY","1901 S BROAD ST","PHILADELPHIA","PA",19148,"DENTAL","Periodontist"]
[null,932299241,1336294180,"CARL C FRIDDLE","2121 EISENHOWER AVE STE 502","ALEXANDRIA","VA",22314,"DENTAL","General Dentist"]
[null,"030581017",1053339523,"LYNDA I BARD","1818 MARKET ST STE 100","PHILADELPHIA","PA",19103,"DENTAL","General Dentist"]
[null,261535608,1538351853,"MAGALI  OLANO","7431 NEW LINTON HALL RD","GAINESVILLE","VA",20155,"DENTAL","General Dentist"]
[null,461727123,1740472588,"JILL Y MERRELL","205 FLAT CREEK VILLAGE DR","WEAVERVILLE","NC",28787,"DENTAL","General Dentist"]
[null,800026413,1013001171,"MATTHEW S DAVIS","12297 PENNSYLVANIA ST UNIT 2","THORNTON","CO",80241,"DENTAL","Endodontist"]
[null,822449020,1154709251,"LANCE H HUTCHENS","1611 DOCTORS CIR","WILMINGTON","NC",28401,"DENTAL","General Dentist"]
[null,262589590,1366766479,"KEVIN A REUSS","67 DOWLIN FORGE RD STE C","EXTON","PA",19341,"DENTAL","General Dentist"]
[null,454851492,1689657413,"JAMES M ASBELLE","120 AUGUSTA RD","AIKEN","SC",29801,"DENTAL","General Dentist"]
[null,881768383,1124581251,"NINA R OLIVIERI","59 ELIZABETH DR","LOCKPORT","NY",14094,"DENTAL","General Dentist"]
[null,204245215,1043322282,"MARCUS A HANNAH","970 N KALAHEO AVE STE A305","KAILUA","HI",96734,"DENTAL","General Dentist"]
[null,205359179,1528193679,"AHMAD  CHARKAS","207 N GUERNSEY RD","WEST GROVE","PA",19390,"DENTAL","Orthodontist"]
[null,822867769,1003297359,"DENNIS A ENGSTROM","1625 RAMBLEWOOD DR STE 2","EAST LANSING","MI",48823,"DENTAL","General Dentist"]
[null,475436893,1407236151,"JOSHUA K NAGAO","1951 N WILMOT RD STE 14","TUCSON","AZ",85712,"DENTAL","General Dentist"]
[null,233073598,1205958188,"AARON J UFBERG","664 LANCASTER AVE","BERWYN","PA",19312,"DENTAL","General Dentist"]
[null,477645437,1386671931,"DANIEL M RAUK","600 S SAINT VRAIN AVE UNIT 6","ESTES PARK","CO",80517,"DENTAL","General Dentist"]
[null,223440385,1215950290,"CARMELLA  FANELLE","34 CLEMENTS BRIDGE RD","BARRINGTON","NJ","08007","DENTAL","General Dentist"]
[null,831266756,1043492382,"ALEX A GIANNINI","4245 N COURTENAY PKWY","MERRITT ISLAND","FL",32953,"DENTAL","General Dentist"]
[null,461421010,1295981892,"TIMOTHY S CASEY","12650 N BEACH ST STE 100","KELLER","TX",76244,"DENTAL","General Dentist"]
[null,474755223,1184039455,"DANIEL  WHITLEY","56 OFFICE PARK DR UNIT 100","JACKSONVILLE","NC",28546,"DENTAL","General Dentist"]
[null,591865695,1467945196,"KELLY  KIDWELL","2143 49TH ST N","SAINT PETERSBURG","FL",33710,"DENTAL","General Dentist"]
[null,260801564,1467010405,"STEPHANIE  GUERRIER","13605 REESE BLVD W","HUNTERSVILLE","NC",28078,"DENTAL","General Dentist"]
[null,232786088,1629198825,"VINCENT C PEPE","5349 BRITTANY DR","CLIFTON HEIGHTS","PA",19018,"DENTAL","General Dentist"]
[null,992235892,1841402500,"AMIR R FEREIDOUNI","210 JONES RD","FALMOUTH","MA","02540","DENTAL","General Dentist"]
[null,463852893,1154974426,"EMERI J BEELER","104 W 3RD ST","PORT ANGELES","WA",98362,"DENTAL","General Dentist"]
[null,471542016,1053056739,"JORDYN T SHALIT-SCRIPTUNAS","1642 KINGS HWY NORTH","CHERRY HILL","NJ","08034","DENTAL","General Dentist"]
[null,820562632,1598848889,"MATTHEW  MASTROROCCO","25 CLARK SUMMIT DR STE 100","BLUFFTON","SC",29910,"DENTAL","General Dentist"]
[null,262231139,1184853103,"AMI S GUPTA","1924 ROUTE 70 EAST","CHERRY HILL","NJ","08003","DENTAL","Pediatric Dentist"]
[null,223845942,1205258472,"CHRISTOPHER R WRIGHT","219 S MAIN ST","BARNEGAT","NJ","08005","DENTAL","General Dentist"]
[null,571183564,1508910381,"XIAOYAN  DAI","2901 DUTTON MILL RD STE 130","ASTON","PA",19014,"DENTAL","General Dentist"]
[null,203296691,1750623179,"YASIR  SIDDIQUE","2200 MONTROSE ST","PHILADELPHIA","PA",19146,"DENTAL","General Dentist"]
[null,541186353,1508918129,"DENNIS C WONG","10500 ATLEE STATION RD","ASHLAND","VA",23005,"DENTAL","General Dentist"]
[null,274595811,1760798730,"JESSE P HALL","1408 SKIBO RD","FAYETTEVILLE","NC",28303,"DENTAL","General Dentist"]
[null,300523387,1578091542,"MEGHAN  HARLEY","120 LAFAYETTE ST STE 1","KENNETT SQUARE","PA",19348,"DENTAL","Endodontist"]
[null,863076415,1851887111,"MATTHEW L KULINSKI","1763 ALLEGHENY BLVD","RENO","PA",16343,"DENTAL","General Dentist"]
[null,842492688,1588044143,"MAETAL  HENIG","2010 S JUNIPER ST","PHILADELPHIA","PA",19148,"DENTAL","Pediatric Dentist"]
[null,201272092,1255439238,"RANDALL G COHEN","10725 US HIGHWAY 1","SEBASTIAN","FL",32958,"DENTAL","General Dentist"]
[null,571049580,1275578791,"MALIA  FREDRICKSON","10229 A CLEMSON BLVD","SENECA","SC",29678,"DENTAL","General Dentist"]
[null,463141197,1336322395,"ABBEY  SULLIVAN OROZCO","10 W GRAVERS LN","PHILADELPHIA","PA",19118,"DENTAL","Pediatric Dentist"]
[null,874390966,1730799677,"RONG  ZHENG","16 WYMAN RD","WESTMINSTER","MA","01473","DENTAL","General Dentist"]
[null,341111922,1992733174,"PATRICK A CHANEY","801 PRO DR STE E","CELINA","OH",45822,"DENTAL","Oral Surgeon"]
[null,364844916,1043994908,"VIVEK  DEWAN","4040 UPPER CREEK DR STE 101","SUN CITY CENTER","FL",33573,"DENTAL","General Dentist"]
[null,760666207,1396365920,"KIMBERLY  PHAM","715 W GRAY ST","HOUSTON","TX",77019,"DENTAL","General Dentist"]
[null,461534854,1396909875,"BYOUNGGON  KIM","2224 S 20TH ST","PHILADELPHIA","PA",19145,"DENTAL","General Dentist"]
[null,832653730,1770810319,"JEFFREY H CHU","1060 DAY HILL ROAD","WINDSOR","CT","06095","DENTAL","General Dentist"]
[null,461548008,1629351994,"NANA  DICKSON","3040 WILLIAMS DR #201","FAIRFAX","VA",22031,"DENTAL","General Dentist"]
[null,232592309,1629274329,"MICHAEL J COULTER","518 HARRISON ST","EMMAUS","PA",18049,"DENTAL","General Dentist"]
[null,232438115,1528752276,"ABBYGAIL  TASKIN","834 CHESTNUT ST STE 415","PHILADELPHIA","PA",19107,"DENTAL","General Dentist"]
[null,820912245,1417700949,"ANDREW J VANERP","2520 DELANEY AVE","WILMINGTON","NC",28403,"DENTAL","General Dentist"]
[null,854172893,1821401852,"RYAN T GRIFFITH","615 SAINT MARYS ST","RALEIGH","NC",27605,"DENTAL","General Dentist"]
[null,195403309,1831271782,"HOWARD  BARSKY","6204 CARVERSVILLE RD","CARVERSVILLE","PA",18913,"DENTAL","General Dentist"]
[null,463609090,1871279109,"NENAR  BARAZI","3440 BAYSIDE LAKES BLVD SE ST 1","PALM BAY","FL",32909,"DENTAL","General Dentist"]
[null,263975070,1487614533,"AGDHA M COLON-ARVELO","3233 S JOHN YOUNG PKWY","KISSIMMEE","FL",34746,"DENTAL","General Dentist"]
[null,451427993,1154450047,"MAREK  DWORAK","1197 MARLKRESS BLD B","CHERRY HILL","NJ","08003","DENTAL","General Dentist"]
[null,922353543,1780189084,"BENJAMIN  GREER","124 ANDREWS WAY STE A","SAINT MARYS","GA",31558,"DENTAL","General Dentist"]
[null,844877076,1962801704,"DANIEL  COCRIS","15044 SANDPIPER LANE Suite 2","NAPLES","FL",34114,"DENTAL","General Dentist"]
[null,821416732,1215050968,"JONATHAN M RICHTER","525 W END AVE APT 1G","NEW YORK","NY",10024,"DENTAL","Periodontist"]
[null,934856866,1376017061,"YOUSSEF  KARTABIL","11111 KATY FWY STE 1000","HOUSTON","TX",77079,"DENTAL","General Dentist"]
[null,581292216,1124487590,"SYLVESTER  MALCOM","782 PEACHTREE ST NE","ATLANTA","GA",30308,"DENTAL","General Dentist"]
[null,932993883,1477122745,"RYAN  DRIESSE","53 GORDON RD STE 103","JASPER","GA",30143,"DENTAL","General Dentist"]
[null,562259467,1801926944,"JOHN D WELLS","16600 BIRKDALE CMNS PKWY STE B","HUNTERSVILLE","NC",28078,"DENTAL","Endodontist"]
[null,232936439,1366534208,"RICHARD S WILSON","2401 PENNSYLVANIA AVE STE 1A8","PHILADELPHIA","PA",19130,"DENTAL","General Dentist"]
[null,351479191,1578916557,"STEPHEN  HENDRICKS","17455 DOUGLAS RD","SOUTH BEND","IN",46635,"DENTAL","General Dentist"]
[null,873169563,1982042446,"RYAN  JEFFREY","15 GOLDSMITH LN","OLD TOWN","ME","04468","DENTAL","General Dentist"]
[null,203221849,1700987641,"DONALD C ROBINSON","14346 WARWICK BLVD STE 418","NEWPORT NEWS","VA",23602,"DENTAL","General Dentist"]
[null,334993154,1740778695,"PEDRAUM S HEYDARI","10211 144TH ST E","PUYALLUP","WA",98374,"DENTAL","General Dentist"]
[null,471611911,1407101033,"IRIVELISSE  PORTER","87007 PROFESSIONAL WAY","YULEE","FL",32097,"DENTAL","General Dentist"]
[null,330065869,1922313659,"RENE  GOMEZ","791 E MONTE VISTA AVE","VACAVILLE","CA",95688,"DENTAL","General Dentist"]
[null,274950421,1568661155,"JILLIAN B WOLSKE","4700 NEW CENTRE DR","WILMINGTON","NC",28405,"DENTAL","General Dentist"]
[null,934220112,1093304990,"DAVID  DEGIRALAMO","485 AMWELL RD","HILLSBOROUGH","NJ","08844","DENTAL","General Dentist"]
[null,621873357,1235450065,"JAMES R PACE","104 KENNER AVE STE 101","NASHVILLE","TN",37205,"DENTAL","General Dentist"]
[null,844044630,1699192732,"SAMUEL D PETERSON","1830 E INNOVATION PARK DR","ORO VALLEY","AZ",85755,"DENTAL","General Dentist"]
[null,333426634,1386955508,"DAVIS  GARDNER","7205 HANCOCK VILLAGE DR","CHESTERFIELD","VA",23832,"DENTAL","General Dentist"]
[null,233024574,1861532442,"SAMUEL I KRATCHMAN","665 EXTON CMNS","EXTON","PA",19341,"DENTAL","Endodontist"]
[null,331700289,1639661614,"JASON LEE JOHNSON","2093 JONESBORO RD","MCDONOUGH","GA",30253,"DENTAL","General Dentist"]
[null,"043716375",1407918105,"EDWARD  BALLING","62 WARWICK RD","STRATFORD","NJ","08084","DENTAL","General Dentist"]
[null,222488654,1821611864,"AIYA  AL-BEYATI","1802 W 4TH ST","WILMINGTON","DE",19805,"DENTAL","General Dentist"]
[null,541171790,1518174614,"COREY  BURGOYNE","54 S MEDICAL PARK DR","FISHERSVILLE","VA",22939,"DENTAL","Oral Surgeon"]
[null,581234014,1346337359,"DANIEL STEVEN CARSON","6602 ABERCORN ST STE 101","SAVANNAH","GA",31405,"DENTAL","Oral Surgeon"]
[null,593615431,1568536555,"TAMAM M ELZAWAHRY","1560 JENKS AVE","PANAMA CITY","FL",32405,"DENTAL","General Dentist"]
[null,821477323,1740332774,"E C ARNETTE","803 SECOND AVE NORTH","NORTH MYRTLE BEACH","SC",29582,"DENTAL","General Dentist"]
[null,872762477,1295266377,"CHASE C JOYCE","2905 BRIARCLIFFE RD","WINSTON SALEM","NC",27106,"DENTAL","General Dentist"]
[null,460777348,1386130417,"DONG JOON KIM","10600 YORK RD STE 105","COCKEYSVILLE","MD",21030,"DENTAL","General Dentist"]
[null,993655504,1548473499,"STEVEN J RIDER","1636 NICHOLASVILLE RD STE 7","LEXINGTON","KY",40503,"DENTAL","General Dentist"]
[null,870429596,1346453438,"BARTON T GLEAVE","5872 S 900 E STE 200","SALT LAKE CITY","UT",84121,"DENTAL","General Dentist"]
[null,208293911,1356464077,"SARAH K PITMAN","2230 W BURNSIDE ST STE C","PORTLAND","OR",97210,"DENTAL","General Dentist"]
[null,200185918,1962145433,"RYAN  NAKAMOTO","1301 US HIGHWAY 41 BYP S","VENICE","FL",34285,"DENTAL","General Dentist"]
[null,823731680,1376036699,"SETH G JENNINGS","2277 SWANSON AVE # 102","LAKE HAVASU CITY","AZ",86403,"DENTAL","General Dentist"]
[null,384011813,1477501120,"EDWARD J WILLIAMS","3550 HARDEN BLVD UNIT 101","LAKELAND","FL",33803,"DENTAL","General Dentist"]
[null,921459673,1073185096,"BARLAN  BARRERO","1340 MATTHEWS TOWNSHIP PKWY STE 101","MATTHEWS","NC",28105,"DENTAL","General Dentist"]
[null,400014466,1669524906,"MATTHEW T KINGSTON","144 S CENTERVILLE RD","LANCASTER","PA",17603,"DENTAL","General Dentist"]
[null,200185918,1326459769,"WHITNEY HOWARD HAIDET","21300 TOWN COMMONS DR","ESTERO","FL",33928,"DENTAL","General Dentist"]
[null,874667112,1114906450,"JARED T HOUSTON","96 BILL HUGHES AVE","MURPHY","NC",28906,"DENTAL","General Dentist"]
[null,472415560,1619108560,"CECIL FRANK CAIN","2720 JOHN HAWKINS PKWY","HOOVER","AL",35244,"DENTAL","General Dentist"]
[null,571150125,1780637835,"HOSEIN S BAVAFA","2620 ASHBY AVE # 201","BERKELEY","CA",94705,"DENTAL","General Dentist"]
[null,561901594,1598741134,"WILLIAM T ARTHUR","551 BECKER DR","ROANOKE RAPIDS","NC",27870,"DENTAL","General Dentist"]
[null,823388814,1881399004,"JEFFERY  GIUS","2155 HOLLOW BROOK DR STE 20","COLORADO SPRINGS","CO",80918,"DENTAL","General Dentist"]
[null,232997598,1750465597,"CATHY A GRAY WEGLOS","219 HAMPDEN AVE","NARBERTH","PA",19072,"DENTAL","General Dentist"]
[null,222135466,1306287545,"LINDSAY  BACHRACH","88 W RIDGEWOOD AVE","RIDGEWOOD","NJ","07450","DENTAL","General Dentist"]
[null,593365515,1316141591,"FREDERICK S PRATT","10625 BIG BEND RD","RIVERVIEW","FL",33579,"DENTAL","General Dentist"]
[null,621804857,1881684462,"RODNEY D RUNYON","614 COMMONS DR","GALLATIN","TN",37066,"DENTAL","General Dentist"]
[null,472775825,1730476615,"AVRAHAM A WEINER","7300 CITY AVE RM 350","PHILADELPHIA","PA",19151,"DENTAL","General Dentist"]
[null,202076145,1255381513,"MICHAEL T DACHOWSKI","103 PROGRESS DR STE 102","DOYLESTOWN","PA",18901,"DENTAL","Oral Surgeon"]
[null,843626023,1629338611,"JORGE B MANCIA","1998 HENDERSONVILLE RD UNIT 31","ASHEVILLE","NC",28803,"DENTAL","Oral Surgeon"]
[null,274592809,1811696123,"EPIPHANY  FITZPATRICK","5597 TULIP ST STE B4","PHILADELPHIA","PA",19124,"DENTAL","General Dentist"]
[null,873569969,1295304624,"BRANDI M COYLE","44115 WOODRIDGE PKWY STE 280","LEESBURG","VA",20176,"DENTAL","General Dentist"]
[null,721395500,1518183060,"LAUREN S THURMON","3140 FLORIDA ST","BATON ROUGE","LA",70806,"DENTAL","General Dentist"]
[null,841349404,1942412879,"JENNY D FILTER","144 OLD STAGE RD UNIT A","SALIDA","CO",81201,"DENTAL","General Dentist"]
[null,582620829,1548365042,"JOHN M CLAGETT","89 TIPTON DR","DAHLONEGA","GA",30533,"DENTAL","General Dentist"]
[null,522343966,1376649426,"DARRIN C DAVIS","4805 YORK RD","BALTIMORE","MD",21212,"DENTAL","General Dentist"]
[null,814577349,1821146085,"TRYM H GIBBONS","12090 N THORNYDALE RD STE 106","MARANA","AZ",85658,"DENTAL","General Dentist"]
[null,521860379,1770999658,"SHEHZAD M SAJID","1615 TREE SAP CT STE A","SALISBURY","MD",21804,"DENTAL","Pediatric Dentist"]
[null,465453457,1447480983,"TIMOTHY B PRICE","2000 N UNION AVE","ROSWELL","NM",88201,"DENTAL","General Dentist"]
[null,582399375,1477573145,"SHANE E DOWNEY","221 N 4TH AVE","CHATSWORTH","GA",30705,"DENTAL","General Dentist"]
[null,231995431,1255594842,"DANA K CHIANESE","2301 E ALLEGHENY AVE STE 201","PHILADELPHIA","PA",19134,"DENTAL","Pediatric Dentist"]
[null,830885596,1407236631,"ATOUSA  SAFAVI","2101 S CLERMONT ST","DENVER","CO",80222,"DENTAL","General Dentist"]
[null,934456790,1528323102,"MICHAEL D GILLINS","120 SOUTH ST","BLUE HILL","ME","04614","DENTAL","Prosthodontist"]
[null,742837176,1104886563,"JOE O ROSENBERG","613 BROADWAY ST","LARNED","KS",67550,"DENTAL","General Dentist"]
[null,232502660,1568506012,"ROBERT W BERSTECHER","104 E MAIN ST","NEW HOLLAND","PA",17557,"DENTAL","General Dentist"]
[null,561919017,1831501386,"DANIEL J MACDONALD","9924 US HIGHWAY 311","ARCHDALE","NC",27263,"DENTAL","General Dentist"]
[null,593570970,1154543718,"CYNTHIA A MASI","18101 HIGHWOODS PRES PKWY #200","TAMPA","FL",33647,"DENTAL","General Dentist"]
[null,933080104,1003590985,"JHON  ANDRAOUS","1116 BICHARA BLVD","LADY LAKE","FL",32159,"DENTAL","General Dentist"]
[null,571032303,1003894478,"DUDLEY C BEATY","225 BROAD ST","BENNETTSVILLE","SC",29512,"DENTAL","General Dentist"]
[null,263583098,1386865285,"ANN MIHALKO MOONEY","8460 COOPER CREEK BLVD STE 103","UNIVERSITY PARK","FL",34201,"DENTAL","General Dentist"]
[null,203804223,1952979841,"CAROLINE  OUDIN","5106 MCCLANAHAN DR","NORTH LITTLE ROCK","AR",72116,"DENTAL","General Dentist"]
[null,202005420,1063703916,"ROBERT B SEMTNER","4370 STARKEY RD #1B","ROANOKE","VA",24018,"DENTAL","General Dentist"]
[null,460443496,1033896790,"HALEY L ROZEBOOM","4921 E 26TH ST SUITE 1","SIOUX FALLS","SD",57110,"DENTAL","General Dentist"]
[null,593356849,1619383981,"JOMAR  DIAZ NICOLAS","1079 ALAFAYA TRL STE 1213","OVIEDO","FL",32765,"DENTAL","General Dentist"]
[null,850791277,1144343880,"DANIEL  GARABADIAN","3275 MARKET PLACE BLVD STE 200","CUMMING","GA",30041,"DENTAL","Endodontist"]
[null,"010826551",1770195000,"STEVEN  DODSON","1216 PLEASANT VALLEY BLVD STE 1","ALTOONA","PA",16602,"DENTAL","General Dentist"]
[null,841104889,1902266497,"EMILY A SCIARRONE","9400 STATION ST STE 175","LONE TREE","CO",80124,"DENTAL","General Dentist"]
[null,219644153,1568731917,"DAVID H MORRA","198 THOMAS JOHNSON DR STE 105","FREDERICK","MD",21702,"DENTAL","General Dentist"]
[null,743037260,1174525448,"JOHN G FLETCHER","2600 E SOUTHERN AVE STE B2","TEMPE","AZ",85282,"DENTAL","General Dentist"]
[null,273051227,1154400463,"TODD A FLEISCHMAN","1608 WALNUT ST STE 1100","PHILADELPHIA","PA",19103,"DENTAL","General Dentist"]
[null,463442500,1356697361,"BRENDALIZ  BRISTOL-MARTIR","2550 S MAIN RD","VINELAND","NJ","08360","DENTAL","Pediatric Dentist"]
[null,934589572,1225328909,"EDWARD W STONESTREET","60 MARWOOD CIR","BOARDMAN","OH",44512,"DENTAL","General Dentist"]
[null,461637791,1437272192,"MARK N CHUA","21 KINGS CROSSING RD STE 107","WINTER PARK","CO",80482,"DENTAL","General Dentist"]
[null,232965911,1912046061,"JOSEPH  BOURDON","559 S HANOVER ST","CARLISLE","PA",17013,"DENTAL","General Dentist"]
[null,202588390,1396865705,"JASON P MAKOWSKI","220 BRIDGES RD","SIMPSONVILLE","SC",29681,"DENTAL","General Dentist"]
[null,232345050,1396907473,"GLENN J MILLER","130 ALMSHOUSE RD STE 500","RICHBORO","PA",18954,"DENTAL","General Dentist"]
[null,874668284,1477283646,"NICOLE E KURLBAUM","4461 INDIAN CREEK PKWY","OVERLAND PARK","KS",66207,"DENTAL","General Dentist"]
[null,844740452,1427406529,"LINA  YU","4270 ALOMA AVE STE 130","WINTER PARK","FL",32792,"DENTAL","General Dentist"]
[null,832460516,1144719444,"LIBBY  FINER","207 SE 23RD AVENUE","BOYNTON BEACH","FL",33435,"DENTAL","General Dentist"]
[null,592864897,1275575326,"MATTHEW LEE DAVIS","6120 WINKLER RD STE I","FORT MYERS","FL",33919,"DENTAL","General Dentist"]
[null,822616631,1972689511,"MELISSA  HAIDU","90 MAIN ST","TOPSHAM","ME","04086","DENTAL","General Dentist"]
[null,453820098,1871735274,"ELIZA  HAIMI","7 BOND ST STE 1D","GREAT NECK","NY",11021,"DENTAL","General Dentist"]
[null,823470772,1912300195,"SIMY PALUVELIL MATHEW","313 W BOOT RD","WEST CHESTER","PA",19380,"DENTAL","General Dentist"]
[null,710948021,1245329267,"JASON H DEBLINGER","65 E 79TH ST","NEW YORK","NY",10075,"DENTAL","General Dentist"]
[null,481154210,1548879604,"DAN Q NGUYEN","2700 E 30TH AVE","HUTCHINSON","KS",67502,"DENTAL","General Dentist"]
[null,881597371,1699185538,"JASON M WOOD","624 FRONT ST","GEORGETOWN","SC",29440,"DENTAL","Oral Surgeon"]
[null,521068151,1326398264,"JEFFREY S LEIGH","104 FORBES ST STE 104","ANNAPOLIS","MD",21401,"DENTAL","General Dentist"]
[null,541479649,1235200999,"MARJUN  AYATI","8316 ARLINGTON BLVD #226","FAIRFAX","VA",22031,"DENTAL","General Dentist"]
[null,811939902,1689179343,"WESTON C GRIMES","362 GIFFORD ST","FALMOUTH","MA","02540","DENTAL","General Dentist"]
[null,813113914,1205722444,"SKYLAR  MAI","1616 N US HWY 45","COLUMBUS","MS",39705,"DENTAL","General Dentist"]
[null,562276556,1578055679,"PAUL  LEE","100 OSTERVILLE DR","HOLLY SPRINGS","NC",27540,"DENTAL","Oral Surgeon"]
[null,873808942,1154632354,"KAUSHAL PRAVIN KAPADIA","35 CINEMA DR","YORK","PA",17402,"DENTAL","General Dentist"]
[null,561801617,1427052950,"BRYAN R NEUWIRTH","261 18TH STREET CIR SE","HICKORY","NC",28602,"DENTAL","Oral Surgeon"]
[null,871736094,1326120239,"ERIC  DAVIS","5111 NC HIGHWAY 55 STE 102","DURHAM","NC",27713,"DENTAL","General Dentist"]
[null,200120892,1932761533,"PAUL  KOLMAN","3915 W LINCOLN HWY","DOWNINGTOWN","PA",19335,"DENTAL","Pediatric Dentist"]
[null,232592368,1346246121,"BERNARD J WUJCIK","4318 LINCOLN HWY","YORK","PA",17406,"DENTAL","General Dentist"]
[null,161499547,1417186552,"JASON A CREPS","8875 PORTER RD STE 1","NIAGARA FALLS","NY",14304,"DENTAL","General Dentist"]
[null,521004466,1346369501,"B A TRATTNER","8 RESERVOIR CIR STE 102","BALTIMORE","MD",21208,"DENTAL","Endodontist"]
[null,"042510564",1154622710,"MICHELLE A DEMPSEY","1340 BOYLSTON ST 6TH FLOOR","BOSTON","MA","02215","DENTAL","General Dentist"]
[null,272702993,1598805608,"FRANKLYN  SCOTT","401 COMMERCE DR STE 204","FORT WASHINGTON","PA",19034,"DENTAL","Oral Surgeon"]
[null,474934756,1881901866,"NICK KARANG KHALILKHANI","111 S PRESTON RD STE 50","PROSPER","TX",75078,"DENTAL","Endodontist"]
[null,821105930,1174882088,"EUNHAE  PARK-HYUN","3734 CARMAN RD","SCHENECTADY","NY",12303,"DENTAL","General Dentist"]
[null,272237292,1659752590,"JENNY J RHEE","7671 QUARTERFIELD ROAD #400","GLEN BURNIE","MD",21061,"DENTAL","Pediatric Dentist"]
[null,842375028,1881214807,"SE'QUON MAURICE HARRY SCOTT","4205 N POINT PKWY STE A","ALPHARETTA","GA",30022,"DENTAL","Periodontist"]
[null,200185918,1568989564,"YISMAE  HERNANDEZ","10610 COLONIAL BLVD","FORT MYERS","FL",33913,"DENTAL","General Dentist"]
[null,262775992,1780230912,"WENYONG  DAI","323 BOSTON POST RD","SUDBURY","MA","01776","DENTAL","General Dentist"]
[null,475640102,1881858991,"CORNELIUS L YEN","13630 MAPLE AVE STE 2E","FLUSHING","NY",11355,"DENTAL","General Dentist"]
[null,273290843,1982853941,"ANNA M FINKLER","4 RESERVOIR CIR STE 100","BALTIMORE","MD",21208,"DENTAL","General Dentist"]
[null,461158725,1841781754,"ANAM  TARIQ","8 PONDS EDGE DR STE 2","CHADDS FORD","PA",19317,"DENTAL","General Dentist"]
[null,260767122,1831458215,"KATE DANOFF GEFT","4933 LITTLE NECK PKWY","LITTLE NECK","NY",11362,"DENTAL","General Dentist"]
[null,832908984,1912376203,"JOSHUA  DEBELLAS","1212 NORTH ST","JIM THORPE","PA",18229,"DENTAL","General Dentist"]
[null,204972796,1215016589,"DENISE  TURNER FURBER","1659 N CLYDE MORRIS BLVD","DAYTONA BEACH","FL",32117,"DENTAL","General Dentist"]
[null,464535551,1386824431,"NICOLE  MILLER","1251 S CEDR CRT BLVD STE 312","ALLENTOWN","PA",18103,"DENTAL","General Dentist"]
[null,260357554,1760094353,"PETROS  ZACHAROPOULOS","1128 W MAIN ST","INVERNESS","FL",34450,"DENTAL","General Dentist"]
[null,391398925,1649791039,"NATALIE K DARAR","2600 N MAYFAIR RD STE 750","WAUWATOSA","WI",53226,"DENTAL","General Dentist"]
[null,570925251,1568693877,"JEFFREY  AYCOCK","4450 HIGHWAY 17 BYPASS","MURRELLS INLET","SC",29576,"DENTAL","Oral Surgeon"]
[null,862275735,1942432729,"SCOTT C DICKINSON","1711 E NINE MILE RD","PENSACOLA","FL",32514,"DENTAL","General Dentist"]
[null,464158569,1962506014,"CHRISTOPHER M PELLEGRINO","20 DOWNER AVE STE 2","HINGHAM","MA","02043","DENTAL","General Dentist"]
[null,454639611,1013128966,"GARY  SAPIENZA","4325 HADDONFIELD RD","PENNSAUKEN","NJ","08109","DENTAL","General Dentist"]
[null,473903147,1437225919,"JOHN W MCGEHEE","1311 QUARRIER ST","CHARLESTON","WV",25301,"DENTAL","General Dentist"]
[null,822910247,1740919596,"YASAMAN  JAVDAN","2226 OTAY LAKES RD STE C","CHULA VISTA","CA",91915,"DENTAL","General Dentist"]
[null,475428684,1972913374,"JULIA C NGUYEN","6021 UNIVERSITY BLVD STE 170","ELLICOTT CITY","MD",21043,"DENTAL","Endodontist"]
[null,409969032,1205909199,"ALAN M STEVENS","480 SUNCREST DR AT I 181","GRAY","TN",37615,"DENTAL","General Dentist"]
[null,521910382,1154548543,"GREGG T BEHLING","1507 RITCHIE HWY STE 201","ARNOLD","MD",21012,"DENTAL","Pediatric Dentist"]
[null,861082980,1861129355,"GURINDER  SINGH","4053 E MORADA LN","STOCKTON","CA",95212,"DENTAL","General Dentist"]
[null,921234085,1356791446,"KATIE L RIESENBERG","512 HWY 17 N","N MYRTLE BEACH","SC",29582,"DENTAL","General Dentist"]
[null,810640587,1780830893,"RONALD N HINKEL","1435 UNION ST","LAFAYETTE","IN",47904,"DENTAL","General Dentist"]
[null,262210603,1598963100,"ALINA  CRETU","100 SUTTER DR STE 106","SURFSIDE BEACH","SC",29575,"DENTAL","General Dentist"]
[null,431790061,1144881533,"ASHLEY M RHODES","3608 JEFFCO BLVD","ARNOLD","MO",63010,"DENTAL","General Dentist"]
[null,861789282,1548358948,"ANN L HUNSICKER","1213 MAIN ST","HELLERTOWN","PA",18055,"DENTAL","General Dentist"]
[null,825010620,1700307659,"JOSEPH  SCHWIMMER","1115 ARNOLD AVE","POINT PLEASANT BORO","NJ","08742","DENTAL","General Dentist"]
[null,"061220055",1316928278,"ROLAND H LUPIEN","100 AVERILL RD STE 3","POMFRET CTR","CT","06259","DENTAL","General Dentist"]
[null,813708158,1831399666,"AJAMU A GISCOMBE","3921 SUNSET RIDGE RD STE 303","RALEIGH","NC",27607,"DENTAL","General Dentist"]
[null,822900322,1952696916,"MELANIE YEAGER HOLDEN","4044 SAWYER RD","SARASOTA","FL",34233,"DENTAL","General Dentist"]
[null,874521871,1912313198,"JESSICA L STARK","319 W MCLANE ST #1","OSCEOLA","IA",50213,"DENTAL","General Dentist"]
[null,570370242,1356504997,"JAMIE Y DRIGGERS","555 EAST CHEVES ST","FLORENCE","SC",29506,"DENTAL","General Dentist"]
[null,592332536,1083933022,"CHRISTOPHER P MALY","168 14TH ST SW STE B","LARGO","FL",33770,"DENTAL","Oral Surgeon"]
[null,861759357,1205638129,"KENT  HA","100 S MACDADE BLVD","GLENOLDEN","PA",19036,"DENTAL","General Dentist"]
[null,"061020935",1538204243,"CRAIG M TINI","215 SUFFIELD VLG","SUFFIELD","CT","06078","DENTAL","General Dentist"]
[null,900742664,1134609829,"SHAWN A MITCHELL","1480 QUARTERPATH RD STE 2A","WILLIAMSBURG","VA",23185,"DENTAL","General Dentist"]
[null,832207274,1164531323,"ALEXANDER  BOKSER","21-34 30TH AVENUE","ASTORIA","NY",11102,"DENTAL","General Dentist"]
[null,845110446,1407873466,"STACEY A YANDOLI","125 WHITE HORSE PIKE","HADDON HEIGHTS","NJ","08035","DENTAL","Pediatric Dentist"]
[null,861122251,1235321415,"JOHN C HOUSER","7100 HERITAGE VILLAGE PLZ STE 101","GAINESVILLE","VA",20155,"DENTAL","General Dentist"]
[null,391252499,1427638170,"ARDIT  HAXHIA","2353 S RIDGE RD STE 1","GREEN BAY","WI",54304,"DENTAL","Oral Surgeon"]
[null,465363595,1003256868,"GLADSTON  SILVA","1913 N CLYDE MORRIS BLVD STE 130","DAYTONA BEACH","FL",32117,"DENTAL","General Dentist"]
[null,232738748,1548288798,"KAREN A PATENAUDE","2030 W TILGHMAN ST SU 109","ALLENTOWN","PA",18104,"DENTAL","General Dentist"]
[null,203346239,1033243985,"TODD J FEDDOCK","1887 LITITZ PIKE STE 4","LANCASTER","PA",17601,"DENTAL","General Dentist"]
[null,412184230,1457480105,"RENE M POLIS","3534 RHOADS AVE","NEWTOWN SQUARE","PA",19073,"DENTAL","General Dentist"]
[null,455065037,1013479161,"TAMMY S AUYEUNG","2419 OCEAN AVE STE A","SAN FRANCISCO","CA",94127,"DENTAL","General Dentist"]
[null,833643900,1174938294,"MICHAEL A MERKLEY","6025 S SUNBURY RD","WESTERVILLE","OH",43081,"DENTAL","General Dentist"]
[null,133579806,1225290885,"KEITH J LUSTMAN","750 PARK AVE STE 1A- 1B","NEW YORK","NY",10021,"DENTAL","Oral Surgeon"]
[null,993706714,1588195838,"GREGORY T SPENCER","207 SOUTHDOWNE DR","MARYVILLE","TN",37801,"DENTAL","General Dentist"]
[null,861192891,1649622945,"WAISE OMID EBRAHIMI","841 BROADWAY","NEW YORK","NY",10003,"DENTAL","General Dentist"]
[null,933252772,1629033824,"STEVEN C HUDSON","2317 WHITESBURG DR SE","HUNTSVILLE","AL",35801,"DENTAL","Oral Surgeon"]
[null,208672835,1437369493,"EUGENE K OLSEN","9055 CRESSWIND BLVD STE 100","CHARLOTTE","NC",28215,"DENTAL","General Dentist"]
[null,453776645,1427333822,"MICHAEL K SETTER","5320 S MACADAM AVE STE 200","PORTLAND","OR",97239,"DENTAL","Periodontist"]
[null,205011711,1073709986,"JAMES  SPARAGA","271 MAIN STREET","MACHIAS","ME","04654","DENTAL","General Dentist"]
[null,273555364,1336300797,"CALLAN D WHITE","1011 TUNNEL RD STE 140","ASHEVILLE","NC",28805,"DENTAL","General Dentist"]
[null,521674210,1811575285,"AMIR M TAHA","412 1ST ST SE","WASHINGTON","DC",20003,"DENTAL","General Dentist"]
[null,883271590,1992105050,"RAHAT  SOOD","1664 VILLAGE GRN","CROFTON","MD",21114,"DENTAL","General Dentist"]
[null,204376918,1235423765,"CHELSEA TUCKER FARRELL","969 E DEL WEBB BLVD","SUN CITY CENTER","FL",33573,"DENTAL","General Dentist"]
[null,842364077,1144865445,"LAURENCE P EGGART","100 EXECUTIVE PARK","ASHEVILLE","NC",28801,"DENTAL","General Dentist"]
[null,833015514,1962836031,"MARK T EVANS","7205 S 51ST AVE STE 104","LAVEEN","AZ",85339,"DENTAL","General Dentist"]
[null,992271701,1013697507,"NICOLE  STELIOTES","2699 1ST AVE N","SAINT PETERSBURG","FL",33713,"DENTAL","General Dentist"]
[null,931844492,1013403666,"SHAHEEN  SHAFAGH","2 S ORANGE ST MEDIA","MEDIA","PA",19063,"DENTAL","General Dentist"]
[null,465342063,1497449409,"KENDALL  PECK","501 ANGLERS DR STE 102","STEAMBOAT SPRINGS","CO",80487,"DENTAL","General Dentist"]
[null,471706456,1538858147,"CARLIS  SANTIAGO","13050 TAMIAMI TRL E","NAPLES","FL",34114,"DENTAL","General Dentist"]
[null,320514923,1467515049,"HAKAN O KOYMEN","3400 BOX HILL CORPORATE CENTER DR STE 120","ABINGDON","MD",21009,"DENTAL","Pediatric Dentist"]
[null,562185627,1336238690,"NICOLE K WILLIAMS","31 OLEANDER DR","CLAYTON","NC",27527,"DENTAL","General Dentist"]
[null,201527153,1922196211,"QUAN V LE","2946 SLEEPY HOLLOW RD STE 1B","FALLS CHURCH","VA",22044,"DENTAL","General Dentist"]
[null,814250628,1720349178,"DRAYTON L SMITH","1990 SPROUL RD","BROOMALL","PA",19008,"DENTAL","General Dentist"]
[null,743089590,1063134476,"ANDREW M MAIMONE","23659 COLUMBUS RD STE 1","COLUMBUS","NJ","08022","DENTAL","General Dentist"]
[null,820690463,1609300268,"ANDRES R KAINDL","2605 12TH PL SE","SALEM","OR",97302,"DENTAL","Periodontist"]
[null,204435726,1356494330,"RAFAEL D MORALES","1590 NW 10TH AVE STE 200","BOCA RATON","FL",33486,"DENTAL","General Dentist"]
[null,262271158,1871810846,"NAM S CHO","550 W DUARTE RD STE 7","ARCADIA","CA",91007,"DENTAL","Oral Surgeon"]
[null,831414846,1437258019,"ARTO J BOYAJIAN","6206 W 87TH ST","LOS ANGELES","CA",90045,"DENTAL","General Dentist"]
[null,561937780,1336679737,"ANDREW N TROUPES","17097 US HIGHWAY 17","HAMPSTEAD","NC",28443,"DENTAL","General Dentist"]
[null,561937780,1831362052,"MONICA M PIERPAN","17097 US HIGHWAY 17","HAMPSTEAD","NC",28443,"DENTAL","General Dentist"]
[null,825069464,1720392491,"BANSI TARUNKANT DOESCHER","1500 JOHN F KENNEDY BLVD STE 1906","PHILADELPHIA","PA",19102,"DENTAL","General Dentist"]
[null,221915422,1225069578,"DOMENIC  CAPRICE","1117 HIGHWAY 77 STE D","BRIDGETON","NJ","08302","DENTAL","Oral Surgeon"]
[null,221915422,1598986770,"MICHAEL C PALMA","1318 SOUTH MAIN RD BLDG 4B","VINELAND","NJ","08360","DENTAL","Oral Surgeon"]
[null,833267303,1114111820,"PHILLIP  CHO","56969 YUCCA TRL STE C","YUCCA VALLEY","CA",92284,"DENTAL","General Dentist"]
[null,521766591,1912099722,"ROLANDO  NARAVAL","9690 DEERECO RD STE 120","TIMONIUM","MD",21093,"DENTAL","General Dentist"]
[null,991871464,1548011125,"ZACHARY  PETTORUTO","2003 CONCORD PIKE","WILMINGTON","DE",19803,"DENTAL","General Dentist"]
[null,821903009,1316629520,"JOON  SON","513 CROSS KEYS RD","SICKLERVILLE","NJ","08081","DENTAL","General Dentist"]
[null,473101368,1922204502,"JOHN J WASNIEWSKI","262 FOXHUNT DR","BEAR","DE",19701,"DENTAL","General Dentist"]
[null,200445119,1861842999,"VILMA A TRIMARCHI","890 N COURT ST","MEDINA","OH",44256,"DENTAL","General Dentist"]
[null,201714938,1568546927,"AMANDEEP D SANDHU","767 CYPRESS VILLAGE BLVD","SUN CITY CENTER","FL",33573,"DENTAL","General Dentist"]
[null,851270181,1841615101,"SAPAN  BHATT","23 MAIN ST HILL","DEXTER","ME","04930","DENTAL","General Dentist"]
[null,872090981,1962567800,"CLINTON M WATSON","3298 NORTHSIDE DR","MACON","GA",31210,"DENTAL","General Dentist"]
[null,993123146,1649023250,"SANDEEP  KONDA","420 E ORANGE ST","SHIPPENSBURG","PA",17257,"DENTAL","General Dentist"]
[null,831670256,1396531281,"XIAOJING  FAN","1765 DUNLAWTON AVE STE 103","PORT ORANGE","FL",32127,"DENTAL","General Dentist"]
[null,882254266,1326038951,"MICHAEL R JOHNSON","1419 PARKWAY STE 1","SEVIERVILLE","TN",37862,"DENTAL","General Dentist"]
[null,200185918,1518319953,"SHRUTI  CHOPRA","210 MARKETSIDE AVE STE 1","PONTE VEDRA","FL",32081,"DENTAL","General Dentist"]
[null,"010551213",1497905855,"FARHAD  FOROUGHI","8780 E STATE ROAD 70 STE 102","BRADENTON","FL",34202,"DENTAL","General Dentist"]
[null,411858421,1386808558,"MARK J STANLEY","9680 TAMARACK RD STE 120","WOODBURY","MN",55125,"DENTAL","Pediatric Dentist"]
[null,270623575,1730118647,"PATRICK P LOTFI","14605 POTOMAC BRANCH DR STE 120","WOODBRIDGE","VA",22191,"DENTAL","General Dentist"]
[null,823674724,1396866588,"LINO  DASTI","301 DAWSON ST","MOORESTOWN","NJ","08057","DENTAL","General Dentist"]
[null,472808085,1609967975,"LOUIS V GUARIGLIA","111 EAST AVE STE 200","NORWALK","CT","06851","DENTAL","General Dentist"]
[null,582299965,1447311311,"THOMAS F ROLLAR","630 SINGLETON RIDGE RD","CONWAY","SC",29526,"DENTAL","Oral Surgeon"]
[null,992973101,1023465663,"MRUNAL  PATEL","1900 MOUNT HOLLY RD STE 2C","BURLINGTON","NJ","08016","DENTAL","General Dentist"]
[null,582409375,1831296292,"SERGIO J PAUSA","4895 WINDWARD PKWY STE 102","ALPHARETTA","GA",30004,"DENTAL","Oral Surgeon"]
[null,821804138,1376075291,"JEREMY B ROSENFELD","9419 COMMON BROOK RD STE 218","OWINGS MILLS","MD",21117,"DENTAL","General Dentist"]
[null,450518875,1689350183,"CHRISTOPHER J NICOLOSI","345 E MAIN ST","TUCKERTON","NJ","08087","DENTAL","General Dentist"]
[null,270607871,1457431629,"RYAN D TSCHETTER","1124 S COLLEGE MALL RD","BLOOMINGTON","IN",47401,"DENTAL","General Dentist"]
[null,475276588,1295762490,"BRIAN C LEE","211 WASHINGTON HEIGHTS MED CTR","WESTMINSTER","MD",21157,"DENTAL","General Dentist"]
[null,542015717,1548487549,"MELISSA L WOLFE","18 HAGGERTY LN STE 104","STAUNTON","VA",24401,"DENTAL","General Dentist"]
[null,263030279,1437837465,"BRANDON  SIROCHINSKY","2000 CLEMENTS BRIDGE RD STE 117 A","DEPTFORD","NJ","08096","DENTAL","General Dentist"]
[null,233095753,1770998023,"MIMI M JEON","1601 WALNUT ST STE 1302","PHILADELPHIA","PA",19102,"DENTAL","General Dentist"]
[null,621573303,1447232830,"JOHN K SHEA","131 INDIAN LAKE BLVD STE 100","HENDERSONVILLE","TN",37075,"DENTAL","Oral Surgeon"]
[null,931446849,1477610509,"NAIDA L SINGLETON","500 E MAIN ST","BENNETTSVILLE","SC",29512,"DENTAL","General Dentist"]
[null,464184546,1477831691,"BRYAN A GAME","3750 SAVANNAH HWY B","JOHNS ISLAND","SC",29455,"DENTAL","General Dentist"]
[null,822995723,1184859506,"ALEXANDER B KRASNE","561 OLD COUNTY HOME RD","ASHEVILLE","NC",28806,"DENTAL","General Dentist"]
[null,995096105,1013585330,"TYLER  AUSTIN","614 SICKLERVILLE RD","WILLIAMSTOWN","NJ","08094","DENTAL","General Dentist"]
[null,853644707,1922644996,"BASHAR  GHOUJAL","106 HIGH POINT CTR STE 100","COLCHESTER","VT","05446","DENTAL","Prosthodontist"]
[null,753125159,1750449302,"GEORGE L LEONAKIS","371 S ROOP ST","CARSON CITY","NV",89701,"DENTAL","General Dentist"]
[null,201505154,1508864745,"TIMOTHY P PASSARELLO","6200 GEORGETOWN BLVD","ELDERSBURG","MD",21784,"DENTAL","General Dentist"]
[null,203998771,1710619036,"HEMAKSHI VIJAY PATIDAR","1000 JOHNSON FERRY RD STE A-100","MARIETTA","GA",30068,"DENTAL","General Dentist"]
[null,550791579,1093803413,"LAVOYGER E GIES","9179 GRISSOM RD STE 137","SAN ANTONIO","TX",78251,"DENTAL","General Dentist"]
[null,453085759,1497826960,"KALISHA  JORDAN","302 BULIFANTS BLVD STE 102","WILLIAMSBURG","VA",23188,"DENTAL","Endodontist"]
[null,392408375,1245868777,"MINA ISAC EZZAT YACOUB YACOUB","606 E MARSHALL ST STE 202","WEST CHESTER","PA",19380,"DENTAL","General Dentist"]
[null,821422802,1497278030,"LAURA A KOBERDA","99 DR M L KING JR ST N","SAINT PETERSBURG","FL",33701,"DENTAL","General Dentist"]
[null,464220149,1225270598,"BRADLEY N ADKINS","2319 GRACE AVE","NEW BERN","NC",28562,"DENTAL","General Dentist"]
[null,474258727,1740621390,"JENIFER RENEE NICHOLS","2650 FIREWHEEL DR","FLOWER MOUND","TX",75028,"DENTAL","General Dentist"]
[null,812372798,1528291689,"HELENE S SHAPIRO","6015 YORK RD","BALTIMORE","MD",21212,"DENTAL","General Dentist"]
[null,237047824,1356630552,"ELIZABETH A POLECK","601 NEW CASTLE AVE","WILMINGTON","DE",19801,"DENTAL","General Dentist"]
[null,208426308,1134673288,"TINA  REN","1471 JOHNS LAKE RD STE 1","CLERMONT","FL",34711,"DENTAL","Endodontist"]
[null,205755965,1790092468,"J JEFFREY  YBARGUEN","3399 MERLIN DRIVE","IDAHO FALLS","ID",83404,"DENTAL","General Dentist"]
[null,194569733,1912051186,"JULIETTE A MURCKO","4106 PENN AVE","PITTSBURGH","PA",15224,"DENTAL","General Dentist"]
[null,821049129,1619130788,"VALERIE N BYRNSIDE","1209 INDEPENDENCE BLVD STE 101","VIRGINIA BEACH","VA",23455,"DENTAL","Oral Surgeon"]
[null,881764372,1063942241,"NITYA  REDDY","5001 LIBBIE MILL EAST BLVD STE 125","RICHMOND","VA",23230,"DENTAL","Periodontist"]
[null,593703943,1851340426,"THOMAS L BOWERS","2023 W OLD US HIGHWAY 441","MOUNT DORA","FL",32757,"DENTAL","Oral Surgeon"]
[null,460557812,1821347782,"GRANT G MCKINLEY","2 PARK LANE STE 302","HILTON HEAD ISLAND","SC",29928,"DENTAL","General Dentist"]
[null,463833819,1205045267,"ARINDAM  KAKKAR","117 GRAND AV","HACKETTSTOWN","NJ","07840","DENTAL","General Dentist"]
[null,262953796,1174606172,"CHRISTOPHER R REBOL","69 MCDOWELL ST","ASHEVILLE","NC",28801,"DENTAL","General Dentist"]
[null,474982361,1386634053,"PRABHPREET SINGH KAILA","435 4TH AVE","SAN DIEGO","CA",92101,"DENTAL","General Dentist"]
[null,611945051,1821401712,"LESLIE  TREHERNE-FAYTON","3875 CONLON WAY STE A","ELIZABETH CITY","NC",27909,"DENTAL","General Dentist"]
[null,470998505,1467000422,"AMRUTA A BAHEKAR","300 GLENSFORD DR SUITE 103","FAYETTEVILLE","NC",28314,"DENTAL","General Dentist"]
[null,822932049,1073874160,"MICHEL  OBAID","1131 W EMAUS AVE","ALLENTOWN","PA",18103,"DENTAL","General Dentist"]
[null,881224580,1609938828,"THERESA  CINIGLIO-SMITH","10101 ACADEMY RD FL 2","PHILADELPHIA","PA",19114,"DENTAL","Periodontist"]
[null,831155089,1316439656,"CHELSEA H ARTHUR","710 N ELM ST","HIGH POINT","NC",27262,"DENTAL","General Dentist"]
[null,832419715,1285163667,"GEIDYS  PEREZ","1501 N US HIGHWAY 441 STE 1302","THE VILLAGES","FL",32159,"DENTAL","General Dentist"]
[null,274762111,1770214280,"JOSHUA W IRBY","410 MINERAL ST","SOUTH BOSTON","VA",24592,"DENTAL","General Dentist"]
[null,200294969,1770541971,"MOHAMED L SACCOH","413 PULASKI HWY STE 107","JOPPA","MD",21085,"DENTAL","General Dentist"]
[null,272620863,1518253970,"BRAD A LENTZ","3719 OLD FOREST RD","LYNCHBURG","VA",24501,"DENTAL","General Dentist"]
[null,332403258,1992963706,"BENJAMIN J LAGO","1900 WHITES RD STE 3","KALAMAZOO","MI",49008,"DENTAL","Oral Surgeon"]
[null,"014701530",1548519598,"CHELSEA  TOUSSAINT","1750 POST RD","WELLS","ME","04090","DENTAL","General Dentist"]
[null,159402259,1518008093,"KEVAN S GREEN","215 E BALTIMORE AVE","CLIFTON HEIGHTS","PA",19018,"DENTAL","Periodontist"]
[null,231949084,1336229004,"MORRIS B ROSEN","2137 WELSH RD STE 3C","PHILADELPHIA","PA",19115,"DENTAL","General Dentist"]
[null,870975587,1598855538,"ERIC  GREENHALGH","610 COMMERCIAL AVE","ANACORTES","WA",98221,"DENTAL","General Dentist"]
[null,853839679,1447373113,"LEE N SHELDON","2223 SARNO RD","MELBOURNE","FL",32935,"DENTAL","General Dentist"]
[null,770417764,1932851854,"EDWARD W KWIATKOWSKI","880 CASS ST STE 207","MONTEREY","CA",93940,"DENTAL","General Dentist"]
[null,851053254,1104479120,"MOHAMMED F NASER","2851 HENLEY RD UNIT 303-304","GREEN COVE SPRINGS","FL",32043,"DENTAL","General Dentist"]
[null,453344047,1891838421,"JASON B KARNS","230 BUTLER RD","FREDERICKSBURG","VA",22405,"DENTAL","General Dentist"]
[null,263715531,1710055181,"JAMES C JOHNSON","3606 MEDICAL PARK CT","MOREHEAD CITY","NC",28557,"DENTAL","General Dentist"]
[null,270368294,1043521818,"NICOLE BEGAR FULP","215 MAGNOLIA DR N","TIFTON","GA",31794,"DENTAL","General Dentist"]
[null,201990392,1760494769,"THOMAS G SMITH","210 MEADOW VIEW BLVD","SUFFOLK","VA",23435,"DENTAL","General Dentist"]
[null,592886315,1659420115,"FORREST R JERKINS","3360 US HIGHWAY 441/27","FRUITLAND PARK","FL",34731,"DENTAL","General Dentist"]
[null,994059042,1679293617,"STEPHEN PHILLIP CLARK","6921 ANNAPOLIS RD","LANDOVER HILLS","MD",20784,"DENTAL","General Dentist"]
[null,330297180,1912194663,"CAROL ANN  BERG","72405 PARKVIEW DR STE B","PALM DESERT","CA",92260,"DENTAL","General Dentist"]
[null,474277343,1336402130,"MICHAEL JESSE GEIGER","6069 CORAL RIDGE DR","CORAL SPRINGS","FL",33076,"DENTAL","General Dentist"]
[null,"010461058",1649260936,"LAURA  REIDY","20 PENN PLZ STE 32","BANGOR","ME","04401","DENTAL","Periodontist"]
[null,223625570,1861857633,"VU DANG  LA","1416 BRACE RD","CHERRY HILL","NJ","08034","DENTAL","Periodontist"]
[null,471051113,1407090814,"JONATHAN  KIM","2416 CARSON ST","LAKEWOOD","CA",90712,"DENTAL","General Dentist"]
[null,271557070,1699973800,"CRAIG L MILBURN","418 MAIN ST STE C","NORTH MYRTLE BEACH","SC",29582,"DENTAL","General Dentist"]
[null,831433343,1689238222,"EARVIN  GARIBALDI BERNUIL","625 N DUPONT BLVD","MILFORD","DE",19963,"DENTAL","General Dentist"]
[null,200185918,1114755816,"RANDY  LOPEZ","42031 CYPRESS PKWY UNIT 6","PUNTA GORDA","FL",33982,"DENTAL","General Dentist"]
[null,200185918,1659118990,"SUMAN  RAGHAVAN","149 TUSCAN WAY","SAINT AUGUSTINE","FL",32092,"DENTAL","General Dentist"]
[null,311500034,1376748251,"HEATHER S WRIGHT","904 LILY CREEK RD STE 101","LOUISVILLE","KY",40243,"DENTAL","General Dentist"]
[null,263975070,1598400038,"ROPAFADZO GRACE MATANGIRA","3338 US HIGHWAY 19","HOLIDAY","FL",34691,"DENTAL","General Dentist"]
[null,810471966,1558428086,"JOSHUA L GREEN","2825 CONNERY WAY","MISSOULA","MT",59808,"DENTAL","General Dentist"]
[null,934220112,1124134465,"JOHN D BECKWITH","485 AMWELL RD","HILLSBOROUGH","NJ","08844","DENTAL","General Dentist"]
[null,814704599,1063074714,"LAVELL P ROBINSON","4274 N EAGLE RD","BOISE","ID",83713,"DENTAL","General Dentist"]
[null,853650172,1649646795,"KIP R NIELSEN","17061 N AVENUE OF THE ARTS STE 101","SURPRISE","AZ",85378,"DENTAL","General Dentist"]
[null,853224909,1639962962,"JEFF T STOLK","153 WORTH GUARD RD","COINJOCK","NC",27923,"DENTAL","General Dentist"]
[null,830981219,1326667262,"CHLOE  TSANG","330 HUDSON ST","NEW YORK","NY",10013,"DENTAL","General Dentist"]
[null,232502122,1477684272,"ROBERT JOSEPH GIORDANO","2530 S BROAD ST","PHILADELPHIA","PA",19145,"DENTAL","General Dentist"]
[null,392798621,1942360482,"ROBERT D LAZAROFF","3017 NEWCASTLE LOOP","MYRTLE BEACH","SC",29588,"DENTAL","General Dentist"]
[null,364271142,1477284354,"FAISAL R SAADOON","10 W PHILLIP RD STE 105","VERNON HILLS","IL",60061,"DENTAL","General Dentist"]
[null,232156206,1275150559,"ALEXA N SPENNATO","601 WILLIAMSBURG DR","BROOMALL","PA",19008,"DENTAL","General Dentist"]
[null,232708126,1235157785,"STEVEN MARK RICHMOND","6801 RIDGE AVE","PHILADELPHIA","PA",19128,"DENTAL","General Dentist"]
[null,921642879,1053815282,"FAWAZ  SHIHADEH","5611 94TH ST STE LN","ELMHURST","NY",11373,"DENTAL","Pediatric Dentist"]
[null,455473033,1518575117,"ASTHA  DESAI","500 INDEPENDENCE BLVD","SICKLERVILLE","NJ","08081","DENTAL","General Dentist"]
[null,821914312,1578045159,"CARLOS  BERNAL","1505 E RIO GRANDE ST STE 120","VICTORIA","TX",77901,"DENTAL","General Dentist"]
[null,651035483,1770885436,"JACINTA  LAMONTAGNE","1500 SE 17TH ST STE 400","OCALA","FL",34471,"DENTAL","General Dentist"]
[null,331282709,1891853867,"DAVID R ENGLEHART","220 REGENT CT STE D","STATE COLLEGE","PA",16801,"DENTAL","General Dentist"]
[null,311624889,1508813049,"MARK A CONNER","45 N PLAZA BLVD","CHILLICOTHE","OH",45601,"DENTAL","General Dentist"]
[null,205578381,1740269463,"SANG M LEE","130 POST AVE UNT 3","WESTBURY","NY",11590,"DENTAL","General Dentist"]
[null,843152447,1518170166,"JASON P GROFF","181 ANDRIEUX ST STE 104","SONOMA","CA",95476,"DENTAL","General Dentist"]
[null,200185918,1255782629,"ROSHNI ROHITKUMAR PATEL","1384 SW ST. LUCIE WEST BLVD","PORT SAINT LUCIE","FL",34986,"DENTAL","General Dentist"]
[null,832884562,1649707316,"YARON  SHVETS","7002 MENCHACA RD STE 100","AUSTIN","TX",78745,"DENTAL","General Dentist"]
[null,810576238,1134324783,"TIMOTHY S GULDEMOND","143 STATE ST NO 1","NEWBURYPORT","MA","01950","DENTAL","General Dentist"]
[null,270329272,1558418582,"LILLIANA L STOJIC","1801 PROFESSIONAL DR","SACRAMENTO","CA",95825,"DENTAL","General Dentist"]
[null,830784314,1740365139,"ZACHARY T ETZKORN","16562 N DALE MABRY HWY","TAMPA","FL",33618,"DENTAL","General Dentist"]
[null,204136907,1194210344,"KAYNAAT  SINGH","2012 S TOLLGATE RD STE 110","BEL AIR","MD",21015,"DENTAL","General Dentist"]
[null,134203958,1720126162,"THOMAS  FLEMING","1312 GREGORY DR","ROANOKE RAPIDS","NC",27870,"DENTAL","General Dentist"]
[null,331325671,1134227036,"LYNNETTE  MESINA","19 MORRIS AVE","BRYN MAWR","PA",19010,"DENTAL","General Dentist"]
[null,462956339,1295564656,"ALEXIS  WILLIS","718 N BROAD ST","CAIRO","GA",39828,"DENTAL","General Dentist"]
[null,863970018,1982198958,"VICTORIA A BLACKHURST","664 EXTON CMNS","EXTON","PA",19341,"DENTAL","General Dentist"]
[null,843051844,1356077085,"EDWARD ANTHONY SENULES","10160 HIGHWAY 242 STE 100","CONROE","TX",77385,"DENTAL","General Dentist"]
[null,922570045,1184852915,"REBECCA  LALIBERTE","2467 ATLANTIC HWY","WARREN","ME","04864","DENTAL","General Dentist"]
[null,204214046,1942372065,"DANIEL  HEARD","2400 CRESTWOOD RD STE 205","NORTH LITTLE ROCK","AR",72116,"DENTAL","General Dentist"]
[null,222135466,1689945198,"JOSHUA  AUSTEIN","88 W RIDGEWOOD AVE","RIDGEWOOD","NJ","07450","DENTAL","General Dentist"]
[null,471706456,1205394376,"CARLA  LEON RODRIGUEZ","1195 TAMIAMI TRL N","NOKOMIS","FL",34275,"DENTAL","General Dentist"]
[null,852409034,1225017023,"ROBERT H BARROWS","2170 SAVANNAH HWY","CHARLESTON","SC",29414,"DENTAL","General Dentist"]
[null,593540702,1073601456,"RICHARD  GARCIA","7385 RADIO RD STE 103","NAPLES","FL",34104,"DENTAL","General Dentist"]
[null,822430338,1912380577,"MASON R DUFF","10670 DEAN MARTIN DR STE 100","LAS VEGAS","NV",89141,"DENTAL","General Dentist"]
[null,453171377,1790521367,"SHAGHAYEGH  AFZAL-ASR","3702 WASHINGTON RD","MARTINEZ","GA",30907,"DENTAL","General Dentist"]
[null,273381694,1447374442,"STANLEY  HARRIS","185 MONTAGUE ST FL 8","BROOKLYN","NY",11201,"DENTAL","General Dentist"]
[null,813002332,1184820490,"VIVIAN  GRAHAM","256 COLUMBIA TPKE STE 205","FLORHAM PARK","NJ","07932","DENTAL","Endodontist"]
[null,854008310,1649408964,"ISRA T ELRAYAH","3050 CHAIN BRIDGE RD STE 201","FAIRFAX","VA",22030,"DENTAL","General Dentist"]
[null,825331154,1174665277,"ERIC H WALLACE","600 S DIXIE HWY STE 200","BOCA RATON","FL",33432,"DENTAL","General Dentist"]
[null,921087854,1861177263,"BENJAMIN D EAKER","837 THUNDER RD","SPINDALE","NC",28160,"DENTAL","General Dentist"]
[null,463141469,1255772075,"BILLY D SAMS","9411 CYPRESS LAKE DRIVE","FORT MYERS","FL",33919,"DENTAL","General Dentist"]
[null,203221849,1740662766,"SAMUEL M FOWLER","14346 WARWICK BLVD STE 418","NEWPORT NEWS","VA",23602,"DENTAL","Oral Surgeon"]
[null,208758082,1477610509,"NAIDA L SINGLETON","500 E MAIN ST","BENNETTSVILLE","SC",29512,"DENTAL","General Dentist"]
[null,157582727,1073638763,"ROBERT H GULLER","21 S KINDERKAMACK RD","MONTVALE","NJ","07645","DENTAL","General Dentist"]
[null,232013013,1346576675,"DAVID M DILLON","1084 E LANCASTER AVE","BRYN MAWR","PA",19010,"DENTAL","General Dentist"]
[null,205771970,1104972934,"CHRISTOPHER M HOSKINS","429 ROPER MOUNTAIN RD BLDG 300","GREENVILLE","SC",29615,"DENTAL","General Dentist"]
[null,200185918,1932805066,"MINA  BASSALY","11959 DECUBELLIS RD","NEW PORT RICHEY","FL",34654,"DENTAL","General Dentist"]
[null,224218926,1942352067,"NATHAN M VOGT","2630 GEORGE WASHINGTON MEM HWY","HAYES","VA",23072,"DENTAL","General Dentist"]
[null,862675808,1609320100,"SUSHAEN  RANGARAMANUJAM","818 KOHL AVE # 820","MIDDLETOWN","DE",19709,"DENTAL","General Dentist"]
[null,222488654,1730262890,"KATHY  KIRIFIDES","1802 W 4TH ST","WILMINGTON","DE",19805,"DENTAL","General Dentist"]
[null,208946972,1568886315,"ZAIN ALQAWS  ISSA","3033 WASHINGTON ST","ROXBURY","MA","02119","DENTAL","General Dentist"]
[null,824291589,1497000459,"JOHN P SEISMAN","23192 THREE NOTCH RD","CALIFORNIA","MD",20619,"DENTAL","General Dentist"]
[null,204116177,1720212558,"WILLIAM C KLEIN","1450 CLEMENTS BRIDGE RD","DEPTFORD","NJ","08096","DENTAL","Oral Surgeon"]
[null,270013278,1982663928,"WILLIAM H PANICO","4 OSLO AVE","RIO GRANDE","NJ","08242","DENTAL","General Dentist"]
[null,812119992,1285860874,"BETSEY  CLARK","1052 COUNTY ROUTE 64","ELMIRA","NY",14903,"DENTAL","General Dentist"]
[null,334825068,1093604944,"EMILY R FORTH","54055 COUNTY ROAD 653","PAW PAW","MI",49079,"DENTAL","General Dentist"]
[null,271276513,1104906486,"NICOLE M BERGER","572 E MCNAB RD STE 102","POMPANO BEACH","FL",33060,"DENTAL","General Dentist"]
[null,474028680,1770278491,"CLAIRE  FRANCIS","333 MAIN ST","WATERVILLE","ME","04901","DENTAL","General Dentist"]
[null,521229253,1417644907,"MCKENZIE C BLACKWELL","1920 ROCK SPRING RD STE 200","FOREST HILL","MD",21050,"DENTAL","General Dentist"]
[null,269621570,1902040272,"ANGELA P DOYLE","2094 TREMONT CTR","COLUMBUS","OH",43221,"DENTAL","General Dentist"]
[null,453859945,1053426437,"JENNIFER J CORNELL","1762 HIGHWAY 48 STE A","CLARKSVILLE","TN",37040,"DENTAL","General Dentist"]
[null,852561850,1780125716,"FABIOLA K GIRON","1574 BLOOMINGDALE AVE","VALRICO","FL",33596,"DENTAL","General Dentist"]
[null,461990789,1386972644,"SEAN PATRICK CARR","90 CYPRESS WAY E STE 20","NAPLES","FL",34110,"DENTAL","General Dentist"]
[null,992405438,1598918369,"KARL K NORTHRUP","17224 SE 272ND ST STE C","COVINGTON","WA",98042,"DENTAL","General Dentist"]
[null,364271142,1538519368,"AHMAD  NOWEDER","10 W PHILLIP RD STE 105","VERNON HILLS","IL",60061,"DENTAL","General Dentist"]
[null,300875209,1689752008,"DEAN F SOPHOCLES","350 S PROVIDENCE RD","MEDIA","PA",19063,"DENTAL","General Dentist"]
[null,520595110,1629509856,"ALEXANDER KAMAL DANIEL","601 N CAROLINE ST","BALTIMORE","MD",21287,"DENTAL","General Dentist"]
[null,510562439,1497816532,"DENTAL MANAGEMENT STRATEGIES LLC","106 SAINT ANNES CHURCH RD","MIDDLETOWN","DE",19709,"DENTAL","General Dentist"]
[null,205937601,1396844288,"DANA B SHUMATE","8131 MARKET ST","WILMINGTON","NC",28411,"DENTAL","General Dentist"]
[null,842464644,1770679599,"VINCENT A SCHEMBARI","535 MAIN ST STE 113","LAUREL","MD",20707,"DENTAL","General Dentist"]
[null,481196134,1467020362,"KELSIE L DISKIN","105 S ANDOVER RD STE G","ANDOVER","KS",67002,"DENTAL","General Dentist"]
[null,223634580,1558526830,"JAY  ROSENBERG","1511 S MAIN ST","PLEASANTVILLE","NJ","08232","DENTAL","General Dentist"]
[null,461227455,1073253407,"JOSEPH  YOUSSEF","942 AVENUE C","BAYONNE","NJ","07002","DENTAL","General Dentist"]
[null,205530068,1245379817,"SAEED  AHMED","39 SIMON ST UNIT 8","NASHUA","NH","03060","DENTAL","General Dentist"]
[null,232899775,1295732683,"MICHAEL Z RICE","322 WARREN ST STE 150","JOHNSTOWN","PA",15905,"DENTAL","General Dentist"]
[null,741869639,1467585927,"KERWIN J KAHLICH","114 W REUSS BLVD","CUERO","TX",77954,"DENTAL","General Dentist"]
[null,832850308,1114216710,"NICOLE J MESSENGER","2206 PAGE RD STE 103","DURHAM","NC",27703,"DENTAL","General Dentist"]
[null,263771416,1477957652,"ANA CAROLINA L MATTOS","317 WASHINGTON ST","NORWELL","MA","02061","DENTAL","General Dentist"]
[null,832934284,1568815298,"GWEN M REGNIER","1126 IVES AVE N","GLENCOE","MN",55336,"DENTAL","General Dentist"]
[null,202085377,1730250804,"HAMILTON M SPORBORG","1118 MAIN ST","CHATHAM","MA","02633","DENTAL","General Dentist"]
[null,852396113,1205586831,"PHILIP T BACIGALUPO","61 NEWTON SPARTA RD","NEWTON","NJ","07860","DENTAL","General Dentist"]
[null,900003651,1417570011,"AKEIA  EVERETT","2623 HOUSLEY RD","ANNAPOLIS","MD",21401,"DENTAL","General Dentist"]
[null,452484089,1164652434,"ALI R FORGHANI","130 ROLLINS AVE STE H-2","ROCKVILLE","MD",20852,"DENTAL","General Dentist"]
[null,261677506,1396818761,"ADEL V MYRIE","8371 HIGHWAY 72 W STE 208","MADISON","AL",35758,"DENTAL","General Dentist"]
[null,382402017,1821433566,"CURTIS W CARDON","5957 HARVEY ST STE 200","NORTON SHORES","MI",49444,"DENTAL","Oral Surgeon"]
[null,356001673,1215094628,"JOHN A LEVON","1121 W MICHIGAN ST","INDIANAPOLIS","IN",46202,"DENTAL","Prosthodontist"]
[null,251630283,1851461800,"DOUGLAS CHARLES KURTZ","300 S MARKET ST","MARTINSBURG","PA",16662,"DENTAL","General Dentist"]
[null,455584000,1245385061,"ANGELA G CASSAR","6824 RIVER CENTER DR","CLEMMONS","NC",27012,"DENTAL","General Dentist"]
[null,356001673,1568638583,"ORLANDO L CAYETANO","1121 W MICHIGAN ST","INDIANAPOLIS","IN",46202,"DENTAL","Prosthodontist"]
[null,592896805,1467093179,"MICHELLE  DULGAR","111 LAGRANDE BLVD","LADY LAKE","FL",32159,"DENTAL","General Dentist"]
[null,863736314,1003832718,"MARK  KRAVER","3001 DEL PRADO BLVD S","CAPE CORAL","FL",33904,"DENTAL","General Dentist"]
[null,273900278,1477048155,"DIMPLE JAYANTILAL PATEL","155 TRADERS WAY STE 400","POOLER","GA",31322,"DENTAL","General Dentist"]
[null,510391833,1275028326,"JOHN W SERINO","538 CYNWOOD DR STE 1","EASTON","MD",21601,"DENTAL","Orthodontist"]
[null,921780972,1275106809,"MICHAEL  PLONSKI","615 W HARWOOD RD STE A","HURST","TX",76054,"DENTAL","General Dentist"]
[null,223701360,1356430177,"DAVID L ROMISHER","7 W PARK AVE","MERCHANTVILLE","NJ","08109","DENTAL","General Dentist"]
[null,825428747,1912429077,"HANNA  IVALHA","6780 BERRYHILL ST","MILTON","FL",32570,"DENTAL","General Dentist"]
[null,"016020406",1821658667,"THOMAS A GUERRETTE","15 OAK ST","SPRINGVALE","ME","04083","DENTAL","General Dentist"]
[null,261474958,1356555007,"DAVID T BABINGTON","3910 CENTREVILLE RD STE 200","CHANTILLY","VA",20151,"DENTAL","General Dentist"]
[null,832382773,1316476716,"VALENTINA L SAVATH KIM","2114 DARBY RD","HAVERTOWN","PA",19083,"DENTAL","General Dentist"]
[null,521124420,1992793087,"RICHARD N LAMB","1600 E FORT AVE","BALTIMORE","MD",21230,"DENTAL","General Dentist"]
[null,593467927,1235280637,"BRIAN PAUL BAKER","600 S HOPKINS AVE","TITUSVILLE","FL",32796,"DENTAL","General Dentist"]
[null,844223974,1184699092,"WALTER D FELTON","10611 GREENYARD WAY STE A","CHESTER","VA",23831,"DENTAL","General Dentist"]
[null,263366235,1497870646,"JEREMIAH D GORDON","300 PLANTATION ISLAND DR S","SAINT AUGUSTINE","FL",32080,"DENTAL","General Dentist"]
[null,453169604,1619189248,"BRENT  LEW","12062 VALLEY VIEW ST STE 250","GARDEN GROVE","CA",92845,"DENTAL","General Dentist"]
[null,200120892,1720424963,"LISA K MYRUM","130 S STATE RD Suite 300","SPRINGFIELD","PA",19064,"DENTAL","Pediatric Dentist"]
[null,274243648,1891081634,"BYRON T GUFFEE","26 HOLLY CREEK DR","ANDERSON","SC",29621,"DENTAL","General Dentist"]
[null,811826349,1598452047,"MICHAEL J JUNG","308 E CROSSROADS BLVD","SARATOGA SPRINGS","UT",84045,"DENTAL","General Dentist"]
[null,570727635,1811079650,"JOHN R CLARK","377 W PALMETTO ST","FLORENCE","SC",29501,"DENTAL","General Dentist"]
[null,832156378,1205314309,"SHIVANGI B AMIN","2801 MCRAE RD STE C1","NORTH CHESTERFIELD","VA",23235,"DENTAL","Periodontist"]
[null,721383657,1255060349,"PATRICIA MARGARET DUMAS","23678 US HIGHWAY 98","FAIRHOPE","AL",36532,"DENTAL","General Dentist"]
[null,200185918,1780039263,"URSULA  MCGUCKIN","6340 N WICKHAM RD UNIT 101","MELBOURNE","FL",32940,"DENTAL","General Dentist"]
[null,232542264,1023157336,"JOHN M STAIVECKI","4525 SPRING HILL DR","SCHNECKSVILLE","PA",18078,"DENTAL","General Dentist"]
[null,263164618,1164773420,"KYU MEE YO","2184 FM 3009","SCHERTZ","TX",78154,"DENTAL","General Dentist"]
[null,263766926,1972701209,"ADAM C BARBAG","1720 N UNIVERSITY DR STE 301","CORAL SPRINGS","FL",33071,"DENTAL","General Dentist"]
[null,853432777,1912153362,"NIRAJ R PATEL","218 BURKEMONT AVE","MORGANTON","NC",28655,"DENTAL","General Dentist"]
[null,845063183,1205181732,"KINNAR  SHAH","121 WATERMAN AVE","MOUNT DORA","FL",32757,"DENTAL","General Dentist"]
[null,203774799,1487698130,"RYAN D GOSLIN","75 TALCOTT RD STE 20","WILLISTON","VT","05495","DENTAL","General Dentist"]
[null,760638855,1861597437,"JAMES R BLANKENSHIP","4920 SEAWALL BLVD","GALVESTON","TX",77551,"DENTAL","General Dentist"]
[null,200158115,1811905771,"JACK D STEELE","501 E POPLAR ST","MC CONNELLSBURG","PA",17233,"DENTAL","General Dentist"]
[null,455245077,1518592377,"ADAM M ZAMOREK","5710 US HIGHWAY 98 N","LAKELAND","FL",33809,"DENTAL","Pediatric Dentist"]
[null,872118277,1386087781,"BRANDON T MURPHY","100 S KENILWORTH AVE","OAK PARK","IL",60302,"DENTAL","General Dentist"]
[null,561311071,1588950133,"FRANCIS H SYMMES","1086 WHITAKER RD","WINSTON SALEM","NC",27106,"DENTAL","General Dentist"]
[null,475252227,1881193209,"MARIA  MACHALICK","801 OLD YORK RD STE 403","JENKINTOWN","PA",19046,"DENTAL","General Dentist"]
[null,201237898,1750448114,"MATTHEW  MOUDY","4701 FAIRWAY AVE SUITE C","NORTH LITTLE ROCK","AR",72216,"DENTAL","General Dentist"]
[null,845081038,1063611747,"ROBERT DONG PARK","26670 CENTERVIEW DR UNIT 19","MILLSBORO","DE",19966,"DENTAL","Orthodontist"]
[null,465765586,1013221183,"ADAM L MARTIK","1503 POTOMAC AVE","PITTSBURGH","PA",15216,"DENTAL","General Dentist"]
[null,882135322,1073102281,"HEATHER  CAMPBELL","3818 SW 21ST PL STE 202","REDMOND","OR",97756,"DENTAL","General Dentist"]
[null,221906385,1366974339,"ERIKA O FAJARDO","776 GROVE RD","WEST DEPTFORD","NJ","08086","DENTAL","Pediatric Dentist"]
[null,463460895,1265729859,"TRACE R BAXTER","33 LONO AVE STE 370","KAHULUI","HI",96732,"DENTAL","General Dentist"]
[null,471257924,1366726234,"JARED D ROBERTS","1751 W ORANGE GROVE RD STE 101","TUCSON","AZ",85704,"DENTAL","Periodontist"]
[null,391538650,1811072242,"PAUL M SANDVICK","6070 N PORT WASHINGTON RD","MILWAUKEE","WI",53217,"DENTAL","General Dentist"]
[null,863618372,1144840174,"NEIL  CHARNOWITZ","2360 W JOPPA RD STE 310","LUTHERVILLE","MD",21093,"DENTAL","Oral Surgeon"]
[null,850744980,1922099225,"ERICA M LEWIS MEAD","613 DUTCHMANS LN","EASTON","MD",21601,"DENTAL","Pediatric Dentist"]
[null,200185918,1134569254,"KYLE ALLEN YERTON","2222 E COUNTY ROAD 540A","LAKELAND","FL",33813,"DENTAL","General Dentist"]
[null,813793901,1649706292,"ROBERT W TART","14431 SOMMERVILLE CT STE A","MIDLOTHIAN","VA",23113,"DENTAL","General Dentist"]
[null,541186353,1508476300,"MARIA  CORREA GIRALDO","10140 STAPLES MILL RD","GLEN ALLEN","VA",23060,"DENTAL","General Dentist"]
[null,541186353,1184776718,"JOHN D BUHLER","10500 ATLEE STATION RD","ASHLAND","VA",23005,"DENTAL","General Dentist"]
[null,910932902,1134737505,"LISA M DUCKLES","3031 ORLEANS ST STE 201","BELLINGHAM","WA",98226,"DENTAL","General Dentist"]
[null,205461522,1124123773,"RICHARD  STEINBERG","3030 US HIGHWAY 301 N","ELLENTON","FL",34222,"DENTAL","General Dentist"]
[null,823290223,1427544808,"DYLAN THOMAS TAGG","2151 S ALTERNATE A1A STE 1300","JUPITER","FL",33477,"DENTAL","General Dentist"]
[null,222113934,1417132945,"MATTHEW D HORN","440 CHESTNUT ST","UNION","NJ","07083","DENTAL","General Dentist"]
[null,392095068,1992231674,"JOSEPH ALLEN DOUGLAS","220 PROFESSIONAL PARK","BECKLEY","WV",25801,"DENTAL","General Dentist"]
[null,260367216,1417695032,"RICHARD L STAYER","701 MAIN ST","ROYERSFORD","PA",19468,"DENTAL","General Dentist"]
[null,833933180,1932621786,"NICHOLAS  POTTER","109 W MAIN ST","TAVARES","FL",32778,"DENTAL","General Dentist"]
[null,831218525,1093331605,"MARIA S OEI","7330 FRANKFORD AVE","PHILADELPHIA","PA",19136,"DENTAL","General Dentist"]
[null,640932949,1205840824,"ROBERT L SUTTON","15503 OAK LN STE 300B","GULFPORT","MS",39503,"DENTAL","General Dentist"]
[null,521416036,1205067360,"RYAN S MANKIEWICZ","132 HOLIDAY CT STE 202","ANNAPOLIS","MD",21401,"DENTAL","General Dentist"]
[null,274592809,1841554433,"ERIC  ROONEY","400 W ALLEGHENY AVE STE B1","PHILADELPHIA","PA",19133,"DENTAL","General Dentist"]
[null,"042572209",1275744310,"MICHAEL  SPINK","100 UNIVERSITY DR","AMHERST","MA","01002","DENTAL","Oral Surgeon"]
[null,463899257,1649401084,"JAMES R ROCHEFORT","801 CENTRAL AVE UNIT 5","DOVER","NH","03820","DENTAL","General Dentist"]
[null,570893174,1801925532,"LAWRENCE E SARNER","1204 TWO ISLAND COURT","MT  PLEASANT","SC",29466,"DENTAL","General Dentist"]
[null,463784245,1982613279,"HOLLIS F HEINZERLING","32 MAIN ST","ONEONTA","NY",13820,"DENTAL","General Dentist"]
[null,113642552,1003547829,"MAX  BLUMENTHAL","790 PENLLYN BLUE BELL PIKE STE 103","BLUE BELL","PA",19422,"DENTAL","General Dentist"]
[null,832616862,1598257438,"LATOYA A JOSEPH","7766 BAY ST STE 11","SEBASTIAN","FL",32958,"DENTAL","General Dentist"]
[null,204889452,1477588804,"ANDY R BUTCHER","3106 REIDVILLE RD","SPARTANBURG","SC",29301,"DENTAL","General Dentist"]
[null,834505379,1356182034,"MICHAEL  CLEMENS","7675 MAPLE AVE","PENNSAUKEN","NJ","08109","DENTAL","General Dentist"]
[null,844850690,1578092771,"SALAR  AZAD","1020 MILL POND RD STE H & J","FREDERICK","MD",21701,"DENTAL","Periodontist"]
[null,932751188,1689402257,"TORAL  PATEL","7052 FRANKFORD AVE 56","PHILADELPHIA","PA",19135,"DENTAL","General Dentist"]
[null,231944530,1083882294,"BRANDON  IVERSON","190 GOOD DR","LANCASTER","PA",17603,"DENTAL","Oral Surgeon"]
[null,472157654,1801572946,"TINA  TRAN","511 N PROVIDENCE RD","MEDIA","PA",19063,"DENTAL","General Dentist"]
[null,522237953,1033222062,"TAMARA A LEARY","325 GAMBRILLS RD STE C","GAMBRILLS","MD",21054,"DENTAL","General Dentist"]
[null,465428868,1467886242,"ANDREW M BYRNES","1566 W FAIRBANKS AVE","WINTER PARK","FL",32789,"DENTAL","General Dentist"]
[null,561319745,1932768587,"DILEK  UYAN","140 DENTAL CIR STE 143","CHAPEL HILL","NC",27599,"DENTAL","General Dentist"]
[null,521116591,1649679085,"WAYNE  STEPHENS","808 S 5TH AVE","DENTON","MD",21629,"DENTAL","Pediatric Dentist"]
[null,464361259,1275822538,"ANTHONY  DO","5345 W UNIVERSITY DR STE 200","MCKINNEY","TX",75071,"DENTAL","General Dentist"]
[null,770703279,1710044623,"MICHAEL R EGHTESSAD","44330 PREMIER PLAZA STE 140","ASHBURN","VA",20147,"DENTAL","General Dentist"]
[null,455402141,1194870071,"GERALD Q FREEMAN","12484 WARWICK BLVD STE G","NEWPORT NEWS","VA",23606,"DENTAL","General Dentist"]
[null,330931903,1801007539,"THOMAS W MADDOCKS","1976 COLLEGE BLVD","OCEANSIDE","CA",92056,"DENTAL","General Dentist"]
[null,591368180,1013310069,"THOMAS F PLUNKETT","2137 E COUNTY ROAD 540A","LAKELAND","FL",33813,"DENTAL","General Dentist"]
[null,842883953,1801851597,"STEVEN  SPERONI","1450 E BOOT ROAD SUITE 200 E","WEST CHESTER","PA",19380,"DENTAL","General Dentist"]
[null,113440088,1215430327,"KEVIN  ZHANG","374 STOCKHOLM ST","BROOKLYN","NY",11237,"DENTAL","Pediatric Dentist"]
[null,223553228,1528012812,"PETER G GAIDIS","989 N MAIN ST","WILLIAMSTOWN","NJ","08094","DENTAL","General Dentist"]
[null,814353405,1356837132,"LANDON T BOWLAND","2531 PARK DR STE B","NASHVILLE","TN",37214,"DENTAL","General Dentist"]
[null,232984095,1750718565,"ERIK D WILLIAMS","4613 BALTIMORE AVE","PHILADELPHIA","PA",19143,"DENTAL","General Dentist"]
[null,453908321,1386843373,"DAVID M MORGAN","124 SOUTH WEST ST #103","ALEXANDRIA","VA",22314,"DENTAL","Oral Surgeon"]
[null,204116177,1316652480,"MATHEW  JAFFE","1450 CLEMENTS BRIDGE RD","DEPTFORD","NJ","08096","DENTAL","General Dentist"]
[null,814361755,1053573063,"BHAVIN  SHAH","15 W BROAD ST","PALMYRA","NJ","08065","DENTAL","General Dentist"]
[null,472102993,1538500822,"TALON  HAYNIE","1813 PLAZA DR","WINCHESTER","VA",22601,"DENTAL","General Dentist"]
[null,421056006,1124012059,"MICHAEL J DALTON","511 S 4TH ST","CLINTON","IA",52732,"DENTAL","Oral Surgeon"]
[null,881490471,1578930707,"JOHN E FARAH","55 N CARPENTER RD","TITUSVILLE","FL",32796,"DENTAL","General Dentist"]
[null,843576532,1033444948,"ANUPAMA  PALAKODETI","3415 ROGERS RD STE 100","WAKE FOREST","NC",27587,"DENTAL","General Dentist"]
[null,301045413,1871394734,"JAYNE M ECKENRODE","2110 N FOUNTAIN GREEN RD","BEL AIR","MD",21015,"DENTAL","General Dentist"]
[null,934265462,1184257610,"SHANMUKHA REDDY  KALLAM","137 MONTGOMERY AVE STE 200","BOYERTOWN","PA",19512,"DENTAL","General Dentist"]
[null,455444754,1164049896,"CONNER C DIMINICK","1013 W MAIN ST STE 6","MOUNT JOY","PA",17552,"DENTAL","General Dentist"]
[null,886770045,1922405604,"NAILA  MANJI","776 W LANCASTER AVE","BRYN MAWR","PA",19010,"DENTAL","General Dentist"]
[null,871396870,1851585327,"RAUL  ORTIZ-RODRIGUEZ","2426 S TAMIAMI TRAIL STE 200","SARASOTA","FL",34239,"DENTAL","Endodontist"]
[null,510212559,1952661902,"PETER F SUBACH DMD PA","1601 MILLTOWN RD STE 17 Lindell Sq","WILMINGTON","DE",19808,"DENTAL","General Dentist"]
[null,200185918,1497317242,"NERY  RUANO","938 BRIDGEWATER DR 3B","PORT ORANGE","FL",32129,"DENTAL","General Dentist"]
[null,201709440,1326774381,"DHRUV R PATEL","77 GARLAND LN","WILLINGBORO","NJ","08046","DENTAL","General Dentist"]
[null,161744476,1518253509,"DANIELLE K HERSCHLER","310 SOUTH ST","HYANNIS","MA","02601","DENTAL","General Dentist"]
[null,231903489,1487035671,"EVAN R EISLER","632 MONTGOMERY AVE STE 2","NARBERTH","PA",19072,"DENTAL","General Dentist"]
[null,472532794,1295577534,"JAMAAL  BROWN","2412 N SALISBURY BLVD STE A","SALISBURY","MD",21801,"DENTAL","General Dentist"]
[null,510158976,1134147390,"COLLEEN M WILLIAMS","12080 LB LINDBECK RD","RADIUM SPRINGS","NM",88054,"DENTAL","General Dentist"]
[null,752853486,1871504555,"DOUGLAS F CHITSEY","3419 JOHNSON AVE","SAN ANGELO","TX",76904,"DENTAL","General Dentist"]
[null,371308741,1588862254,"KENNETH L MYRACLE","117 HOLIDAY DR","MATTOON","IL",61938,"DENTAL","General Dentist"]
[null,883620006,1659951077,"CHEMIKA  ST JUSTE","1261 S FEDERAL HWY","POMPANO BEACH","FL",33062,"DENTAL","General Dentist"]
[null,262149832,1144329046,"WHITNEY  BELISLE","5503 OLEANDER DR","WILMINGTON","NC",28403,"DENTAL","General Dentist"]
[null,593097305,1174009070,"KIM T VAN","724 LITHIA PINECREST RD","BRANDON","FL",33511,"DENTAL","General Dentist"]
[null,334068894,1679714604,"RYAN  MONTGOMERY","3012 GREEN MEADOW DR","SAN ANGELO","TX",76904,"DENTAL","General Dentist"]
[null,743040305,1972910073,"DAVID D MANTEL","2151 NW 2ND AVE STE 102","BOCA RATON","FL",33431,"DENTAL","General Dentist"]
[null,451266532,1952880429,"CURTIS  BENEDETTO","107 LANSFORD CT","MYRTLE BEACH","SC",29588,"DENTAL","General Dentist"]
[null,832809396,1568759330,"ALLEN  GENG","526 W RIDGE RD","LINWOOD","PA",19061,"DENTAL","General Dentist"]
[null,233040504,1992180731,"COLIN P HORAN","230 HARRISBURG AVE STE 5","LANCASTER","PA",17603,"DENTAL","General Dentist"]
[null,320557367,1467908814,"KELLY LAUREN VAN WAGENEN","151 BROADWAY ST","COLCHESTER","CT","06415","DENTAL","General Dentist"]
[null,814704599,1780635037,"TAYLOR C CLARK","4274 N EAGLE RD","BOISE","ID",83713,"DENTAL","General Dentist"]
[null,208713215,1265056782,"ALEXANDER  BOUMERHI","220 N FRONT ST","PHILIPSBURG","PA",16866,"DENTAL","General Dentist"]
[null,934648991,1285194514,"JOSEPH  GEIGER","735 NORMAN DR STE A","LEBANON","PA",17042,"DENTAL","Oral Surgeon"]
[null,463460895,1215500939,"LENA  POONNOPATAM","33 LONO AVE STE 370","KAHULUI","HI",96732,"DENTAL","General Dentist"]
[null,814239209,1902932809,"TOMICKA  JACKSON-GEORGE","1501 SAINT PAUL ST STE  124","BALTIMORE","MD",21202,"DENTAL","General Dentist"]
[null,232314263,1043481146,"THOMAS A HANAK","5045 N 5TH ST","PHILADELPHIA","PA",19120,"DENTAL","General Dentist"]
[null,472684810,1467543702,"STEPHANIE L HIRT","216 HADDON AVE STE 109","HADDON TOWNSHIP","NJ","08108","DENTAL","General Dentist"]
[null,391778165,1295091171,"THOMAS O KLOSTER","2215 VINE ST STE D","HUDSON","WI",54016,"DENTAL","General Dentist"]
[null,591793384,1093874794,"JOHN B VAIRO","9120 NW 36TH PL","GAINESVILLE","FL",32606,"DENTAL","General Dentist"]
[null,201756342,1588858237,"ZEBUNNESSA H MORAL","2985 NAVAJO ST","YORKTOWN HEIGHTS","NY",10598,"DENTAL","General Dentist"]
[null,200120892,1972060606,"GABRIELLE  LIEBERMAN","900 W BALTIMORE PIKE STE 203","WEST GROVE","PA",19390,"DENTAL","Pediatric Dentist"]
[null,231995431,1316328339,"SARA  DWORKIN","2301 E ALLEGHENY AVE STE 201","PHILADELPHIA","PA",19134,"DENTAL","Pediatric Dentist"]
[null,851397345,1689300378,"INNOCENT C NWANYA","1708 ROUTE 47","RIO GRANDE","NJ","08242","DENTAL","General Dentist"]
[null,464593914,1245441864,"JULIA ANNE BARNARD","9550 ROCKY RIVER RD STE 202","CHARLOTTE","NC",28215,"DENTAL","General Dentist"]
[null,824092825,1881887693,"MEGAN M NGUYEN","215 TALS ROCK WAY # 100","CARY","NC",27519,"DENTAL","General Dentist"]
[null,223777564,1851482004,"FRANK A PETTISANI","1500 S LINCOLN AVE","VINELAND","NJ","08361","DENTAL","General Dentist"]
[null,300431754,1619407889,"NESREEN  NIMER","433 APOLLO BEACH BLVD","APOLLO BEACH","FL",33572,"DENTAL","General Dentist"]
[null,233083309,1457466062,"WILLIAM M TUMAN","7111 LINCOLN DR","PHILADELPHIA","PA",19119,"DENTAL","General Dentist"]
[null,274595811,1992967616,"DEREK P SALONY","1408 SKIBO RD","FAYETTEVILLE","NC",28303,"DENTAL","General Dentist"]
[null,383505782,1629569900,"DAVID T BANOONI","4320 ORCHARD LAKE RD","WEST BLOOMFIELD","MI",48323,"DENTAL","General Dentist"]
[null,825476503,1932427176,"STEPHANIE  RAVETT","6012 GREENE ST","PHILADELPHIA","PA",19144,"DENTAL","General Dentist"]
[null,223382270,1770379117,"MELINA  GOOD","159 DELAWARE ST","WOODBURY","NJ","08096","DENTAL","General Dentist"]
[null,994236016,1306332614,"AARON  GATES","8640 GUILFORD RD STE 237","COLUMBIA","MD",21046,"DENTAL","General Dentist"]
[null,593051299,1346761517,"AHMAD A BHATTI","1805 LAKELAND HILLS BLVD","LAKELAND","FL",33805,"DENTAL","General Dentist"]
[null,853418407,1154731826,"JACQUELYN G MARANO","508 LONG BEACH BLVD","SHIP BOTTOM","NJ","08008","DENTAL","General Dentist"]
[null,473596549,1003061276,"FREDERICK V BALLARD","333 N BROADWAY","PENNSVILLE","NJ","08070","DENTAL","Pediatric Dentist"]
[null,842492688,1164918512,"ASAL  MIRHADIZADEH","2010 S JUNIPER ST","PHILADELPHIA","PA",19148,"DENTAL","Pediatric Dentist"]
[null,475434669,1518275536,"BRANDON K RINEHART","10185 OCEAN HWY UNIT B","PAWLEYS ISLAND","SC",29585,"DENTAL","General Dentist"]
[null,232708126,1952053951,"MATTHEW  FINOR","240 GEIGER RD","PHILADELPHIA","PA",19115,"DENTAL","Pediatric Dentist"]
[null,521116591,1629298146,"SANDRA A GARBELY-KERKOVICH","401 LOCKERMAN ST","DENTON","MD",21629,"DENTAL","General Dentist"]
[null,205192023,1730591694,"KATHLEEN E TYTKA","777 HOPKINS RD","WILLIAMSVILLE","NY",14221,"DENTAL","General Dentist"]
[null,521501736,1972628980,"HARVEY I SHERMAN","184 THOMAS JOHNSON DR STE 202","FREDERICK","MD",21702,"DENTAL","General Dentist"]
[null,811234407,1013790138,"JEONGHUN  LEE","2326 S 3RD ST","PHILADELPHIA","PA",19148,"DENTAL","General Dentist"]
[null,462934606,1487853206,"PATRICK J MOKRIS","1111 PERSON ST","KISSIMMEE","FL",34741,"DENTAL","General Dentist"]
[null,262646682,1811059033,"DOUGLAS B SHERLY","160 S BROADWAY","PENNSVILLE","NJ","08070","DENTAL","General Dentist"]
[null,208994249,1205046240,"JACE J MOLINARI","584 OAK HILL RD","WILLISTON","VT","05495","DENTAL","General Dentist"]
[null,541123092,1356782387,"ANDREA  WISSINK","1533 VOLVO PKWY STE 100","CHESAPEAKE","VA",23320,"DENTAL","General Dentist"]
[null,232175388,1407014889,"MICHAEL J TULLMAN","732 S 8TH ST 4","PHILADELPHIA","PA",19147,"DENTAL","General Dentist"]
[null,593038968,1285310821,"CASSANDRA  BROWER","1218 E VENICE AVE","VENICE","FL",34285,"DENTAL","General Dentist"]
[null,843864320,1295945038,"NABIL S ZAHKA","101 MAIN STREET STE 220","MEDFORD","MA","02155","DENTAL","General Dentist"]
[null,473156139,1982956991,"HYUN MO  BAE","406 LECOMPTE ST","CAMBRIDGE","MD",21613,"DENTAL","General Dentist"]
[null,260185892,1093208290,"ANDREW  WEBSTER","5371 GLOVER LN","MILTON","FL",32570,"DENTAL","General Dentist"]
[null,810983143,1851603419,"PHILIP L FAVA","9880 BUSTLETON AVE STE 211-212","PHILADELPHIA","PA",19115,"DENTAL","General Dentist"]
[null,570535143,1316326101,"CALEB J POSTON","2090 CHARLIE HALL BLVD STE 100","CHARLESTON","SC",29414,"DENTAL","Periodontist"]
[null,222047975,1821395294,"TIMOTHY P MORIARTY","804 HIGHWAY 71","SEA GIRT","NJ","08750","DENTAL","General Dentist"]
[null,813615394,1952781692,"MARK L PAOLUCCI","6 BLACKSTONE VALLEY PLACE SUITE 501","LINCOLN","RI","02865","DENTAL","General Dentist"]
[null,274914498,1215292024,"AIDA  SOROORI-EBADI","100 GROSSMAN DR STE 210","BRAINTREE","MA","02184","DENTAL","General Dentist"]
[null,570535143,1134472426,"JEFFREY  LARO","2090 CHARLIE HALL BLVD STE 100","CHARLESTON","SC",29414,"DENTAL","Periodontist"]
[null,273229373,1245326024,"THOMAS K BACHSTEIN","3475 WEST CHESTER PIKE STE 230","NEWTOWN SQUARE","PA",19073,"DENTAL","General Dentist"]
[null,272237292,1679909121,"RAHMATH  SYEDA","7671 QUARTERFIELD ROAD #400","GLEN BURNIE","MD",21061,"DENTAL","General Dentist"]
[null,841529601,1750669289,"LINDSEY  COSPER","2001 S SHIELDS ST BLDG C","FORT COLLINS","CO",80526,"DENTAL","General Dentist"]
[null,462434325,1053574327,"JULIE R LEHR","250 N READING RD","EPHRATA","PA",17522,"DENTAL","General Dentist"]
[null,521674210,1821766874,"ANITHA  DURGAM","412 1ST ST SE","WASHINGTON","DC",20003,"DENTAL","General Dentist"]
[null,800013789,1073531281,"WILLIAM K HARKINS","1209 WALTON ST","PHILIPSBURG","PA",16866,"DENTAL","General Dentist"]
[null,464244840,1306100607,"WEIDONG  YANG","131 BECKS WOODS DR","BEAR","DE",19701,"DENTAL","General Dentist"]
[null,391391738,1194768572,"PETER J SCHINDELHOLZ","4453 HWY B","LAND O LAKES","WI",54540,"DENTAL","General Dentist"]
[null,994890069,1568847994,"DANIEL DAVID EGGERT","310 MARTIN ST STE A","BLAINE","WA",98230,"DENTAL","General Dentist"]
[null,272141885,1598086571,"NICHOLAS A AMATI","2543 LOCUST HILL RD","TAYLORS","SC",29687,"DENTAL","General Dentist"]
[null,810966671,1295466357,"RIDDHI  PATEL","4675 E STATE ROAD 44 STE 104","WILDWOOD","FL",34785,"DENTAL","General Dentist"]
[null,462081012,1407205818,"AILEEN T HAN","201 BUSINESS PARK DR STE 101","RINCON","GA",31326,"DENTAL","General Dentist"]
[null,"010720632",1215258249,"JASON DUBIGNON HOWARD","206 E MONTGOMERY XRD","SAVANNAH","GA",31406,"DENTAL","General Dentist"]
[null,260801564,1629726997,"WALTON  GODWIN","13605 REESE BLVD W","HUNTERSVILLE","NC",28078,"DENTAL","General Dentist"]
[null,545673111,1629461678,"MARK  MAKILING","419 E MAIN ST STE 202","MIDDLETOWN","NY",10940,"DENTAL","General Dentist"]
[null,223978216,1932271715,"JAMES B HANSEN","85 8TH ST N","NAPLES","FL",34102,"DENTAL","General Dentist"]
[null,811263919,1740590488,"ALEXANDER SIMON CHOE","1295 CENTRAL AVE","ALBANY","NY",12205,"DENTAL","General Dentist"]
[null,202131814,1982443305,"JACOB N ZERKA","529 N HEWITT RD","YPSILANTI","MI",48197,"DENTAL","General Dentist"]
[null,934155828,1730666918,"SHAHRAM  BAHRAMI","1101 WOOTTON PARKWAY, SUITE 540","ROCKVILLE","MD",20852,"DENTAL","General Dentist"]
[null,510196935,1770273948,"CHARLES S KANE","9159 FRANKTOWN RD","FRANKTOWN","VA",23354,"DENTAL","General Dentist"]
[null,222005159,1366925059,"NICHOLAS G PERSICKETTI","1001 CENTRAL AVE","MINOTOLA","NJ","08341","DENTAL","General Dentist"]
[null,151486552,1659419554,"MICHAEL R MERKOWSKY","55 E RT 70 STE 1","MARLTON","NJ","08053","DENTAL","General Dentist"]
[null,832831552,1831404938,"KEITH D JACKSON","7113 MIAMI AVE","MADEIRA","OH",45243,"DENTAL","General Dentist"]
[null,934236877,1104815091,"LEE T MYERS","4091 MALLORY LN STE 118","FRANKLIN","TN",37067,"DENTAL","General Dentist"]
[null,262601922,1144694035,"JILLIAN  LEBARD","2150 E TAHQUITZ CANYON WAY STE 2","PALM SPRINGS","CA",92262,"DENTAL","General Dentist"]
[null,274257185,1538390042,"TYLER  CARMACK","677 ROUTE 7A","SHAFTSBURY","VT","05262","DENTAL","General Dentist"]
[null,232814394,1649358920,"MARLENE  SARDINA-KELLY","2417 WELSH RD","PHILADELPHIA","PA",19114,"DENTAL","General Dentist"]
[null,650719035,1053690222,"MELANIE WOODWARD DELOACH","1519 3RD ST N STE 5","JACKSONVILLE BEACH","FL",32250,"DENTAL","General Dentist"]
[null,853644707,1538997986,"ABIGAIL  WIESE","106 HIGH POINT CTR STE 100","COLCHESTER","VT","05446","DENTAL","General Dentist"]
[null,232335877,1770476202,"HARDIKKUMAR  MAKADIA","60 MARCHWOOD RD","EXTON","PA",19341,"DENTAL","General Dentist"]
[null,611319143,1891197604,"MICHAEL S SMITH","160 KINGS DAUGHTERS DR STE 100","FRANKFORT","KY",40601,"DENTAL","General Dentist"]
[null,842848779,1629613872,"JONATHAN B ANGSTADT","1670 LINCOLN HWY E","LANCASTER","PA",17602,"DENTAL","General Dentist"]
[null,232314043,1205916400,"LOUIS A GENELLO","600 LACKAWANNA AVE","SCRANTON","PA",18503,"DENTAL","General Dentist"]
[null,273461424,1538395199,"COLLIN M LE","6419 CAROLINA BEACH RD STE E","WILMINGTON","NC",28412,"DENTAL","General Dentist"]
[null,231995431,1811570658,"SAMANTHA  GUAN","7 E SKIPPACK PIKE STE 100","AMBLER","PA",19002,"DENTAL","Pediatric Dentist"]
[null,810968066,1164862934,"ROBERT A CASTRO","1926 PLEASANTON RD","SAN ANTONIO","TX",78221,"DENTAL","General Dentist"]
[null,843245565,1942652037,"RONALD  KO","10211 144TH ST E","PUYALLUP","WA",98374,"DENTAL","General Dentist"]
[null,593653140,1316471113,"SARA  MALTESE","1044 BELCHER RD","DUNEDIN","FL",34698,"DENTAL","General Dentist"]
[null,871953968,1881835262,"IVAN  ZAMORA","2213 NORTH BLVD W","DAVENPORT","FL",33837,"DENTAL","General Dentist"]
[null,141693054,1134213564,"KIT ELLEN BURKICH","366 AVIATION RD","QUEENSBURY","NY",12804,"DENTAL","General Dentist"]
[null,205108340,1053752030,"JESSICA A FORESTIER","7780 BRIER CREEK PKWY STE 120","RALEIGH","NC",27617,"DENTAL","General Dentist"]
[null,562379964,1518055870,"WILLIAM D MCDANIEL","804 W MAIN ST","LAKE CITY","SC",29560,"DENTAL","General Dentist"]
[null,383839505,1619049962,"SHANE L NEWTON","307 PARK ST STE 203","MCCALL","ID",83638,"DENTAL","General Dentist"]
[null,521116591,1922218577,"ADRIENNE  WEBB","215 BLOOMINGDALE AVE","FEDERALSBURG","MD",21632,"DENTAL","General Dentist"]
[null,460793453,1275054066,"SARA E SOUMEEH","27421 TOURNEY RD STE 100","VALENCIA","CA",91355,"DENTAL","Endodontist"]
[null,921917009,1639566235,"SABRINA Y STEFFEY","333 E CITY AVE STE IL43","BALA CYNWYD","PA",19004,"DENTAL","General Dentist"]
[null,232690496,1902532799,"ADAM  STEFANOWICZ","3443 HUNTINGDON PIKE","HUNTINGDON VALLEY","PA",19006,"DENTAL","General Dentist"]
[null,824852513,1447327838,"KIONO LANCE BARNES","209 LAMEUSE ST","BILOXI","MS",39530,"DENTAL","General Dentist"]
[null,561580925,1659507952,"SARAH  PROULX","811 EAST NORTH FIRST ST","SENECA","SC",29678,"DENTAL","Oral Surgeon"]
[null,592858719,1366528671,"DEWEY L BRACY","7755 38TH AVE N","SAINT PETERSBURG","FL",33710,"DENTAL","General Dentist"]
[null,270220903,1528147139,"HEATHER A TAYLOR","1001 W BALTIMORE ST","MCMECHEN","WV",26040,"DENTAL","General Dentist"]
[null,204376918,1538372941,"BLAKE J THOMPSON","969 E DEL WEBB BLVD","SUN CITY CENTER","FL",33573,"DENTAL","General Dentist"]
[null,593788140,1063702207,"STEVEN R SCHMID","256 MCLEOD ST","MERRITT ISLAND","FL",32953,"DENTAL","General Dentist"]
[null,200766428,1366932048,"AARON H MONTGOMERY","16772 W BELL RD STE 100","SURPRISE","AZ",85374,"DENTAL","General Dentist"]
[null,824658083,1841629045,"SWETHA  BUDDA","102 WHITE HORSE RD W STE 101","VOORHEES","NJ","08043","DENTAL","General Dentist"]
[null,464213832,1154996601,"TYLER A ROLLAND","1950 W KENOSHA ST","BROKEN ARROW","OK",74012,"DENTAL","General Dentist"]
[null,873569969,1114047032,"PAUL D ELLINGTON","44115 WOODRIDGE PKWY STE 280","LEESBURG","VA",20176,"DENTAL","General Dentist"]
[null,592137047,1164656047,"JOHN P RITOTA","3401 S FEDERAL HWY","DELRAY BEACH","FL",33483,"DENTAL","General Dentist"]
[null,200510393,1417976465,"SUET  WU","3808 BELL BLVD STE 7","BAYSIDE","NY",11361,"DENTAL","Pediatric Dentist"]
[null,650720468,1831303783,"ANTHONY RICHARD MENENDEZ","4120 TAMIAMI TRL STE A","PORT CHARLOTTE","FL",33952,"DENTAL","General Dentist"]
[null,871491202,1962882654,"ALEXA K VINSON","7820 SHRADER RD","RICHMOND","VA",23294,"DENTAL","General Dentist"]
[null,465108932,1073854949,"JEFFREY  NG","24 W 14TH ST","NEW YORK","NY",10011,"DENTAL","General Dentist"]
[null,521239878,1306587530,"THOMAS  TRAN","22 MONTGOMERY VILLAGE AVE","GAITHERSBURG","MD",20879,"DENTAL","General Dentist"]
[null,591302340,1629196183,"MATTHEW W ALLEN","1871 COLONIAL BLVD STE 101","FORT MYERS","FL",33907,"DENTAL","General Dentist"]
[null,200185918,1821441940,"ALEJANDRA  GONZALEZ FERGUSON","6340 N WICKHAM RD UNIT 101","MELBOURNE","FL",32940,"DENTAL","General Dentist"]
[null,872961383,1417487984,"BLAIR TIBURCIO SIMEON","1789 BLANDING BLVD","MIDDLEBURG","FL",32068,"DENTAL","General Dentist"]
[null,200501893,1598842486,"EDWARD J CHERMOL","3501 WEST CHESTER PIKE STE 102","NEWTOWN SQUARE","PA",19073,"DENTAL","General Dentist"]
[null,931552941,1376107995,"OLENA  AKBULUT","1500 NORTH KINGS HWY SUITE 100A","CHERRY HILL","NJ","08034","DENTAL","General Dentist"]
[null,860828480,1912890633,"CHI P LE","10615 W THUNDERBIRD BLVD STE B500","SUN CITY","AZ",85351,"DENTAL","General Dentist"]
[null,331338723,1821388471,"KANWAL  AFTAB","224 CLIFTON AVE","COLLINGDALE","PA",19023,"DENTAL","General Dentist"]
[null,271975977,1245408277,"MONIQUE PATRICE HILL","3509 LORNA RD","HOOVER","AL",35216,"DENTAL","General Dentist"]
[null,462931351,1386135960,"MAYA  THOMPSON","2140 VOORHEES TOWN CTR","VOORHEES","NJ","08043","DENTAL","Pediatric Dentist"]
[null,571112922,1508838921,"ROBERT H NIEDERS","139 WHITEFORD WAY","LEXINGTON","SC",29072,"DENTAL","General Dentist"]
[null,880852585,1952650095,"PING SEUNG ALICE  WU","7901 ACC BLVD STE 100","RALEIGH","NC",27617,"DENTAL","Periodontist"]
[null,"043185014",1861740722,"JONATHAN L CZEREPAK","241 STATION AVE","SOUTH YARMOUTH","MA","02664","DENTAL","Oral Surgeon"]
[null,815314193,1972522530,"GREGORY  PYLE","501 ANGLERS DR STE 101","STEAMBOAT SPRINGS","CO",80487,"DENTAL","Oral Surgeon"]
[null,591488568,1134376379,"OSCAR  MOREJON","815 N NOVA RD","DAYTONA BEACH","FL",32117,"DENTAL","General Dentist"]
[null,650047437,1235100645,"CAROL W STEVENS","19180 QUESADA AVE","PORT CHARLOTTE","FL",33948,"DENTAL","General Dentist"]
[null,823603241,1497840870,"AMRITPAL S JOHAR","4 PALISADES DR STE 250","ALBANY","NY",12205,"DENTAL","Oral Surgeon"]
[null,821903009,1609284017,"JUSTIN  ZIMMER","513 CROSS KEYS RD","SICKLERVILLE","NJ","08081","DENTAL","General Dentist"]
[null,880974653,1346418241,"JONATHAN L VOINER","2 INDUSTRIAL BLVD BULDING C STE 125","PAOLI","PA",19301,"DENTAL","Oral Surgeon"]
[null,208919640,1669090627,"KYLE  DURANTE","101 W MAIN ST","NEW HOLLAND","PA",17557,"DENTAL","General Dentist"]
[null,270639439,1487623138,"LAURENCE R MESTER","468 NC 24 # 87","CAMERON","NC",28326,"DENTAL","General Dentist"]
[null,263800267,1558625954,"AHMED M BORAEY","117 SAINT PATRICKS DR","WALDORF","MD",20603,"DENTAL","General Dentist"]
[null,"042103634",1801952742,"DARA K ROGERS","1 KNEELAND ST 3RD FL","BOSTON","MA","02111","DENTAL","General Dentist"]
[null,994548214,1952914962,"JENNIFER  PYLANT","4105 GATEWAY CT","COLLEYVILLE","TX",76034,"DENTAL","General Dentist"]
[null,990452583,1275272213,"WESLEY  SHAW","1624 TATE BLVD SE","HICKORY","NC",28602,"DENTAL","General Dentist"]
[null,462753484,1811423213,"REGINA  VAYNER","1450 E BOOT RD STE 200D","WEST CHESTER","PA",19380,"DENTAL","General Dentist"]
[null,921459673,1891922860,"JAY  SHUKLA","1340 MATTHEWS TOWNSHIP PKWY STE 101","MATTHEWS","NC",28105,"DENTAL","General Dentist"]
[null,815381424,1316286461,"PALAK  JAIN","9 E HIGHLAND AVE","PHILADELPHIA","PA",19118,"DENTAL","General Dentist"]
[null,680558045,1891718573,"JONATHAN G LOVELL","5331 S SUPERSTITION MTN DR STE 108","GOLD CANYON","AZ",85218,"DENTAL","General Dentist"]
[null,472441136,1992908628,"ANTHONY B NETTEY-MARBELL","7167 OKELLY CHAPEL RD","CARY","NC",27519,"DENTAL","General Dentist"]
[null,871143883,1194125997,"NICHOLAS F CROSSLAND","929 BOWMAN RD STE 100","MOUNT PLEASANT","SC",29464,"DENTAL","General Dentist"]
[null,454417816,1316247497,"MURTUZA  JAFFARI","300 LEXINGTON RD BLDG B-STE 220","SWEDESBORO","NJ","08085","DENTAL","General Dentist"]
[null,463557357,1740414663,"JIGNA ASHISH PATEL","3015 EASTERN BLVD","YORK","PA",17402,"DENTAL","General Dentist"]
[null,873454833,1003548868,"NIARIAH H FIELDS","1197 PEACHTREE ST NE STE 110","ATLANTA","GA",30361,"DENTAL","General Dentist"]
[null,273665487,1649324112,"ALEXANDRE  GHAZAL","1950 LAUREL MANOR DR STE 184","THE VILLAGES","FL",32162,"DENTAL","Endodontist"]
[null,920957214,1073091682,"NICHOLAS  DOVEY","4527 FANUEL ST","SAN DIEGO","CA",92109,"DENTAL","General Dentist"]
[null,811342611,1356756753,"BEI  LI","861 LAFAYETTE RD UNIT 1","HAMPTON","NH","03842","DENTAL","General Dentist"]
[null,231365971,1609498534,"OMAR  ALZEIN","3223 N BROAD ST","PHILADELPHIA","PA",19140,"DENTAL","General Dentist"]
[null,"020331318",1629237672,"CHARLES J SCHMIDT","22 BUNKER HILL ST","LANCASTER","NH","03584","DENTAL","General Dentist"]
[null,991862907,1962241216,"ENRI  PROFKA","670 ROCKHILL DR","BENSALEM","PA",19020,"DENTAL","General Dentist"]
[null,810745814,1215044409,"MARK  DANNER","539 EGG HARBOR RD","SEWELL","NJ","08080","DENTAL","General Dentist"]
[null,873148410,1669049722,"SUNNA  BASHIR","24805 PINEBROOK RD STE 108","CHANTILLY","VA",20152,"DENTAL","Pediatric Dentist"]
[null,472664042,1881611390,"STACEY J ROGERS","7355 POST ROAD","NORTH KINGSTOWN","RI","02852","DENTAL","General Dentist"]
[null,832460760,1689793101,"KENNETH M BLACK","988 OCEAN HWY W","SUPPLY","NC",28462,"DENTAL","General Dentist"]
[null,650719035,1568190189,"TINA  TOFIGHI","930 N CONGRESS AVE STE 200","BOYNTON BEACH","FL",33426,"DENTAL","General Dentist"]
[null,200418100,1801947718,"BRENT M SONGSTAD","3819 CLEGHORN AVE","NASHVILLE","TN",37215,"DENTAL","General Dentist"]
[null,471101244,1861842841,"ASHLEY  COFFEY","1655 SOUTHGATE AVE STE 200","DALY CITY","CA",94015,"DENTAL","Oral Surgeon"]
[null,392799807,1134744063,"CHINTAN D SHUKLA","104 BALTIMORE PIKE","SPRINGFIELD","PA",19064,"DENTAL","General Dentist"]
[null,820562632,1598848889,"MATTHEW  MASTROROCCO","4101 MAIN ST STE D","HILTON HEAD ISLAND","SC",29926,"DENTAL","General Dentist"]
[null,331685530,1427084581,"ARIAN L RAY","625 CONSTITUTION DR","SUMTER","SC",29154,"DENTAL","General Dentist"]
[null,352215163,1578572434,"CATHY L GRAVES","6410 THORNBERRY CT STE B","MASON","OH",45040,"DENTAL","General Dentist"]
[null,204592436,1942315262,"JAREN ORR CATLIN","4447 CAMINO REAL WAY","FORT MYERS","FL",33966,"DENTAL","General Dentist"]
[null,933301655,1326120569,"JESSICA  BAKER","5 EAST GREEN STREET","MIDDLETOWN","DE",19709,"DENTAL","General Dentist"]
[null,842656919,1568661155,"JILLIAN B WOLSKE","4700 NEW CENTRE DR","WILMINGTON","NC",28405,"DENTAL","General Dentist"]
[null,832751085,1144809278,"SHIVM A SHAH","26 KINGS HWY W","HADDONFIELD","NJ","08033","DENTAL","General Dentist"]
[null,541321315,1396798468,"ALLEN H WHITE","501 21ST ST","VIRGINIA BEACH","VA",23451,"DENTAL","General Dentist"]
[null,462158764,1306545827,"CHRISTY  YARMOSKY","51 FALLON AVE","SEAFORD","DE",19973,"DENTAL","Pediatric Dentist"]
[null,208282363,1285744151,"R JEFFREY  WALLACE","11135 CHAPMAN HWY","SEYMOUR","TN",37865,"DENTAL","General Dentist"]
[null,921996297,1326416587,"ANGELICA  MENA","3420 WARM SPRINGS AVE","THE VILLAGES","FL",32163,"DENTAL","General Dentist"]
[null,743001964,1932204419,"MARY E HIGGINS","16905 BLANCO RD","SAN ANTONIO","TX",78232,"DENTAL","General Dentist"]
[null,463561625,1730209826,"RUSHABH  SHAH","2277 HIGHWAY 33 STE 412","HAMILTON","NJ","08690","DENTAL","General Dentist"]
[null,112831022,1174617591,"MARK  MOLINSKY","6766 108TH ST STE B","FOREST HILLS","NY",11375,"DENTAL","General Dentist"]
[null,844823826,1386487437,"CADE C NYKAMP","770 BROADMOOR BLVD NE","RIO RANCHO","NM",87124,"DENTAL","General Dentist"]
[null,650965650,1811038680,"DUANE E KEUNING","13700 US HIGHWAY 1 STE 201","JUNO BEACH","FL",33408,"DENTAL","General Dentist"]
[null,199365010,1548340664,"DONALD C HOGAN","1265 WAYNE AVE STE 300","INDIANA","PA",15701,"DENTAL","General Dentist"]
[null,454146717,1588993281,"JAROD L WALLS","1500 GRANT ST","PORTSMOUTH","OH",45662,"DENTAL","General Dentist"]
[null,232957700,1265524904,"PETER C CERTO","2940 CONCORD RD STE A","ASTON","PA",19014,"DENTAL","General Dentist"]
[null,822613115,1386656965,"THOMAS C MILLER","2300 WOODFOREST PKWY N STE 700","MONTGOMERY","TX",77316,"DENTAL","General Dentist"]
[null,842656919,1962598201,"CHRISTOPHER A COMPTON","5413 WATERGRASS DR","WILMINGTON","NC",28412,"DENTAL","General Dentist"]
[null,851103309,1851969620,"BRANDON S BRUE","1010 N NARCOOSSEE RD","SAINT CLOUD","FL",34771,"DENTAL","General Dentist"]
[null,463099774,1689884561,"MIRYAM  BOOKMAN","180 N COUNTY LINE RD STE D","JACKSON","NJ","08527","DENTAL","General Dentist"]
[null,541590300,1558689240,"TIFFANY L WILLIAMS","2924 BROOK RD","RICHMOND","VA",23220,"DENTAL","Pediatric Dentist"]
[null,834348159,1740322296,"GREGORY M SHUPIK","1910 EAST MARLTON PIKE STE 2","CHERRY HILL","NJ","08003","DENTAL","Periodontist"]
[null,200185918,1740025576,"KARLA  ESTRADA","250 PALM COAST PKWY NE UNIT 1302","PALM COAST","FL",32137,"DENTAL","General Dentist"]
[null,"010391306",1649305822,"FRANK J MUSCIANO","1250 FOREST AVE","PORTLAND","ME","04103","DENTAL","Prosthodontist"]
[null,920833073,1285753145,"ANNE P ANNONE","414 CAPITOL TRL","NEWARK","DE",19711,"DENTAL","General Dentist"]
[null,833643900,1710553144,"NICOLA A GABRIELE STRONG","6025 S SUNBURY RD","WESTERVILLE","OH",43081,"DENTAL","General Dentist"]
[null,464870279,1285856427,"JOHN J LEE","2088 SCENIC HIGHWAY NORTH","SNELLVILLE","GA",30078,"DENTAL","Periodontist"]
[null,994689102,1942835822,"AMANDA  VEDROS","7111 GEORGE WASHINGTON MEMORIAL HWY","GLOUCESTER","VA",23061,"DENTAL","General Dentist"]
[null,921622520,1720547268,"JESSICA  STARNES","360 W WESMARK BLVD","SUMTER","SC",29150,"DENTAL","General Dentist"]
[null,581292216,1407551906,"JEROME  RAWLS","3823 ROSWELL RD STE 205","MARIETTA","GA",30062,"DENTAL","General Dentist"]
[null,274460344,1619196706,"NORMA JEANNE APPELBAUM","1519 SE 47TH ST","CAPE CORAL","FL",33904,"DENTAL","General Dentist"]
[null,474382259,1285929885,"LINDSEY HILL WARNER","303 HOSPITAL RD","STARKVILLE","MS",39759,"DENTAL","General Dentist"]
[null,823991290,1942995535,"KAMAR  KRAYEM","8919 RIDGE AVE STE 9","PHILADELPHIA","PA",19128,"DENTAL","General Dentist"]
[null,521468600,1518960129,"PAUL E FEILD","12619 HARFORD RD","FORK","MD",21051,"DENTAL","General Dentist"]
[null,208521225,1982884649,"GREGORY  STEPHENS","5950 SPRUCE ST","PHILADELPHIA","PA",19139,"DENTAL","General Dentist"]
[null,883848002,1356109151,"FARAJ  HASAN","2106 CHARLOTTE AVE","NASHVILLE","TN",37203,"DENTAL","General Dentist"]
[null,452652472,1790914729,"OTISHA JULIANNE PRESTON-HILL","6095 PROFESSIONAL PKWY STE B103","DOUGLASVILLE","GA",30134,"DENTAL","General Dentist"]
[null,204814810,1578642807,"BRADFORD G YOUNG","1275 S CEDAR CREST BLVD","ALLENTOWN","PA",18103,"DENTAL","General Dentist"]
[null,261558797,1215017306,"BRIAN L CARINO","7915 LAKE MANASSAS DR STE 201","GAINESVILLE","VA",20155,"DENTAL","General Dentist"]
[null,862769826,1558056507,"JUJHAAR  VIRK","4 JACOBSTOWN RD","NEW EGYPT","NJ","08533","DENTAL","General Dentist"]
[null,473047634,1437308590,"RUTH K DUCHATELLER-CANGE","14540 JOHN MARSHALL HWY STE 103","GAINESVILLE","VA",20155,"DENTAL","General Dentist"]
[null,521860379,1972276590,"SILWAT  ADEEL","12165 ELM ST","PRINCESS ANNE","MD",21853,"DENTAL","General Dentist"]
[null,814239209,1902932809,"TOMICKA  JACKSON-GEORGE","1030 N CHARLES ST STE B","BALTIMORE","MD",21201,"DENTAL","General Dentist"]
[null,843631502,1386032597,"AHMED M MATRI","8209 SUDLEY RD STE 2","MANASSAS","VA",20109,"DENTAL","Endodontist"]
[null,473991102,1831507698,"JARED C APPEL","8270 YOUNGSTOWN PITTSBURGH RD","POLAND","OH",44514,"DENTAL","General Dentist"]
[null,310855624,1174151831,"EVAN  HODEL","4575 WINCHESTER PIKE","COLUMBUS","OH",43232,"DENTAL","General Dentist"]
[null,593365515,1881705473,"NANCY L HAVENS","237 E INTERNATIONAL SPEEDWAY BLVD STE 1B","DELAND","FL",32724,"DENTAL","General Dentist"]
[null,862496016,1093457699,"JESSICA  WEARS","1501 S CLINTON ST STE 335","BALTIMORE","MD",21224,"DENTAL","General Dentist"]
[null,233053736,1619984333,"BRIAN S THOMAS","3102 E MARKET ST","YORK","PA",17402,"DENTAL","General Dentist"]
[null,203278869,1932280500,"EHFAD M SHAH","44600 W SMITH ENKE RD STE 103","MARICOPA","AZ",85139,"DENTAL","General Dentist"]
[null,843810705,1124187653,"INNA  VINNIKOV","410 EXECUTIVE DR","LANGHORNE","PA",19047,"DENTAL","General Dentist"]
[null,853598300,1184362386,"ADAM W GRAY","3404 S DALE MABRY HWY","TAMPA","FL",33629,"DENTAL","General Dentist"]
[null,842464644,1962554824,"ELISE  PENAFIEL","7425 BALTIMORE ANNAPOLIS BLVD STE 102","GLEN BURNIE","MD",21061,"DENTAL","General Dentist"]
[null,311394978,1275641276,"MATTHEW A CORCORAN","317 READING RD","MASON","OH",45040,"DENTAL","General Dentist"]
[null,873209909,1710667860,"ANGELA K VILAMONH","3900 S SUNCOAST BLVD","HOMOSASSA","FL",34448,"DENTAL","General Dentist"]
[null,455245077,1912219759,"ERIN S BERLING","5710 US HIGHWAY 98 N","LAKELAND","FL",33809,"DENTAL","Pediatric Dentist"]
[null,900003639,1770632820,"NAVNEET S CHHATWAL","3435 BOX HILL CORPORATE CENTER DR STE E","ABINGDON","MD",21009,"DENTAL","General Dentist"]
[null,821422802,1689056400,"JASON J WATTS","5269 69TH ST E","PALMETTO","FL",34221,"DENTAL","General Dentist"]
[null,200766428,1841318508,"NICHOLAS P ROLFE","16772 W BELL RD STE 100","SURPRISE","AZ",85374,"DENTAL","General Dentist"]
[null,208583179,1619177755,"ARLENE M OLDHAM","636 F LONG POINT RD","MT PLEASANT","SC",29464,"DENTAL","General Dentist"]
[null,200185918,1427677301,"ABD ALRAHMAN  KARA HAMMOUDEH","4232 E COUNTY ROAD 466 STE 101","OXFORD","FL",34484,"DENTAL","General Dentist"]
[null,822272495,1184465742,"KAREEM  MOUSTAFA","553 SHILOH PIKE","BRIDGETON","NJ","08302","DENTAL","General Dentist"]
[null,822367486,1104928449,"MICHAEL D ARNETTE","3020 S MIAMI BLVD STE B","DURHAM","NC",27703,"DENTAL","Oral Surgeon"]
[null,273339417,1063728012,"MICHAEL D BURGARDT","410 E LUDINGTON AVE","LUDINGTON","MI",49431,"DENTAL","General Dentist"]
[null,832876455,1942939830,"MAXIE G JOLLEY","208 PROFESSIONAL CIR","MOREHEAD CITY","NC",28557,"DENTAL","General Dentist"]
[null,203069252,1649200445,"F JAESON  REPSCHER","682 S FERGUSON AVE STE 3","BOZEMAN","MT",59718,"DENTAL","General Dentist"]
[null,871427935,1679959753,"SANJEEDA I HAKIM","214 N CHESTER PIKE","GLENOLDEN","PA",19036,"DENTAL","General Dentist"]
[null,820589201,1457792020,"KAMLESH M PATEL","1091 GENERAL KNOX RD","WASHINGTON CROSSING","PA",18977,"DENTAL","General Dentist"]
[null,237221025,1093933244,"LEONARD M JENSEN","501 S 54TH ST FL 2NW","PHILADELPHIA","PA",19143,"DENTAL","General Dentist"]
[null,273801943,1841784303,"BRANDON  GRUBIC","307 MAPLE AVE W STE A","VIENNA","VA",22180,"DENTAL","General Dentist"]
[null,"020654757",1669881678,"GARRETT SPENCER MCDOWELL","101 JOHN ROBERT THOMAS DR","EXTON","PA",19341,"DENTAL","General Dentist"]
[null,475434669,1861005613,"HUNTER B FREITAS","10185 OCEAN HWY UNIT B","PAWLEYS ISLAND","SC",29585,"DENTAL","General Dentist"]
[null,651008982,1831260918,"HECTOR  GUZMAN","2758 N ROOSEVELT BLVD","KEY WEST","FL",33040,"DENTAL","General Dentist"]
[null,221909919,1386809952,"STEVEN I RYU","292 HURFFVILLE GRENLOCH RD","SEWELL","NJ","08080","DENTAL","Endodontist"]
[null,591299709,1548209216,"JOSHUA V CHAPMAN","210 JACKSON AVE","SATELLITE BEACH","FL",32937,"DENTAL","General Dentist"]
[null,222004723,1780173955,"SANDY  HA","400 N CHURCH ST STE 140","MOORESTOWN","NJ","08057","DENTAL","Oral Surgeon"]
[null,951959423,1497242549,"JACOB THOMAS TAYLOR","150 W MADISON AVE","EL CAJON","CA",92020,"DENTAL","Oral Surgeon"]
[null,464267559,1730319302,"JESSE C BRADFORD","319 S SHARON AMITY RD STE 100","CHARLOTTE","NC",28211,"DENTAL","General Dentist"]
[null,593659078,1013093210,"JAMIE W ODOM","375 E CENTRAL AVE STE 361","WINTER HAVEN","FL",33880,"DENTAL","General Dentist"]
[null,521553957,1760570584,"DAVID L REVER","13915 OLD COLUMBIA PIKE","SILVER SPRING","MD",20904,"DENTAL","General Dentist"]
[null,200185918,1093378192,"AYZA  MAHMOOD","6019 US HIGHWAY 17 92 N","DAVENPORT","FL",33896,"DENTAL","General Dentist"]
[null,921537914,1285244400,"ALEJANDRA M RIERA DE JESUS","539 MEDICAL OAKS AVE UNIT 2","BRANDON","FL",33511,"DENTAL","General Dentist"]
[null,455614682,1710187620,"THOMAS  ZAHAVI","1815 S CLINTON AVE STE 510","ROCHESTER","NY",14618,"DENTAL","General Dentist"]
[null,262883126,1386715167,"FADI S EL-TAMIMI","3727 EASTON MARKET","COLUMBUS","OH",43219,"DENTAL","General Dentist"]
[null,450713714,1598394116,"FANCHON A JAMES","1024 HWY A1A #108","SATELLITE BEACH","FL",32937,"DENTAL","General Dentist"]
[null,874453609,1023503646,"ALEXA L SICHER","162A TREXLER AVE","KUTZTOWN","PA",19530,"DENTAL","General Dentist"]
[null,851397345,1689300378,"INNOCENT C NWANYA","1708 ROUTE 47","RIO GRANDE","NJ","08242","DENTAL","General Dentist"]
[null,473605243,1528148780,"THOMAS P DUDAS","1575 HIGHLANDS DR STE 100","LITITZ","PA",17543,"DENTAL","General Dentist"]
[null,262538481,1043359904,"MINDY  HUANG-GAO","100 W EL CAMINO REAL STE 78","MOUNTAIN VIEW","CA",94040,"DENTAL","General Dentist"]
[null,333518312,1447799028,"MEGAN  LARAWAY","613 DUTCHMANS LANE","EASTON","MD",21601,"DENTAL","General Dentist"]
[null,433764238,1033243449,"RODRIC E CASCIO","1601 ROYAL AVE","MONROE","LA",71201,"DENTAL","General Dentist"]
[null,261503707,1104912559,"DAVID C WEIGLE","800 HERITAGE DR STE 811","POTTSTOWN","PA",19464,"DENTAL","General Dentist"]
[null,223307794,1265844492,"TRAVIS W REED","6 SAND HILL RD STE 301","FLEMINGTON","NJ","08822","DENTAL","Oral Surgeon"]
[null,202789868,1497963649,"DON K ROBERTS","1700 17TH ST NW STE 302","WASHINGTON","DC",20009,"DENTAL","General Dentist"]
[null,993945661,1689697914,"SARA L LAMICHANE","2 S BROAD ST","LITITZ","PA",17543,"DENTAL","General Dentist"]
[null,333285783,1063593754,"JOHN S THOMPSON","173 WEST ST","ESSEX JCT","VT","05452","DENTAL","General Dentist"]
[null,823872990,1457580763,"MARK W HAWN","2025 W PINE ST","SANDPOINT","ID",83864,"DENTAL","General Dentist"]
[null,465329631,1083927214,"KANWARPAL  SINGH","419 MIDDLE TPKE W","MANCHESTER","CT","06040","DENTAL","General Dentist"]
[null,933555642,1972252062,"EMILY  SCHUPP","240 MONMOUTH RD","OAKHURST","NJ","07755","DENTAL","General Dentist"]
[null,822377835,1316460066,"ROBERT V POLLAN","517 N LAKE ST","MADISON","WI",53703,"DENTAL","General Dentist"]
[null,934330346,1477168102,"HOLLIE  PASCHKE","1205 JACARANDA BLVD","VENICE","FL",34292,"DENTAL","General Dentist"]
[null,341793230,1063510055,"JILL M HARTER","18224 DETROIT AVE","LAKEWOOD","OH",44107,"DENTAL","General Dentist"]
[null,871883476,1194763078,"HEATHER L HAYS","321 NOKOMIS AVE SOUTH STE A","VENICE","FL",34285,"DENTAL","General Dentist"]
[null,237047824,1356630552,"ELIZABETH A POLECK","601 NEW CASTLE AVE","WILMINGTON","DE",19801,"DENTAL","General Dentist"]
[null,231365971,1457792020,"KAMLESH M PATEL","3223 N BROAD ST","PHILADELPHIA","PA",19140,"DENTAL","General Dentist"]
[null,992584417,1922196096,"SREEKANTH  EMANI","15 LEE AIRPARK DR STE 100","EDGEWATER","MD",21037,"DENTAL","General Dentist"]
[null,862974213,1902172505,"FREDERICK L TESCHNER","212 WILLOW VALLEY LAKES DRIVE Suite 209","WILLOW STREET","PA",17584,"DENTAL","General Dentist"]
[null,233101899,1831400308,"ANTHONY M BIANCHI","50 S PROVIDENCE RD","MEDIA","PA",19063,"DENTAL","Oral Surgeon"]
[null,853976565,1629097605,"CHARLES J GATTI","7505 W DEER VALLEY RD STE 140","PEORIA","AZ",85382,"DENTAL","General Dentist"]
[null,863627829,1942680582,"KRISTEN L SUMRALL","303 S ARCHUSA AVE STE B","QUITMAN","MS",39355,"DENTAL","General Dentist"]
[null,263935115,1013267954,"ERIC M BLASINGAME","384 HARTNELL AVE STE A","REDDING","CA",96002,"DENTAL","Periodontist"]
[null,412054015,1720173230,"SANTOSH  MITTAL","255 GORDON DR STE 100","EXTON","PA",19341,"DENTAL","General Dentist"]
[null,271226915,1750012472,"STEPHEN  GILBO","1954 FRUITVILLE PIKE","LANCASTER","PA",17601,"DENTAL","General Dentist"]
[null,475170078,1558646000,"JOSHUA K GIROD","3535 PERKINS RD STE 345","BATON ROUGE","LA",70808,"DENTAL","General Dentist"]
[null,992635267,1710407838,"SUBEA N HIJAZI","2690 E HIGHWAY 290 STE 400","DRIPPING SPRINGS","TX",78620,"DENTAL","General Dentist"]
[null,272746538,1952413569,"DOMENIC  BAGLIVO","100 E LANCASTER AVE STE 203W","WYNNEWOOD","PA",19096,"DENTAL","General Dentist"]
[null,232932653,1407385693,"SARAH C GRECH","3805 WASHINGTON RD","MCMURRAY","PA",15317,"DENTAL","General Dentist"]
[null,352492260,1538717186,"SAMANTHA R AYALA","1745 WEST 17TH AVE","EUGENE","OR",97402,"DENTAL","General Dentist"]
[null,821996095,1679619779,"LEAH K LOVETT","96425 PINE GROVE RD","FERNANDINA BEACH","FL",32034,"DENTAL","General Dentist"]
[null,593051299,1679972517,"SARAH  SOLTAU","1805 LAKELAND HILLS BLVD","LAKELAND","FL",33805,"DENTAL","General Dentist"]
[null,990230738,1356413553,"HANNAH A LEWIS","1325 S KIHEI RD STE 102B","KIHEI","HI",96753,"DENTAL","General Dentist"]
[null,200120892,1861952830,"VERONICA  KRAYNIK","319 N POTTSTOWN PIKE STE 100","EXTON","PA",19341,"DENTAL","Pediatric Dentist"]
[null,721535493,1245814003,"NEAL NAINESH PATEL","1220 W CHESTER PIKE","HAVERTOWN","PA",19083,"DENTAL","Pediatric Dentist"]
[null,201543822,1568078798,"NIRAV  PATEL","240 MIDDLETOWN BLVD STE 100","LANGHORNE","PA",19047,"DENTAL","General Dentist"]
[null,204686386,1588613137,"BRYAN A MUDD","6865 FAIRVIEW RD STE A","CHARLOTTE","NC",28210,"DENTAL","General Dentist"]
[null,800948009,1720128457,"RUSSELL C YOUNG","1 DANIEL BURNHAM CT STE 305C","SAN FRANCISCO","CA",94109,"DENTAL","General Dentist"]
[null,341212579,1326184953,"ANDREW A PETERSON","215 JUSTICE ST","FREMONT","OH",43420,"DENTAL","General Dentist"]
[null,592209155,1457612228,"KELLY NEDIMYER ACKLEY","1530 PINEHURST DR","SPRING HILL","FL",34606,"DENTAL","General Dentist"]
[null,455402141,1801380134,"RYAN C SHUCK","2142 GREAT NECK SQ","VIRGINIA BEACH","VA",23454,"DENTAL","General Dentist"]
[null,200185918,1023579117,"GERMAN G OBANDO","1980 US HIGHWAY 1 S","SAINT AUGUSTINE","FL",32086,"DENTAL","General Dentist"]
[null,"020780816",1164629010,"ADAM J SALZBERG","41 S MEDICAL PARK DR SUITE 110","FISHERSVILLE","VA",22939,"DENTAL","General Dentist"]
[null,180548845,1851448914,"CARSON V BROWN","550 MCELHATTAN DR","MC ELHATTAN","PA",17748,"DENTAL","General Dentist"]
[null,204943358,1568485282,"RONALD MICHAEL ACHONG","3180 CITRUS TOWER BLVD","CLERMONT","FL",34711,"DENTAL","Oral Surgeon"]
[null,231995431,1174806087,"NANCY  BIEN","5629 VINE ST STE C9","PHILADELPHIA","PA",19139,"DENTAL","Pediatric Dentist"]
[null,833120460,1063069870,"IMAD I ALASIBI","1221 CHAPIN RD STE A","CHAPIN","SC",29036,"DENTAL","General Dentist"]
[null,473720730,1407916240,"HIRANT  BICAKCI","3138 N LINCOLN AVE","CHICAGO","IL",60657,"DENTAL","General Dentist"]
[null,"020666404",1902077126,"KEITH  PROGEBIN","1145 19TH ST NW STE 600","WASHINGTON","DC",20036,"DENTAL","General Dentist"]
[null,208643759,1922127232,"FIRST STATE ORAL &  MAX SURGERY CORP","1004 S STATE ST STE 1","DOVER","DE",19901,"DENTAL","General Dentist"]
[null,461340617,1639263874,"ROGER H STRAUSE","803 ESTELLE DR","LANCASTER","PA",17601,"DENTAL","General Dentist"]
[null,882233683,1962633073,"JAMES P MURPHY","1834 OREGON PIKE STE 21","LANCASTER","PA",17601,"DENTAL","Oral Surgeon"]
[null,203296691,1164152591,"VIVIANA  PORTILLO","2675 E CUMBERLAND ST","PHILADELPHIA","PA",19125,"DENTAL","General Dentist"]
[null,270514423,1144248287,"MARK D CALLAWAY","6401 TOWER AVE","SUPERIOR","WI",54880,"DENTAL","General Dentist"]
[null,271565534,1407969900,"JOSEPH A MURPHY","151 DEEP WOOD DR","ROUND ROCK","TX",78681,"DENTAL","General Dentist"]
[null,261516343,1811544505,"JACLYN  KILBY","5640 CLAYTON CIRCLE","ROSCOE","IL",61073,"DENTAL","General Dentist"]
[null,621208257,1891838512,"DAN D HARRIS","102 WOODMONT BLVD STE 310","NASHVILLE","TN",37205,"DENTAL","Periodontist"]
[null,451266532,1508278128,"APRIL M DIETZ","4405 HIGHWAY 17 BYPASS","MURRELLS INLET","SC",29576,"DENTAL","General Dentist"]
[null,453344047,1689417776,"CHANDNI  GROVER","230 BUTLER RD","FREDERICKSBURG","VA",22405,"DENTAL","General Dentist"]
[null,541186353,1639609571,"JENNIFER M TRAN","12040 W BROAD ST","HENRICO","VA",23233,"DENTAL","General Dentist"]
[null,262276712,1912023102,"HOWARD N WIMMER","39 BROADWAY RM 2115","NEW YORK","NY",10006,"DENTAL","General Dentist"]
[null,882805333,1013444728,"MICHELLE  CRABTREE","1 STEAMBATH STE A","ENNIS","MT",59729,"DENTAL","General Dentist"]
[null,844510703,1699329789,"DHANIKA D PATEL","8420 PARK RD","CHARLOTTE","NC",28210,"DENTAL","General Dentist"]
[null,861535819,1629196431,"ELON T ELISHA","658 W CUTHBERT BLVD","WESTMONT","NJ","08108","DENTAL","General Dentist"]
[null,993123146,1285483677,"YUQIAO  ZHOU","420 E ORANGE ST","SHIPPENSBURG","PA",17257,"DENTAL","General Dentist"]
[null,383850699,1760163265,"RACHEL D OGLESBY","202 WB MCLEAN DR","CAPE CARTERET","NC",28584,"DENTAL","General Dentist"]
[null,900432171,1104231497,"ERIC R ROSE","5000 W CLEARWATER AVE","KENNEWICK","WA",99336,"DENTAL","General Dentist"]
[null,200120892,1235475666,"EDWARD  GARJARIAN","2901 DUTTON MILL RD STE 210","ASTON","PA",19014,"DENTAL","Pediatric Dentist"]
[null,800669486,1619084597,"JAMES D MANNING","3582 BRODHEAD RD","MONACA","PA",15061,"DENTAL","Periodontist"]
[null,920872729,1932281284,"MICHAEL D MCLEARY","510 ENGLE DR SE","RUSSELLVILLE","AL",35653,"DENTAL","General Dentist"]
[null,222703457,1740625094,"JOSEPH T FACCIOLO","4500 LINDEN HILL RD","WILMINGTON","DE",19808,"DENTAL","Orthodontist"]
[null,202870310,1699832618,"TIMOTHY J PRUETT","15820 DORA AVE STE A","TAVARES","FL",32778,"DENTAL","General Dentist"]
[null,450521657,1275708174,"JOSEPH F KLINGES","270 LANCASTER AVE STE I2","MALVERN","PA",19355,"DENTAL","General Dentist"]
[null,232149723,1952693012,"JOSEPH ANDREW SEARCH","17 WATERFORD DR","MECHANICSBURG","PA",17050,"DENTAL","General Dentist"]
[null,593502843,1295996767,"KIRK JAMES SNYDER","34 S BALDWIN AVE","ARCADIA","FL",34266,"DENTAL","General Dentist"]
[null,814309174,1578810313,"SNIGDHA  SRIVASTAVA","509 ORANGE ST","NEWARK","NJ","07107","DENTAL","General Dentist"]
[null,844503272,1477951721,"ALEX SUNG TAK  KIM","8899 UNIVERSITY CENTER LN STE 180","SAN DIEGO","CA",92122,"DENTAL","General Dentist"]
[null,474649195,1669994703,"RYAN A MATTHEWS","11840 SOUTHMORE DR STE 150","CHARLOTTE","NC",28277,"DENTAL","Prosthodontist"]
[null,223270751,1265579056,"MARKO  JEFTIC","188 FRIES MILL RD STE G1","TURNERSVILLE","NJ","08012","DENTAL","General Dentist"]
[null,262506786,1811125305,"MATTHEW J LANG","5596 ROUTE 309","CENTER VALLEY","PA",18034,"DENTAL","General Dentist"]
[null,204972796,1598052128,"SAPNA  ADAPPA","1659 N CLYDE MORRIS BLVD","DAYTONA BEACH","FL",32117,"DENTAL","General Dentist"]
[null,824013302,1851412746,"LENORE  KILLIAN-NORRIS","801 RT 73 N STE A","MARLTON","NJ","08053","DENTAL","General Dentist"]
[null,842464644,1326650904,"DIANA O TENNEY","23140 MOAKLEY ST STE 5","LEONARDTOWN","MD",20650,"DENTAL","General Dentist"]
[null,383652805,1083889661,"AMY D KUHMICHEL","3280 HOWELL MILL RD NW STE 221","ATLANTA","GA",30327,"DENTAL","Oral Surgeon"]
[null,264792089,1679718332,"GEORGES M BANDELAC","500 EVERGREEN DR STE 11","GLEN MILLS","PA",19342,"DENTAL","General Dentist"]
[null,460632126,1225384522,"STEPHANIE  SWETT","132 BAYSIDE RD","ELLSWORTH","ME","04605","DENTAL","Hygienist"]
[null,"061001051",1245868686,"LINDSEY  CHUN","250 LAMBERTON RD","WINDSOR","CT","06095","DENTAL","General Dentist"]
[null,208715116,1720630338,"STEVEN G DIFFEE","130 DONELSON PIKE","NASHVILLE","TN",37214,"DENTAL","General Dentist"]
[null,200478116,1861466146,"MATTHEW B TONIOLI","6755 E SUPERSTITION SPRINGS BLVD STE 101","MESA","AZ",85206,"DENTAL","Endodontist"]
[null,811060963,1336429281,"ASHKAN  YOUSEFI","900 N RANDOLPH ST STE 103","ARLINGTON","VA",22203,"DENTAL","General Dentist"]
[null,270570565,1891984258,"AYHAM  YACOUB","2123 N 1ST AVE STE A2","WHITEHALL","PA",18052,"DENTAL","General Dentist"]
[null,522340745,1073731048,"TAIWO M OSUNKOYA","414 N 6TH ST","DENTON","MD",21629,"DENTAL","General Dentist"]
[null,200185918,1316561814,"SRAVANTHI  TAPAL","27417 US HIGHWAY 27","LEESBURG","FL",34748,"DENTAL","General Dentist"]
[null,814199858,1265116891,"SARAH  PIERCE","5015 HARPETH DR STE A","BRENTWOOD","TN",37027,"DENTAL","General Dentist"]
[null,825378415,1487092300,"LAURA T GARDEN","1938 BRAEBURN DR","SALEM","VA",24153,"DENTAL","Endodontist"]
[null,845021179,1487436267,"SOPHIA M PORACH","1585 SKYLYN DR","SPARTANBURG","SC",29307,"DENTAL","General Dentist"]
[null,872200653,1689105892,"DORIAN C PRICE","4940 W UNIVERSITY DR STE 40","PROSPER","TX",75078,"DENTAL","General Dentist"]
[null,203278869,1356506364,"FAWAD J SHAH","44600 W SMITH ENKE RD STE 103","MARICOPA","AZ",85139,"DENTAL","General Dentist"]
[null,582353722,1497322440,"IVY W WHITE","2928 HWY 17 N","MT. PLEASANT","SC",29466,"DENTAL","General Dentist"]
[null,261792272,1992915730,"THOMAS  CHENG","3765 S HIGHWAY 27","CLERMONT","FL",34711,"DENTAL","General Dentist"]
[null,200120892,1457094146,"VICTORIA  VELAZQUEZ","2901 DUTTON MILL RD STE 210","ASTON","PA",19014,"DENTAL","Pediatric Dentist"]
[null,990735358,1467563668,"KENT P SABA","25229 S SUN LAKES BLVD STE 102","SUN LAKES","AZ",85248,"DENTAL","General Dentist"]
[null,650792047,1396808135,"CRAIG J DEAN","125 CRAWFORD BLVD","BOCA RATON","FL",33432,"DENTAL","General Dentist"]
[null,811144084,1538414156,"AMBER  DEWEERD","633 CEDAR CREEK GRADE","WINCHESTER","VA",22601,"DENTAL","General Dentist"]
[null,825499609,1932397924,"SHAWN N WOLFF","904 SPIVEY RD","WHITEVILLE","NC",28472,"DENTAL","General Dentist"]
[null,231935566,1891928214,"BRIAN S SHAPIRO","9501 ROOSEVELT BLVD STE 207","PHILADELPHIA","PA",19114,"DENTAL","General Dentist"]
[null,550805718,1699929950,"JEREMY K MARTIN","100 MADRID BLVD UNT 414","PUNTA GORDA","FL",33950,"DENTAL","General Dentist"]
[null,593097305,1407697931,"SONIA C DIAZ QUEVEDO","724 LITHIA PINECREST RD","BRANDON","FL",33511,"DENTAL","General Dentist"]
[null,273893870,1558951574,"MATTHEW J SUN","4520 42ND AVE SW STE 23","SEATTLE","WA",98116,"DENTAL","General Dentist"]
[null,921917009,1689792160,"BRUCE M WECHTLER","5280 ROUTE 309","CENTER VALLEY","PA",18034,"DENTAL","General Dentist"]
[null,462783052,1427207588,"STANLEY  JACOB","881 WHALLEY AVE","NEW HAVEN","CT","06515","DENTAL","General Dentist"]
[null,921438462,1194253765,"YAKOV  SHIMUNOV","1665 EAGLE HARBOR PKWY","FLEMING ISLAND","FL",32003,"DENTAL","General Dentist"]
[null,231889724,1295157220,"SARAH  CRAIG","217 KING ST","LAPORTE","PA",18626,"DENTAL","General Dentist"]
[null,843668424,1194826941,"JEROME S LUSTBADER","9131 PISCATAWAY RD STE 739","CLINTON","MD",20735,"DENTAL","General Dentist"]
[null,510109171,1225415441,"EUNICE Y KIM","344 E MAIN ST","NEWARK","DE",19711,"DENTAL","General Dentist"]
[null,223560207,1033561329,"STEPHANIE  SERRANO","401 KINGS HWY S STE 3A","CHERRY HILL","NJ","08034","DENTAL","Endodontist"]
[null,561580925,1811158652,"JENNIFER G LANE","4 VANDERBILT PARK DR STE 210","ASHEVILLE","NC",28803,"DENTAL","Oral Surgeon"]
[null,542025961,1730341025,"JOHN E HOWARD","20304 TIMBERLAKE RD","LYNCHBURG","VA",24502,"DENTAL","General Dentist"]
[null,920464601,1093176984,"ALEAH  CHO","12250 ROCKVILLE PIKE STE 250","ROCKVILLE","MD",20852,"DENTAL","General Dentist"]
[null,883332336,1063549780,"MARK A ROWE","12385 SORRENTO RD STE B1","PENSACOLA","FL",32507,"DENTAL","General Dentist"]
[null,874528215,1407586274,"CHRISTIAN A BLACK","4610 OLEANDER DR STE 201","MYRTLE BEACH","SC",29572,"DENTAL","Endodontist"]
[null,821108995,1811511470,"GEETA  MANDAVILLI","1514 W UNIVERSITY DR","MCKINNEY","TX",75069,"DENTAL","General Dentist"]
[null,900003551,1902007685,"JEFFREY T LOFTUS","5615 NUGGET GULCH DR","RAPID CITY","SD",57702,"DENTAL","General Dentist"]
[null,"043735133",1427508605,"NINA  CRAMER","12161 COUNTY ROAD 103 STE 101","OXFORD","FL",34484,"DENTAL","General Dentist"]
[null,823466634,1467128850,"KATIE  FLYNN","5901 S LOS ALTOS PKWY STE 100","SPARKS","NV",89436,"DENTAL","General Dentist"]
[null,392723051,1124757117,"ROSEMARIE  TORRES","2560 RCA BLVD Ste 110","PALM BEACH GARDENS","FL",33410,"DENTAL","General Dentist"]
[null,463203521,1396339693,"BRIANA E JONES","6140A WOODLAND AVE","PHILADELPHIA","PA",19142,"DENTAL","General Dentist"]
[null,463203521,1396339693,"BRIANA E JONES","6140A WOODLAND AVE","PHILADELPHIA","PA",19142,"DENTAL","General Dentist"]
[null,860712543,1326693912,"BRADEN P HICKS","108 WHIPPLE ST","PRESCOTT","AZ",86301,"DENTAL","General Dentist"]
[null,271852433,1316037468,"NIRAV A PATEL","11841 PALM BEACH BLVD UNIT 115","FORT MYERS","FL",33905,"DENTAL","General Dentist"]
[null,454395247,1255691705,"EMILY  HALLE","5809 NICHOLSON LN STE T123","NORTH BETHESDA","MD",20852,"DENTAL","General Dentist"]
[null,454395247,1629286588,"KIMBERLY A BAER","5809 NICHOLSON LN STE T123","NORTH BETHESDA","MD",20852,"DENTAL","General Dentist"]
[null,262241991,1508948290,"GARY R LIBERATI","509 LONG RD","PITTSBURGH","PA",15235,"DENTAL","General Dentist"]
[null,821596829,1205026283,"BRIGITTE R ZIVKOVIC","6214 OLD FRANCONIA RD STE A","ALEXANDRIA","VA",22310,"DENTAL","General Dentist"]
[null,208643759,1144462649,"FRANKLIN X PANCKO","1004 S STATE ST STE 1","DOVER","DE",19901,"DENTAL","Oral Surgeon"]
[null,464158569,1144920869,"AHMED  BAIOUMY","20 DOWNER AVE STE 2","HINGHAM","MA","02043","DENTAL","General Dentist"]
[null,831075351,1790276392,"STACEY  HOFFMAN","654 W INDIANTOWN RD STE 102","JUPITER","FL",33458,"DENTAL","Pediatric Dentist"]
[null,873220400,1184150815,"DHEEREN  PADHIAR","1202 FOULK RD","WILMINGTON","DE",19803,"DENTAL","General Dentist"]
[null,461110087,1376814723,"NABIL E BEAINI","201 W BROADWAY STE 5","COLUMBIA","MO",65203,"DENTAL","Periodontist"]
[null,453814943,1447498027,"STEPHEN P SHEFFIELD","2521 US ROUTE 11 BX 259","LA FAYETTE","NY",13084,"DENTAL","General Dentist"]
[null,392112030,1104441591,"DAVID  YARMARK","4130 BLOOMFIELD AVE","DREXEL HILL","PA",19026,"DENTAL","General Dentist"]
[null,822272495,1538055439,"ALLAN  WONG","320 EVESBORO MEDFORD RD UNIT 101","MARLTON","NJ","08053","DENTAL","General Dentist"]
[null,822272495,1184465122,"JESSICA  MICALE","320 EVESBORO MEDFORD RD UNIT 101","MARLTON","NJ","08053","DENTAL","General Dentist"]
[null,822272495,1336524396,"EOIN M HALPIN","474 HURFFVILLE CROSSKEYS RD SUITE A","SEWELL","NJ","08080","DENTAL","General Dentist"]
[null,883428155,1992367262,"RONALD DEON LAYTON","3750 CONVOY ST STE 307","SAN DIEGO","CA",92111,"DENTAL","General Dentist"]
[null,932863360,1548575798,"MATTHEW S ROBERTS","2 AMELIA DRIVE","NANTUCKET","MA","02554","DENTAL","General Dentist"]
[null,510214005,1205561354,"JOHN  CLIVE","710 GREENBANK RD","WILMINGTON","DE",19808,"DENTAL","General Dentist"]
[null,208672835,1346894128,"FAYEZ A KHAN","9055 CRESSWIND BLVD STE 100","CHARLOTTE","NC",28215,"DENTAL","General Dentist"]
[null,562118907,1689699084,"GARY J DESALVO","901 N LINDSAY ST","HIGH POINT","NC",27262,"DENTAL","Oral Surgeon"]
[null,830376449,1780747790,"JEFFERY  PENNINGTON","1541 THE GREENS WAY","JACKSONVILLE","FL",32250,"DENTAL","General Dentist"]
[null,223735811,1639542350,"CLAIRE  SPARAGNA","222 NEW ROAD STE 803","LINWOOD","NJ","08221","DENTAL","General Dentist"]
[null,"043721044",1225143167,"DAVID W MAXWELL","4 PEARL DR STE 3","ORMOND BEACH","FL",32174,"DENTAL","General Dentist"]
[null,863736314,1477179109,"LINDA  KORNIENKO","3001 DEL PRADO BLVD S","CAPE CORAL","FL",33904,"DENTAL","General Dentist"]
[null,844784496,1144896812,"BRETT  BIRCH","510 VONDERBURG DR STE 211","BRANDON","FL",33511,"DENTAL","General Dentist"]
[null,232608442,1518978378,"JOHN A COOPER","231 N SHIPPEN ST STE 30","LANCASTER","PA",17602,"DENTAL","General Dentist"]
[null,825069464,1336981539,"ANU  PATEL","1500 JOHN F KENNEDY BLVD STE 1906","PHILADELPHIA","PA",19102,"DENTAL","General Dentist"]
[null,825069464,1083460950,"MEGAN  BRALSKI","1500 JOHN F KENNEDY BLVD STE 1906","PHILADELPHIA","PA",19102,"DENTAL","General Dentist"]
[null,334235926,1336981539,"ANU  PATEL","2340 S 12TH ST","PHILADELPHIA","PA",19148,"DENTAL","General Dentist"]
[null,"042254298",1154617686,"CHRISTOPHER R DESESA","75 VAN DEANE AVE SUITE 201","WEST SPRINGFIELD","MA","01089","DENTAL","Oral Surgeon"]
[null,562185627,1689162448,"DUSTIN W TIMMERMAN","1215 WEST GATE DR STE 180","LELAND","NC",28451,"DENTAL","General Dentist"]
[null,262646682,1811059033,"DOUGLAS B SHERLY","640 KINGS HWY","WEST DEPTFORD","NJ","08096","DENTAL","General Dentist"]
[null,831337566,1104538974,"PARAMDEEP  KAUR","65 JEFFERSON AVE","ELIZABETH","NJ","07201","DENTAL","General Dentist"]
[null,900003633,1699036277,"SOOYEON  YOUN","10630 LITTLE PATUXENT PKWY STE 410","COLUMBIA","MD",21044,"DENTAL","Endodontist"]
[null,862988920,1750544698,"PETER E LOVEJOY","1804 WASHINGTON BLVD C","BELPRE","OH",45714,"DENTAL","General Dentist"]
[null,208039662,1538736178,"BRYNNER  BONNETTE","910 BERT KOUNS INDUSTRIAL LOOP","SHREVEPORT","LA",71118,"DENTAL","General Dentist"]
[null,853073598,1548624547,"TAYLOR L BAIRD","45 W KAGY BLVD STE 4","BOZEMAN","MT",59715,"DENTAL","General Dentist"]
[null,307540277,1508609967,"MARISSA  SCHEID","1626 S STATE ROAD 46","TERRE HAUTE","IN",47803,"DENTAL","General Dentist"]
[null,450518875,1205992104,"WILLIAM  DEMARCO","345 E MAIN ST","TUCKERTON","NJ","08087","DENTAL","General Dentist"]
[null,821108995,1376144915,"PRATHYUSHA  CHAVA","576 W US HIGHWAY 80","FORNEY","TX",75126,"DENTAL","General Dentist"]
[null,882233683,1770930174,"EBEN  LARRABEE","1834 OREGON PIKE STE 21","LANCASTER","PA",17601,"DENTAL","Oral Surgeon"]
[null,463595811,1649957911,"LINDA L TRAN","194 ROBERT SMALLS PKWY","BEAUFORT","SC",29906,"DENTAL","General Dentist"]
[null,831861901,1184301061,"PURVA  DHOMNE","252 W SWAMP RD STE 52","DOYLESTOWN","PA",18901,"DENTAL","General Dentist"]
[null,810702746,1629186804,"RYAN D PENSYL","12600 WINCHESTER RD SW","LAVALE","MD",21502,"DENTAL","General Dentist"]
[null,811051254,1073931416,"KIRSTIN SACCO WALTHER","2570 BARRINGTON CIRCLE","TALLAHASSEE","FL",32308,"DENTAL","General Dentist"]
[null,474679975,1821309923,"GENEVIEVE M BORDERS","6921 ANNAPOLIS RD","LANDOVER HILLS","MD",20784,"DENTAL","General Dentist"]
[null,472532794,1477907459,"SE JONG  KIM","2488 RIVA RD","ANNAPOLIS","MD",21401,"DENTAL","General Dentist"]
[null,831049708,1053768432,"SHARVIL  SHAH","40400 ANN ARBOR RD E STE 103","PLYMOUTH","MI",48170,"DENTAL","General Dentist"]
[null,474775816,1881992352,"RAYMOND T ABRAMS","161 N BROAD ST","WOODBURY","NJ","08096","DENTAL","General Dentist"]
[null,832643669,1538302518,"ERIC S RESH","8175 WESTSIDE BLVD STE A","FULTON","MD",20759,"DENTAL","General Dentist"]
[null,261905164,1669533725,"BYRON A DAVIS","4 OKATIE CENTER BLVD S STE 103","OKATIE","SC",29909,"DENTAL","Prosthodontist"]
[null,472509910,1376724963,"ANH N ZIRNSTEIN","16150 COUNTRY CLUB DR.","MONTCLAIR","VA",22025,"DENTAL","General Dentist"]
[null,813794979,1275890089,"DREW A HEBERER","4905 PROFESSIONAL CT # 101","RALEIGH","NC",27609,"DENTAL","General Dentist"]
[null,874330129,1356088066,"PARSHAV  PATEL","2271 N 2ND ST","MILLVILLE","NJ","08332","DENTAL","General Dentist"]
[null,200120892,1578184024,"MARIAM  AZIM","235 S POTTSTOWN PIKE","EXTON","PA",19341,"DENTAL","Pediatric Dentist"]
[null,582353722,1235214396,"EDWARD  WHITE","2928 HWY 17 N","MT. PLEASANT","SC",29466,"DENTAL","General Dentist"]
[null,474658091,1427198910,"ERIC E RADER","679 BALDWIN RD","CORNELIA","GA",30531,"DENTAL","General Dentist"]
[null,842492688,1376070292,"SHALINI D PATEL","2010 S JUNIPER ST","PHILADELPHIA","PA",19148,"DENTAL","Pediatric Dentist"]
[null,332253476,1598996688,"CHRISTOPHER E NAPOLITANO","915 OAKLAWN AVENUE","CRANSTON","RI","02920","DENTAL","General Dentist"]
[null,811282439,1063500056,"MARK K DORROUGH","345 GATEWAY DR STE 200","HEBER CITY","UT",84032,"DENTAL","General Dentist"]
[null,991358652,1598753972,"LOREN J GROSSMAN","375 PIERCE ST","KINGSTON","PA",18704,"DENTAL","General Dentist"]
[null,452366838,1548319676,"STEPHEN J CHARNITSKI","1651 N CEDAR CREST BLVD STE 206","ALLENTOWN","PA",18104,"DENTAL","General Dentist"]
[null,270137511,1477612406,"MOHAMED IHSAN KAYALI","1111 W COVINA BLVD STE 220","SAN DIMAS","CA",91773,"DENTAL","Periodontist"]
[null,582502644,1134286230,"CHRISTOPHER S NOEL","2092 A WOODRUFF RD","GREENVILLE","SC",29607,"DENTAL","Endodontist"]
[null,831182701,1922450212,"LOGAN E WHITE","435 PINE ST","ROCHESTER","MI",48307,"DENTAL","General Dentist"]
[null,521908293,1467845214,"NICHOLAS R WILKEN","650 W BALTIMORE ST STE 1401","BALTIMORE","MD",21201,"DENTAL","Oral Surgeon"]
[null,208647659,1306973078,"JAY  WIETECHA","28 OLD WESTERN AVE","WINTHROP","ME","04364","DENTAL","General Dentist"]
[null,273803146,1134019128,"JAMES  AKKIDAS","32 NORTHEAST DR STE 202","HERSHEY","PA",17033,"DENTAL","General Dentist"]
[null,251388310,1609940626,"ELIZABETH A CASSISI","102 N PIKE RD","SARVER","PA",16055,"DENTAL","General Dentist"]
[null,455444754,1164049896,"CONNER C DIMINICK","1013 W MAIN ST STE 6","MOUNT JOY","PA",17552,"DENTAL","General Dentist"]
[null,882420381,1033608237,"ALEXA A NORIAN","1139 GREENVILLE HWY STE A","HENDERSONVILLE","NC",28792,"DENTAL","General Dentist"]
[null,203445368,1871714071,"LAWRENCE  VENET","100 HEALTH PARK DR STE 105","GARNER","NC",27529,"DENTAL","General Dentist"]
[null,371511598,1235216342,"MARYAM  MANOUCHEHRI","1130 BLACKWOOD CLEMENTON","PINE HILL","NJ","08021","DENTAL","General Dentist"]
[null,222005159,1770740110,"ALBERT  TURPIE","1001 CENTRAL AVE","MINOTOLA","NJ","08341","DENTAL","General Dentist"]
[null,300011716,1710998620,"SIDNEY E CRADDUCK","304 CAMEO DR","HAGERSTOWN","MD",21740,"DENTAL","General Dentist"]
[null,"010375652",1346339199,"MICHAEL F FARINO","243 US ROUTE ONE STE 2","SCARBOROUGH","ME","04074","DENTAL","General Dentist"]
[null,271577629,1720184575,"BRYAN C DUNSTON","55 AMARILLO LN","SANFORD","NC",27332,"DENTAL","Pediatric Dentist"]
[null,411858421,1255412961,"GREG S BEINLICH","9680 TAMARACK RD STE 120","WOODBURY","MN",55125,"DENTAL","Pediatric Dentist"]
[null,"010644983",1013058445,"DREW  EARHART","1891 FRUITVILLE PIKE N","LANCASTER","PA",17601,"DENTAL","General Dentist"]
[null,850849636,1710739594,"DELAWARE DENTAL SPECIALISTS","20785 PROFESSIONAL PARK BLVD","GEORGETOWN","DE",19947,"DENTAL","General Dentist"]
[null,555176211,1003028200,"JUSTIN J FRIED","2168 MILLBURN AVE","MAPLEWOOD","NJ","07040","DENTAL","General Dentist"]
[null,650184844,1316956469,"LAWRENCE H MARKS","2601 E OAKLAND PARK BLVD STE 501","FORT LAUDERDALE","FL",33306,"DENTAL","Prosthodontist"]
[null,522050597,1093849952,"LAWRENCE  CHEN","711 W 40TH ST STE 215","BALTIMORE","MD",21211,"DENTAL","General Dentist"]
[null,922908045,1316066046,"NIZAM  JABBOUR","153 ACADEMY ST","POUGHKEEPSIE","NY",12601,"DENTAL","General Dentist"]
[null,541782905,1396963112,"MICHAEL  HUNT","4910 VALLEY VIEW BLVD NW STE 201","ROANOKE","VA",24012,"DENTAL","Endodontist"]
[null,871255032,1962997965,"DAVID  NGUYEN","5210 TOWN CENTER BLVD STE 310","PEACHTREE CORNERS","GA",30092,"DENTAL","General Dentist"]
[null,873895823,1629232186,"RACHEL BASS DONOVAN","5248 RED CEDAR DR STE 101","FORT MYERS","FL",33907,"DENTAL","General Dentist"]
[null,141717134,1346671872,"THOMAS J DEGENERO","4482 NY RTE 150","WEST SAND LAKE","NY",12196,"DENTAL","General Dentist"]
[null,872522658,1821438300,"HEATHER L HEPPNER","3349 NIAGARA FALLS BLVD","NORTH TONAWANDA","NY",14120,"DENTAL","General Dentist"]
[null,223410948,1538808720,"TYLER E KANE","209 S MAIN ST","CAPE MAY COURT HOUSE","NJ","08210","DENTAL","General Dentist"]
[null,203778918,1215066097,"HAROLD R MENDELSON","11300 REISTERSTOWN RD","OWINGS MILLS","MD",21117,"DENTAL","General Dentist"]
[null,352165034,1780880930,"STEVEN B LEE","1320 MEDICAL PARK DR","FORT WAYNE","IN",46825,"DENTAL","Periodontist"]
[null,331394538,1780724575,"JAMES P SIKORSKI","233 LAUREL HEIGHTS DR","BRIDGETON","NJ","08302","DENTAL","General Dentist"]
[null,475491789,1710902119,"ANDREW K DULANEY","310 BYRAM PL STE C","BYRAM","MS",39272,"DENTAL","General Dentist"]
[null,272900398,1568991677,"ANNE K MCLENNON","2511 OAKCREST AVE","GREENSBORO","NC",27408,"DENTAL","General Dentist"]
[null,383816257,1841309077,"ROBERT  HELDER","846 N BROAD ST","WOODBURY","NJ","08096","DENTAL","General Dentist"]
[null,202999938,1598801995,"KIMBERLY G REDICK","131 SILVERWOOD COMMERCIAL DR","RINCON","GA",31326,"DENTAL","General Dentist"]
[null,561311071,1366854812,"AMY  PIERCE","1086 WHITAKER RD","WINSTON SALEM","NC",27106,"DENTAL","General Dentist"]
[null,462434325,1306224548,"ZACHARY R WORZEL","250 N READING RD","EPHRATA","PA",17522,"DENTAL","General Dentist"]
[null,851397345,1841979234,"PARTH C SHAH","912 HADDONFIELD RD","CHERRY HILL","NJ","08002","DENTAL","General Dentist"]
[null,471706456,1417634320,"MOHAMMAD  ABDOLLAHZADEHFARD","1855 US 27TH NORTH","SEBRING","FL",33870,"DENTAL","General Dentist"]
[null,561525932,1023041316,"ORLANDO R STOVALL","200 N LESLIE ST","GOLDSBORO","NC",27530,"DENTAL","General Dentist"]
[null,571123752,1639380744,"MATTHEW D EVANS","108 PALMETTO PARK BLVD STE F","LEXINGTON","SC",29072,"DENTAL","Endodontist"]
[null,522122194,1902065527,"SHARON F BROWN","4910 MASSACHUSETTS AVE NW","WASHINGTON","DC",20016,"DENTAL","General Dentist"]
[null,842375028,1841659372,"ALA MUHIEDDIN YASSIN","4205 N POINT PKWY STE A","ALPHARETTA","GA",30022,"DENTAL","General Dentist"]
[null,815147737,1093951360,"JOSEPH  MANISCALCO","7825 4TH AVE","BROOKLYN","NY",11209,"DENTAL","Prosthodontist"]
[null,815254731,1477974376,"SRUJANA  ELURI","2241 GARRETT RD","DREXEL HILL","PA",19026,"DENTAL","General Dentist"]
[null,223239711,1760465272,"THOMAS C BACKENSTOSE","4301 NEW JERSEY AVE","WILDWOOD","NJ","08260","DENTAL","Prosthodontist"]
[null,334235926,1720392491,"BANSI TARUNKANT DOESCHER","2340 S 12TH ST","PHILADELPHIA","PA",19148,"DENTAL","General Dentist"]
[null,463279591,1023559341,"MARIA  HERNANDEZ","27821 S TAMIAMI TRL STE 1","BONITA SPRINGS","FL",34134,"DENTAL","General Dentist"]
[null,833530111,1841739802,"CHAD P LYONS","10140 W LAKE PLEASANT PKWY STE 1220","PEORIA","AZ",85382,"DENTAL","General Dentist"]
[null,271766823,1053420679,"SCOTT P MCCLARAN","47 BARKLEY CIR STE B","FORT MYERS","FL",33907,"DENTAL","General Dentist"]
[null,273020377,1548464761,"GEORGE T LYNCH","1352 SOUTH ST STE C4","PHILADELPHIA","PA",19147,"DENTAL","Pediatric Dentist"]
[null,920385365,1982592697,"CHERRY E TAKAWI","175 MARKET RIDGE LN","DALEVILLE","VA",24083,"DENTAL","General Dentist"]
[null,273020377,1376898783,"THAO T TRAN","1352 SOUTH ST STE C4","PHILADELPHIA","PA",19147,"DENTAL","Pediatric Dentist"]
[null,815250251,1487897179,"CRISTINA B GEORGESCU","450 MAMARONECK AVE STE 403","HARRISON","NY",10528,"DENTAL","Pediatric Dentist"]
[null,815250251,1669750311,"EILEEN R DANO CALAMIA","450 MAMARONECK AVE STE 403","HARRISON","NY",10528,"DENTAL","Pediatric Dentist"]
[null,223768605,1952323701,"GUILLERMO J MOLINA","1200 E RIDGEWOOD AVE STE 106 EAST WING","RIDGEWOOD","NJ","07450","DENTAL","Prosthodontist"]
[null,464181884,1477040475,"KURTIS  BRYAN","1301 N HOWE ST","SOUTHPORT","NC",28461,"DENTAL","General Dentist"]
[null,993950173,1083329908,"STEVEN B COBURN","59 HIGHLANDS SQUARE DR","HENDERSONVILLE","NC",28792,"DENTAL","General Dentist"]
[null,832025842,1780355644,"HIRVING  HENRIQUEZ","410 SOUTH MAIN ST","CONCORD","NH","03301","DENTAL","General Dentist"]
[null,474665148,1841031804,"CLAUDIA  BARROS CHAVIANO","3790 WEDGEWOOD LN","THE VILLAGES","FL",32162,"DENTAL","General Dentist"]
[null,271359888,1639607799,"ALFONSO A LARA BRAIN","308 EASTERN BLVD","CANANDAIGUA","NY",14424,"DENTAL","General Dentist"]
[null,932156473,1013368786,"JOHN E CAIRNS","344 S YELLOWSTONE DR","MADISON","WI",53705,"DENTAL","General Dentist"]
[null,823844376,1366920852,"TSUA L LOR","755 HIGHLAND OAKS DR STE 106","WINSTON SALEM","NC",27103,"DENTAL","General Dentist"]
[null,200185918,1619199023,"LOUIS P CERILLO","11938 CURLEY ST","SAN ANTONIO","FL",33576,"DENTAL","General Dentist"]
[null,261755526,1003948019,"SARAH M LYNCH","20 ERFORD RD STE 100","LEMOYNE","PA",17043,"DENTAL","General Dentist"]
[null,920812816,1518965326,"KENDALL S WOOD","3015 MAPLEWOOD AVE","WINSTON SALEM","NC",27103,"DENTAL","General Dentist"]
[null,861957842,1548451917,"BRANDON G COLEMAN","1805 PLAZA DR","WINCHESTER","VA",22601,"DENTAL","Periodontist"]
[null,223625570,1962649327,"MICHAEL D YASNER","1416 BRACE RD","CHERRY HILL","NJ","08034","DENTAL","Periodontist"]
[null,300120631,1891852190,"VICTORIA M CALDWELL","1020 KINGS HWY N STE 200","CHERRY HILL","NJ","08034","DENTAL","Periodontist"]
[null,461289540,1528751153,"ALLYSON  FESMIRE","2700 12TH AVE S","NASHVILLE","TN",37204,"DENTAL","General Dentist"]
[null,273712972,1538470034,"JEREMY  MAGRUDER","3314 AVE O","GALVESTON","TX",77550,"DENTAL","General Dentist"]
[null,994428405,1700985157,"ROBERT J WILKIN","1656 30TH ST","BOULDER","CO",80301,"DENTAL","General Dentist"]
[null,200093622,1942272810,"SEAN T SINCLAIR","1117 E LAMAR ALEXANDER PKWY","MARYVILLE","TN",37804,"DENTAL","General Dentist"]
[null,473335528,1861188088,"EMERY A BUCKHOUSE","126 BARTON CREEK CT","COLUMBIA","SC",29229,"DENTAL","General Dentist"]
[null,263963868,1154471555,"TIMOTHY P BLETSCHER","5440 SW WESTGATE DR STE 215","PORTLAND","OR",97221,"DENTAL","General Dentist"]
[null,461004916,1811085061,"ANGELA  COSSENTINO","2378 SURFSIDE BLVD STE 131","CAPE CORAL","FL",33991,"DENTAL","General Dentist"]
[null,721535493,1639168040,"SCOTT D GOLDSLEGER","1220 W CHESTER PIKE","HAVERTOWN","PA",19083,"DENTAL","Pediatric Dentist"]
[null,832549193,1720242563,"PARVEZ  BAIG","189 S CHARLES RICHARD BEALL BLVD STE 100","DEBARY","FL",32713,"DENTAL","General Dentist"]
[null,205715360,1033270715,"THEODORE D HAEUSSNER","4 SAINT JOHNS MEDICAL PARK DR","SAINT AUGUSTINE","FL",32086,"DENTAL","General Dentist"]
[null,200919034,1144419433,"MOHAMMAD  KHEIRALLA","60 JEFFERSON ST","MONTICELLO","NY",12701,"DENTAL","General Dentist"]
[null,462093191,1003100934,"JEFFREY PAUL CLARK","901 NORMAL PARK DR STE 200","HUNTSVILLE","TX",77320,"DENTAL","General Dentist"]
[null,475374344,1245783265,"JASKIRAT  MANGAT","4113 CONRAD WEISER PKWY","WOMELSDORF","PA",19567,"DENTAL","General Dentist"]
[null,992405438,1215385877,"LAURA A BURGETT","17224 SE 272ND ST STE C","COVINGTON","WA",98042,"DENTAL","General Dentist"]
[null,571122172,1083698781,"VASILIOS J POURNARAS","1211 44TH AVE N STE 100","MYRTLE BEACH","SC",29577,"DENTAL","General Dentist"]
[null,843522851,1649909946,"JAMIE  LIN","2323 MOODY PKWY","MOODY","AL",35004,"DENTAL","General Dentist"]
[null,842669320,1437285707,"JOHN H PENNY","617 75TH AVE","SAINT PETE BEACH","FL",33706,"DENTAL","General Dentist"]
[null,331150416,1063510287,"SONY  THOMAS","312 E FOOTHILL BLVD STE A","ARCADIA","CA",91006,"DENTAL","Endodontist"]
[null,831741561,1316054554,"DAVID  CHAMPION","4004 BAYBORO ST","LORIS","SC",29569,"DENTAL","General Dentist"]
[null,821586948,1811275126,"DAVID  KOSEK","415 COMMERCIAL CT STE B","VENICE","FL",34292,"DENTAL","General Dentist"]
[null,462058769,1194465856,"SYLVANA  SAWIRES","501 SPRINGFIELD AVE","BERKELEY HEIGHTS","NJ","07922","DENTAL","Pediatric Dentist"]
[null,591857489,1609017482,"JAIRO  SALCEDO","1401 FORUM WAY STE 800","WEST PALM BEACH","FL",33401,"DENTAL","Prosthodontist"]
[null,221906385,1811319841,"MALAY  MATHUR","776 GROVE RD","WEST DEPTFORD","NJ","08086","DENTAL","Pediatric Dentist"]
[null,813267349,1811379100,"JENNIFER A LOVELAND","19315 W CATAWBA AVE STE 104","CORNELIUS","NC",28031,"DENTAL","General Dentist"]
[null,842656919,1013045798,"ANGEL L LOPEZ","2615 S MIAMI BLVD","DURHAM","NC",27703,"DENTAL","General Dentist"]
[null,208359153,1649302225,"JASON R PETKEVIS","60 POTTSTOWN PIKE STE 1","CHESTER SPRINGS","PA",19425,"DENTAL","General Dentist"]
[null,382227963,1548305758,"JOSEPH  AMALFITANO","5000 SKYVIEW CT","TRAVERSE CITY","MI",49684,"DENTAL","Periodontist"]
[null,204449797,1700082096,"TODD  VACCARO","1759 UNION ST","NISKAYUNA","NY",12309,"DENTAL","General Dentist"]
[null,811197216,1588921464,"ALEXSANDR M FISHMAN","11813 REISTERSTOWN RD","REISTERSTOWN","MD",21136,"DENTAL","General Dentist"]
[null,842146255,1467833137,"GABRIEL T MANCUSO","101 N FRONT ST","PHILIPSBURG","PA",16866,"DENTAL","General Dentist"]
[null,231903489,1376851949,"PARAMPREET  CHHINA","632 MONTGOMERY AVE STE 2","NARBERTH","PA",19072,"DENTAL","General Dentist"]
[null,463279591,1245440023,"TIMOTHY S DAVIS","4933 TAMIAMI TRL N STE 100","NAPLES","FL",34103,"DENTAL","General Dentist"]
[null,562052203,1457386641,"RONALD K OWENS","1551 WESTBROOK PLAZA DR","WINSTON SALEM","NC",27103,"DENTAL","General Dentist"]
[null,454361286,1427473248,"NEELIMA  PITCHIKA","4 W BROOKHAVEN RD","BROOKHAVEN","PA",19015,"DENTAL","General Dentist"]
[null,"042732028",1164430930,"IMAN S LABIB","50 SALEM ST BLDG A","LYNNFIELD","MA","01940","DENTAL","Endodontist"]
[null,832691420,1114572609,"CHANDANI  PATEL","9880 BUSTLETON AVE STE 213","PHILADELPHIA","PA",19115,"DENTAL","General Dentist"]
[null,922028239,1497595466,"RUBA  REYAL","706 39TH ST W","BRADENTON","FL",34205,"DENTAL","General Dentist"]
[null,592054457,1417178468,"STEPHEN G NORTON","900 NW 17TH AVE STE 203","DELRAY BEACH","FL",33445,"DENTAL","General Dentist"]
[null,920734459,1316403140,"EILYN  RIVERO SANES","7885 NW 107TH AVE. 4-05","DORAL","FL",33178,"DENTAL","General Dentist"]
[null,880949649,1902507403,"JEFFREY N SANDERS","201 E CHESTNUT ST STE A","ASHEVILLE","NC",28801,"DENTAL","General Dentist"]
[null,454879929,1588865943,"DEMITRI  VILLARREAL","902 KITTY HAWK RD STE 100","UNIVERSAL CITY","TX",78148,"DENTAL","Periodontist"]
[null,472299442,1033948757,"CHRISTOS  GOUSIAS","609 EMANCIPATION HWY STE 101","FREDERICKSBURG","VA",22401,"DENTAL","Periodontist"]
[null,271066396,1982594255,"CHENDI  JIANG","3309 EDGMONT AVE","BROOKHAVEN","PA",19015,"DENTAL","General Dentist"]
[null,200185918,1598502833,"NIDHI  YADAV","4289 S HIGHWAY 27","CLERMONT","FL",34711,"DENTAL","General Dentist"]
[null,189369765,1871706689,"JAMES U TODD","934 CORNWALL RD","LEBANON","PA",17042,"DENTAL","General Dentist"]
[null,814626707,1093427932,"RAFAELA C COSTA CARLOS","1 WINDING DR STE 105","PHILADELPHIA","PA",19131,"DENTAL","General Dentist"]
[null,863627829,1306454848,"HUNTER M HAWKINS","303 S ARCHUSA AVE STE B","QUITMAN","MS",39355,"DENTAL","General Dentist"]
[null,"050558151",1346369980,"LEANNE B SULLIVAN","5713 GRAY RD","WESLEY CHAPEL","FL",33543,"DENTAL","General Dentist"]
[null,472129839,1386376614,"SHIRA  BOR","2012 S TOLLGATE RD STE 212","BEL AIR","MD",21015,"DENTAL","Pediatric Dentist"]
[null,571016163,1508949892,"WILLIAM D  CRANFORD","1721 EBENEZER RD  STE 135","ROCK HILL","SC",29732,"DENTAL","General Dentist"]
[null,842042980,1205123106,"PALLAVI  BATRA","1601 WALNUT ST STE 600","PHILADELPHIA","PA",19102,"DENTAL","General Dentist"]
[null,933157524,1891508412,"STEPHANIE ANDREA CATALANO PIVEC","630 ATLANTIC BLVD STE 7","NEPTUNE BEACH","FL",32266,"DENTAL","General Dentist"]
[null,863489322,1386768380,"SOPHIA C MANOLIS","602 MAIN ST","PORT JEFFERSON","NY",11777,"DENTAL","General Dentist"]
[null,465130314,1255026613,"MADISON E COVEY","100 N 10TH ST","ERWIN","NC",28339,"DENTAL","General Dentist"]
[null,232670349,1023156221,"PAUL W BRITT","1211 WILMINGTON PIKE 306","WEST CHESTER","PA",19382,"DENTAL","General Dentist"]
[null,592285092,1114026572,"JEFFREY  ELLENBERG","1430 S BELCHER RD","CLEARWATER","FL",33764,"DENTAL","General Dentist"]
[null,270728558,1316960131,"KEVIN BRUCE WALLACE","13700 N US HIGHWAY 441","LADY LAKE","FL",32159,"DENTAL","Prosthodontist"]
[null,542062209,1851409700,"MICHAEL  MESSINA","1886 METRO CENTER DR #600","RESTON","VA",20190,"DENTAL","General Dentist"]
[null,270886540,1912961202,"CHAD J LANCASTER","715 ELK ST","GASSAWAY","WV",26624,"DENTAL","General Dentist"]
[null,205979822,1205813425,"WILLIAM A BENSON","309 W MILLBROOK RD STE 181","RALEIGH","NC",27609,"DENTAL","General Dentist"]
[null,473764585,1578734422,"SOUSAN M AMIRI","4930 CENTRAL AVE","CHARLOTTE","NC",28205,"DENTAL","General Dentist"]
[null,200185918,1841720075,"OMAR JAMES ALKOREK","27417 US HIGHWAY 27","LEESBURG","FL",34748,"DENTAL","General Dentist"]
[null,205979822,1093702847,"JAMES A WHITLEY","309 W MILLBROOK RD STE 181","RALEIGH","NC",27609,"DENTAL","General Dentist"]
[null,822396961,1225681331,"MYRA  DAWARA","7 MYERS DR","MULLICA HILL","NJ","08062","DENTAL","General Dentist"]
[null,931606382,1225413867,"ARMAN JACOB YAZDAN","17836 WEXFORD TER APT 2E","JAMAICA","NY",11432,"DENTAL","Oral Surgeon"]
[null,232815882,1629101878,"MITCHEL J BLUMENTHAL","2455 GRANT AVE","PHILADELPHIA","PA",19114,"DENTAL","General Dentist"]
[null,852396113,1235233719,"MICHAEL T WARD","61 NEWTON SPARTA RD","NEWTON","NJ","07860","DENTAL","General Dentist"]
[null,208923970,1285473207,"MARK  ISKANDER","405 MAIN ST","LANDISVILLE","PA",17538,"DENTAL","General Dentist"]
[null,332752160,1821615139,"COLBY J GERTH","1009 N WEBSTER AVE","CHICAGO","IL",60614,"DENTAL","General Dentist"]
[null,208919640,1285112656,"ALESSIO  SCOTT","101 W MAIN ST","NEW HOLLAND","PA",17557,"DENTAL","General Dentist"]
[null,621809976,1003933037,"KEVIN C SMITH","124 S MAIN ST","SPARTA","TN",38583,"DENTAL","General Dentist"]
[null,842883953,1801851597,"STEVEN  SPERONI","1450 E BOOT RD. Ste 200E","WEST CHESTER","PA",19380,"DENTAL","General Dentist"]
[null,881869456,1316476468,"SYDNEY  GUIDROZ","136 DRIFTING WIND RUN SUITE 109","DRIPPING SPRINGS","TX",78620,"DENTAL","General Dentist"]
[null,274176629,1508125212,"MANILA P JOSHI","7700 OLD BRANCH AVE STE A204","CLINTON","MD",20735,"DENTAL","Endodontist"]
[null,474823507,1417263047,"DIVYA J ARORA","171 W MAIN ST","ROCKAWAY","NJ","07866","DENTAL","General Dentist"]
[null,204802207,1588156533,"LAUREN J FOWLER","135 BERKELEY CIRCLE","SUMMERVILLE","SC",29483,"DENTAL","General Dentist"]
[null,232860692,1386715159,"FORD W STEVENS","147 MONTGOMERY AVE","BALA CYNWYD","PA",19004,"DENTAL","General Dentist"]
[null,883941898,1396275780,"TOBY K WRIGHT","124 WESTMORELAND ST","HARROGATE","TN",37752,"DENTAL","General Dentist"]
[null,472511889,1972664381,"VIPUL  SAINI","105 MEMORIAL DR","SCHWENKSVILLE","PA",19473,"DENTAL","General Dentist"]
[null,921041596,1972217594,"JONATHAN P LE","701 E CATHEDRAL RD STE 43","PHILADELPHIA","PA",19128,"DENTAL","General Dentist"]
[null,842492688,1740975960,"EMELY  CRISTINA POZO","2010 S JUNIPER ST","PHILADELPHIA","PA",19148,"DENTAL","General Dentist"]
[null,822992202,1669503819,"LESLIE  FLAHAVEN","292 HURFFVILLE GRENLOCH RD","SEWELL","NJ","08080","DENTAL","General Dentist"]
[null,873154623,1699093351,"JOHN  POWE","1501 WASHINGTON BLVD","WILLIAMSPORT","PA",17701,"DENTAL","Periodontist"]
[null,593643669,1639467111,"MALLORY B GARSHNICK","2825 SE 17TH ST","OCALA","FL",34471,"DENTAL","General Dentist"]
[null,874334983,1023237385,"ROBERT  NILES","202 TOWNE VILLAGE DR","CARY","NC",27513,"DENTAL","General Dentist"]
[null,231365971,1194812974,"ALEXANDER S LITVINOV","3223 N BROAD ST","PHILADELPHIA","PA",19140,"DENTAL","General Dentist"]
[null,883258896,1043730997,"TREMAYNE  RICHARD","3615 OLD FOREST RD","LYNCHBURG","VA",24501,"DENTAL","General Dentist"]
[null,830962190,1003980368,"ELIZABETH  MORRIS","6188 OXON HILL RD STE 406","OXON HILL","MD",20745,"DENTAL","General Dentist"]
[null,261304632,1891355848,"DAVID  LEWIS","129 S WEST ST","WILMINGTON","DE",19801,"DENTAL","General Dentist"]
[null,542163612,1902213200,"RICK L ROOT","3755 20TH PL","VERO BEACH","FL",32960,"DENTAL","General Dentist"]
[null,882982883,1235328279,"KRISTI A DILLARD","3070 HWY 17 N STE 101","MOUNT PLEASANT","SC",29466,"DENTAL","General Dentist"]
[null,200061461,1881710341,"MARK K CHOI","8303 ARLINGTON BLVD STE 105","FAIRFAX","VA",22031,"DENTAL","General Dentist"]
[null,844290723,1669921292,"KRISTIN  PAISLEY","2501 S HWY 27","CLERMONT","FL",34711,"DENTAL","General Dentist"]
[null,844503272,1952320780,"RICHARD A HARMETZ","8899 UNIVERSITY CENTER LN STE 180","SAN DIEGO","CA",92122,"DENTAL","General Dentist"]
[null,520957021,1700962610,"GUS J LIVADITIS","1206 YORK RD STE 100","LUTHERVILLE","MD",21093,"DENTAL","Prosthodontist"]
[null,541393769,1710328273,"SEYED M TOFIGHBAKHSH","11107 SUNSET HILLS RD STE 111","RESTON","VA",20190,"DENTAL","General Dentist"]
[null,821785962,1215224738,"GABRIEL M HOLLEY","110 A HOSPITAL DR","SIMPSONVILLE","SC",29681,"DENTAL","Endodontist"]
[null,204035764,1174763338,"ANNE R MULLIN-KUCZMA","223 ROUTE 3A SUITE 102","COHASSET","MA","02025","DENTAL","Pediatric Dentist"]
[null,861108109,1497783724,"ANTHONY N HOANG","672 RADIO DR STE A","LEXINGTON","NC",27292,"DENTAL","General Dentist"]
[null,882481237,1417976259,"DAVID J MAHARTY","7151 RICHMOND RD STE 305","WILLIAMSBURG","VA",23188,"DENTAL","General Dentist"]
[null,542062209,1710558036,"ALEXANDER  BACK","1886 METRO CENTER DR #600","RESTON","VA",20190,"DENTAL","General Dentist"]
[null,465119292,1639574916,"MELISSA S KERBER","2015 INTERSTATE DR","OPELIKA","AL",36801,"DENTAL","General Dentist"]
[null,460815208,1972990695,"NICOLE  MAJOR","3095 E MULLAN AVE STE 400","POST FALLS","ID",83854,"DENTAL","General Dentist"]
[null,933896936,1174666747,"LINDSAY  FRIEDMAN","1145 19TH ST NW STE 707","WASHINGTON","DC",20036,"DENTAL","Periodontist"]
[null,920516405,1952557852,"ALI  MOHAMMAD","2200 ARCH ST STE 102","PHILADELPHIA","PA",19103,"DENTAL","Oral Surgeon"]
[null,453072186,1669677852,"MAHTAB  KHOSHKHOU","8531 VETERANS HWY STE 103","MILLERSVILLE","MD",21108,"DENTAL","Pediatric Dentist"]
[null,931758056,1528444601,"MOHSIN  WAZIR","65 JEFFERSON AVE FLOOR 2 STE A","ELIZABETH","NJ","07201","DENTAL","Oral Surgeon"]
[null,472795083,1447026604,"GARY  PUTT","524 WASHINGTON ST","HUNTINGDON","PA",16652,"DENTAL","General Dentist"]
[null,832460516,1144719444,"LIBBY  FINER","1250 S FEDERAL HWY STE 101","BOYNTON BEACH","FL",33435,"DENTAL","General Dentist"]
[null,200520785,1154457844,"R GREGORY  JOWERS","425 A LEXINGTON AVE","CHAPIN","SC",29036,"DENTAL","General Dentist"]
[null,271623920,1710298799,"NICHOLAS PARKER COMERFORD","13107 ATLANTIC BLVD STE 101","JACKSONVILLE","FL",32225,"DENTAL","General Dentist"]
[null,232834879,1275622581,"NAVID H HADIAN","979 BROOKSIDE RD","WESCOSVILLE","PA",18106,"DENTAL","General Dentist"]
[null,651144303,1073606596,"NICOLAS C DEFABRIQUE","2401 PGA BLVD STE 276","PALM BEACH GARDENS","FL",33410,"DENTAL","General Dentist"]
[null,454500820,1235385055,"JACOB  JOHN","127 E MAIN ST STE 131","MIDDLETOWN","NY",10940,"DENTAL","General Dentist"]
[null,270136969,1497951982,"HAMID  JABBARY","488 TERRYVILLE RD","PORT JEFFERSON STATION","NY",11776,"DENTAL","General Dentist"]
[null,853879634,1639276355,"EVAN L BERSON","931 E HAVERFORD RD","BRYN MAWR","PA",19010,"DENTAL","General Dentist"]
[null,222763588,1598247595,"RITU  SHARMA","335 DELSEA DR N","GLASSBORO","NJ","08028","DENTAL","General Dentist"]
[null,464003829,1417059676,"KENYA N STORR-JONES","3333 US HIGHWAY 441/27","FRUITLAND PARK","FL",34731,"DENTAL","General Dentist"]
[null,882444947,1659094621,"AMANDA  HANSEN","385 STARR RD STE 202","LANDENBERG","PA",19350,"DENTAL","General Dentist"]
[null,271289423,1063633121,"JASMINE H MINASYAN","924 E BROADWAY","LONG BEACH","CA",90802,"DENTAL","General Dentist"]
[null,834481045,1912755646,"JASON J AMANI","5450 CAMPBELLS RUN RD","PITTSBURGH","PA",15205,"DENTAL","General Dentist"]
[null,460962725,1528254638,"TOMMY L CANTRELL","912 INLET SQUARE DR","MURRELLS INLET","SC",29576,"DENTAL","General Dentist"]
[null,541210721,1245423516,"LUIS J MARTINEZ","44095 PIPELINE PLZ STE 220","ASHBURN","VA",20147,"DENTAL","Prosthodontist"]
[null,331830312,1700170883,"JENNA  CHALK","3709 OLD FOREST RD","LYNCHBURG","VA",24501,"DENTAL","General Dentist"]
[null,842865723,1124517040,"ERIC  KLEIN","9644 DEERECO RD","LUTHERVILLE TIMONIUM","MD",21093,"DENTAL","General Dentist"]
[null,800733330,1174724868,"POORVA  PARNAIK","30 JACKSON RD STE C1","MEDFORD","NJ","08055","DENTAL","General Dentist"]
[null,"061133812",1225304348,"RONALD J D ANDREA","2675 WHITNEY AVE","HAMDEN","CT","06518","DENTAL","General Dentist"]
[null,273712972,1538470034,"JEREMY  MAGRUDER","3828 AVE N","GALVESTON","TX",77550,"DENTAL","General Dentist"]
[null,273801943,1043516537,"DAVID  PAINO","307 MAPLE AVE W STE A","VIENNA","VA",22180,"DENTAL","General Dentist"]
[null,231365971,1790168912,"SALWA  MEKLED","3223 N BROAD ST","PHILADELPHIA","PA",19140,"DENTAL","General Dentist"]
[null,471574130,1659620193,"WILLIAM F MORANG","700 SUNSET DR STE 401","ATHENS","GA",30606,"DENTAL","General Dentist"]
[null,550797121,1194294926,"ATUL  BIDARKAR","724 US HIGHWAY 259 N STE 101","KILGORE","TX",75662,"DENTAL","General Dentist"]
[null,421621818,1508003344,"DANIEL O TOLHURST","42112 WASHINGTON ST STE 1F","BERMUDA DUNES","CA",92203,"DENTAL","General Dentist"]
[null,842656919,1558365809,"BRIAN F CAHILL","2615 S MIAMI BLVD","DURHAM","NC",27703,"DENTAL","General Dentist"]
[null,833261170,1871016329,"JOSEPH MARCUS CAVAZOS","9125 WEST RD","HOUSTON","TX",77064,"DENTAL","General Dentist"]
[null,561529007,1003228784,"TRAVIS J WHITLEY","7501 FALLS OF NEUSE RD STE 100","RALEIGH","NC",27615,"DENTAL","General Dentist"]
[null,800427436,1750487930,"ERNEST  RODRIGUEZ","205 WESTFIELD AVE W","ROSELLE PARK","NJ","07204","DENTAL","General Dentist"]
[null,561529007,1801068184,"SHEPPARD A MCKENZIE","7501 FALLS OF NEUSE RD STE 100","RALEIGH","NC",27615,"DENTAL","General Dentist"]
[null,824969204,1598944340,"LANCE HERSCHEL HARRISON","10229 OKEECHOBEE BLVD STE C1","ROYAL PALM BEACH","FL",33411,"DENTAL","General Dentist"]
[null,273005713,1528231784,"BYRON K BYRD","7115 GUILFORD DR STE 101","FREDERICK","MD",21704,"DENTAL","General Dentist"]
[null,921658355,1245993625,"NICHOLAS  HREHOVCIK","126 MAIN ST","LEBANON","NJ","08833","DENTAL","General Dentist"]
[null,860999834,1619937828,"KIRK W WESTERVELT","1120 W STATE ROUTE 89A STE A3","SEDONA","AZ",86336,"DENTAL","General Dentist"]
[null,934938595,1225733488,"MAYS  RAOOF","907 LINCOLN AVE","PROSPECT PARK","PA",19076,"DENTAL","General Dentist"]
[null,832477002,1114597614,"ASHLEY  SCHERBENSKE","4624 CENTRAL PARK BLVD STE 102","DENVER","CO",80238,"DENTAL","General Dentist"]
[null,521116591,1922218577,"ADRIENNE  WEBB","503 MUIR ST STE A","CAMBRIDGE","MD",21613,"DENTAL","General Dentist"]
[null,382216019,1588635957,"KYLE D HOGG","7800 US HIGHWAY 131 S","CADILLAC","MI",49601,"DENTAL","General Dentist"]
[null,200531288,1598932568,"RICHARD L VERMILLION","39 W LUDLOW ST","SUMMIT HILL","PA",18250,"DENTAL","General Dentist"]
[null,455614682,1003499435,"KENNEDY J SEEFELDT","2288 STATE ROUTE 63","WAYLAND","NY",14572,"DENTAL","General Dentist"]
[null,844919448,1578116182,"HUGO  ZEGARRA BAQUERIZO","1491 E VENICE AVE STE A","VENICE","FL",34292,"DENTAL","Periodontist"]
[null,861726537,1184150815,"DHEEREN N PADHIAR","4130 BLOOMFIELD AVE","DREXEL HILL","PA",19026,"DENTAL","General Dentist"]
[null,541967606,1619198058,"JEFFREY A SISEL","2800 S SHIRLINGTON RD #770","ARLINGTON","VA",22206,"DENTAL","General Dentist"]
[null,592060659,1881805893,"RICHARD  SOVEN","12101 TAFT ST","PEMBROKE PINES","FL",33026,"DENTAL","General Dentist"]
[null,233024574,1629168026,"MING LUNG  YANG","665 EXTON CMNS","EXTON","PA",19341,"DENTAL","Endodontist"]
[null,814076832,1245904366,"STEVE H KOKORELIS","9010 HARFORD RD","PARKVILLE","MD",21234,"DENTAL","General Dentist"]
[null,"061049165",1093977811,"RANDALL D HARRIS","1527 ROUTE 12","GALES FERRY","CT","06335","DENTAL","General Dentist"]
[null,"061049165",1093977811,"RANDALL D HARRIS","1527 ROUTE 12","GALES FERRY","CT","06335","DENTAL","General Dentist"]
[null,832990427,1972986503,"AMANDA  KEMKER","901 N WINSTEAD AVE STE 120","ROCKY MOUNT","NC",27804,"DENTAL","General Dentist"]
[null,541813525,1497061212,"STEPHEN  YOUNG","1107 WESTBRIAR DR","RICHMOND","VA",23238,"DENTAL","General Dentist"]
[null,522274080,1558732693,"WILLIAM J HALL","1090 W PATRICK ST","FREDERICK","MD",21703,"DENTAL","General Dentist"]
[null,710881963,1780799072,"PHILIP N HEINECKE","103 BELL AVE","BROOKSVILLE","FL",34601,"DENTAL","General Dentist"]
[null,232815882,1396351318,"MOSTAFA  ALWAKEEL","6 ORIOLE AVE","MEDIA","PA",19063,"DENTAL","General Dentist"]
[null,223452451,1013769728,"EMILY  LEWIS","133 JACKSON RD STE E","MEDFORD","NJ","08055","DENTAL","General Dentist"]
[null,392303287,1992165252,"CHRISTOPHER  ROBERTSON","345 E GATEWAY DRIVE STE 200","HEBER CITY","UT",84032,"DENTAL","General Dentist"]
[null,233030556,1144577735,"NATALIE M SORBELLO","501 PLEASANT VIEW RD","LEWISBERRY","PA",17339,"DENTAL","General Dentist"]
[null,721535493,1245868579,"DAVID  KIM","1220 W CHESTER PIKE","HAVERTOWN","PA",19083,"DENTAL","Pediatric Dentist"]
[null,474780265,1740448869,"MAKI ISHII TSOU","919 CONESTOGA RD BLDG 2 Ste 209","BRYN MAWR","PA",19010,"DENTAL","General Dentist"]
[null,472052403,1215042395,"ELIZABETH  NAVA","102 N 7TH ST","ALPINE","TX",79830,"DENTAL","General Dentist"]
[null,721535493,1467434480,"NEIL L MOSCOW","1220 W CHESTER PIKE","HAVERTOWN","PA",19083,"DENTAL","Pediatric Dentist"]
[null,521544071,1780895615,"ALVAN M HOLSTON","5 CAULK LN","EASTON","MD",21601,"DENTAL","General Dentist"]
[null,208454580,1316426851,"APRIL  MOYER","244 W MAIN ST","MOORESTOWN","NJ","08057","DENTAL","General Dentist"]
[null,333560475,1780895615,"ALVAN M HOLSTON","5 CAULK LN STE 1","EASTON","MD",21601,"DENTAL","General Dentist"]
[null,998887777,1629246152,"ROGER LYNN BRYANT","918 ROLLING ACRES RD STE 7","LADY LAKE","FL",32159,"DENTAL","General Dentist"]
[null,472146740,1699877753,"MARIE A KERSHNER","44A S CHESTNUT ST","BOYERTOWN","PA",19512,"DENTAL","General Dentist"]
[null,881595940,1245547603,"DEREK J CONOVER","1528 WALNUT ST STE 1800","PHILADELPHIA","PA",19102,"DENTAL","General Dentist"]
[null,203383320,1902814999,"MARC A LEVIN","1601 WALNUT ST STE 1414","PHILADELPHIA","PA",19102,"DENTAL","General Dentist"]
[null,465754024,1528445350,"MICHAEL J YUAN","1993 COUNTY ROAD 1","DUNEDIN","FL",34698,"DENTAL","Oral Surgeon"]
[null,"061181226",1376619536,"MANOHAR  SHRESTHA","11811 GUY R BREWER BLVD","JAMAICA","NY",11434,"DENTAL","General Dentist"]
[null,462389351,1285475954,"ANTHONY  HOANG","803 MOUNTAIN HOME RD","SINKING SPRING","PA",19608,"DENTAL","General Dentist"]
[null,510103684,1952385122,"CCHS WILMINGTON HOSP DNTL DEPT","501 W 14TH ST STE 2W02","WILMINGTON","DE",19801,"DENTAL","General Dentist"]
[null,475176901,1053628255,"JENNIFER  CREECH","429 S COLUMBIA AVE STE B","RINCON","GA",31326,"DENTAL","General Dentist"]
[null,853267109,1386262798,"KEYUR  DUDHAT","1330 W CHESTER PIKE","HAVERTOWN","PA",19083,"DENTAL","General Dentist"]
[null,834548025,1952662132,"DEREK M MARTIN","2688 SW IMMANUEL DR","PALM CITY","FL",34990,"DENTAL","General Dentist"]
[null,341793230,1700460995,"MALLORY M ALEXANDER","18224 DETROIT AVE","LAKEWOOD","OH",44107,"DENTAL","General Dentist"]
[null,461869750,1922621309,"ANDREW  MOORE","107 YALE ST STE 300","HOUSTON","TX",77007,"DENTAL","General Dentist"]
[null,522208985,1063441707,"HENRY Y LEE","17721 GEORGIA AVE","OLNEY","MD",20832,"DENTAL","General Dentist"]
[null,352492260,1306493259,"MIKAYLA C AYALA","1745 WEST 17TH AVE","EUGENE","OR",97402,"DENTAL","General Dentist"]
[null,472860717,1235474685,"LIANGKAI  WENG","8114 SANDPIPER CIR STE 210","NOTTINGHAM","MD",21236,"DENTAL","General Dentist"]
[null,233023698,1780722876,"GREGORY K DANIEL","401 S 7TH ST STE 1","AKRON","PA",17501,"DENTAL","General Dentist"]
[null,853903432,1396835450,"TIFFANY M GOLDWYN","1616 SW SUNSET BLVD STE B","PORTLAND","OR",97239,"DENTAL","General Dentist"]
[null,461267800,1710548987,"EDITH Y LIN","7530 164TH AVE NE STE A120","REDMOND","WA",98052,"DENTAL","Periodontist"]
[null,263850834,1750403556,"SETH A BAER","110 TRENTON AVE STE 1","BARRINGTON","NJ","08007","DENTAL","General Dentist"]
[null,561319745,1841225794,"RALPH  LEONARD","140 DENTAL CIR STE 143","CHAPEL HILL","NC",27599,"DENTAL","General Dentist"]
[null,921968957,1710546189,"GABRIELLE M MORALES","1204 TWO ISLAND CT","MOUNT PLEASANT","SC",29466,"DENTAL","General Dentist"]
[null,271565534,1740365147,"ERIC D HOFFMAN","151 DEEP WOOD DR","ROUND ROCK","TX",78681,"DENTAL","General Dentist"]
[null,200915124,1538653191,"TIMOTHY  HOOVER","8212 E OAK ISLAND DR","OAK ISLAND","NC",28465,"DENTAL","General Dentist"]
[null,651191996,1275628406,"GABRIELE  SPINUSO","2800 66TH ST N","SAINT PETERSBURG","FL",33710,"DENTAL","General Dentist"]
[null,470997983,1255363180,"YOUNG S LEE","1325 FLORIDA MALL AVE","ORLANDO","FL",32809,"DENTAL","General Dentist"]
[null,473335528,1760037758,"PETER F HEITMAN","1483 TOBIAS GADSON BLVD 105","CHARLESTON","SC",29407,"DENTAL","General Dentist"]
[null,461005159,1366898249,"RICHARD I HALL","7325 GOODING BLVD","DELAWARE","OH",43015,"DENTAL","General Dentist"]
[null,874330129,1134128796,"HYON K YOO","2271 N 2ND ST","MILLVILLE","NJ","08332","DENTAL","Oral Surgeon"]
[null,760729314,1396846424,"ANTHONY  SHAYEGAN","133 JOHN ROBERT THOMAS DR","EXTON","PA",19341,"DENTAL","General Dentist"]
[null,650952509,1467523092,"CLAUDE  HARRIS","714 SOUTH ST","KEY WEST","FL",33040,"DENTAL","General Dentist"]
[null,202105002,1962629774,"JOHN S SCOVIC","324 ELM ST STE 202A","MONROE","CT","06468","DENTAL","General Dentist"]
[null,273495560,1699126144,"JONATHAN G KRUM","503 JACKSON ST","BELLE FOURCHE","SD",57717,"DENTAL","General Dentist"]
[null,232672431,1730520016,"MICHAEL F BURGER","1515 W CHESTER PIKE STE D5","WEST CHESTER","PA",19382,"DENTAL","General Dentist"]
[null,521801447,1730237330,"STEPHEN E GENTILE","1321 RIVERSIDE PKWY","BELCAMP","MD",21017,"DENTAL","General Dentist"]
[null,463249148,1518019090,"CHELSEY D BARBEE","2757 LAUREL ST STE 1","COLUMBIA","SC",29204,"DENTAL","General Dentist"]
[null,453344047,1831474477,"GROVER P BURNS","230 BUTLER RD","FREDERICKSBURG","VA",22405,"DENTAL","General Dentist"]
[null,412178409,1538204193,"DAVID P SUNG","1180 W BALTIMORE PIKE","MEDIA","PA",19063,"DENTAL","General Dentist"]
[null,521467208,1871553545,"STEPHEN R FEIT","5009 HONEYGO CENTER DR STE 106","PERRY HALL","MD",21128,"DENTAL","General Dentist"]
[null,"042761176",1386273985,"MICHAEL B MULLANY","16 PLEASANT ST","GREAT BARRINGTON","MA","01230","DENTAL","General Dentist"]
[null,873730679,1154043685,"STACEY  MORRIS","1 BELMONT AVE STE 516","BALA CYNWYD","PA",19004,"DENTAL","General Dentist"]
[null,571081524,1548377799,"H NELSON  EDDY","1144 INDIA HOOK RD STE D","ROCK HILL","SC",29732,"DENTAL","Periodontist"]
[null,300572363,1952529380,"ROLAND  BRYAN","62 WEST MAIN ST","HILLSBORO","NH","03244","DENTAL","Periodontist"]
[null,201642467,1043498306,"POUYA  HATAM","676 DEKALB PIKE","BLUE BELL","PA",19422,"DENTAL","Periodontist"]
[null,320582571,1427311612,"KARA D FORD","26908 FOGGY CREEK RD STE 101","WESLEY CHAPEL","FL",33544,"DENTAL","General Dentist"]
[null,332436149,1144697335,"JUDE  JOCHAM","26 CROSS ST","AUBURN","ME","04210","DENTAL","General Dentist"]
[null,843252479,1134748122,"JAKE  LAZER","6798 OAK HALL LN STE A1","COLUMBIA","MD",21045,"DENTAL","General Dentist"]
[null,200185918,1578567301,"MICHAEL B JERGINS","5628 CIRCA FISHHAWK BLVD","LITHIA","FL",33547,"DENTAL","General Dentist"]
[null,223410948,1265660195,"ERIC V THOMAS","209 S MAIN ST","CAPE MAY COURT HOUSE","NJ","08210","DENTAL","General Dentist"]
[null,861789282,1538921267,"ASMAA  YAGOB","712 S LOGAN BLVD","HOLLIDAYSBURG","PA",16648,"DENTAL","General Dentist"]
[null,223080939,1518047984,"BRUCE L SILVER","1816 MOUNT HOLLY RD STE 101","BURLINGTON","NJ","08016","DENTAL","General Dentist"]
[null,883332336,1194254789,"VIOLET O LAUREY","6270 LAKE OSPREY DR","SARASOTA","FL",34240,"DENTAL","General Dentist"]
[null,861789282,1013179068,"HALEY A HOLT","712 S LOGAN BLVD","HOLLIDAYSBURG","PA",16648,"DENTAL","General Dentist"]
[null,"043846490",1861880247,"JOHN J KANG","2000 MARKET ST STE BSA2","PHILADELPHIA","PA",19103,"DENTAL","General Dentist"]
[null,273976095,1134271687,"LOUIS G SPELIOS","1721 FLAGLER AVE","KEY WEST","FL",33040,"DENTAL","General Dentist"]
[null,873220400,1043662083,"ARPIT R PATEL","1202 FOULK RD","WILMINGTON","DE",19803,"DENTAL","General Dentist"]
[null,364832063,1992497689,"CHRISTIAN  WALKER","201 E LONG ST","CLAXTON","GA",30417,"DENTAL","General Dentist"]
[null,461589468,1427544576,"WHITNEY R FLIPPO","3502 CLOVERDALE RD","FLORENCE","AL",35633,"DENTAL","General Dentist"]
[null,200185918,1033735923,"JOHNATHAN CARL PARKS","9430 BUFFALO RD","PALMETTO","FL",34221,"DENTAL","General Dentist"]
[null,231365971,1013168996,"LEONA  SPERRAZZA","3223 N BROAD ST","PHILADELPHIA","PA",19140,"DENTAL","General Dentist"]
[null,231365971,1912014028,"ROBERT M SCARAZZO","3223 N BROAD ST","PHILADELPHIA","PA",19140,"DENTAL","General Dentist"]
[null,820912245,1508213323,"DANIEL J DUFFY","2520 DELANEY AVE","WILMINGTON","NC",28403,"DENTAL","General Dentist"]
[null,462058769,1043447543,"AYANNA C BRADSHAW-SYDNOR","501 SPRINGFIELD AVE","BERKELEY HEIGHTS","NJ","07922","DENTAL","General Dentist"]
[null,465679749,1174960181,"JENNIFER M D'SILVA","210 E TRADE ST STE E484","CHARLOTTE","NC",28202,"DENTAL","General Dentist"]
[null,811691420,1053849919,"KERRY  ASTON","1955 POINTE WEST DR","VERO BEACH","FL",32966,"DENTAL","General Dentist"]
[null,562169515,1184650913,"RAYMOND  BUSH","1717 SHIPYARD BLVD STE 120","WILMINGTON","NC",28403,"DENTAL","General Dentist"]
[null,232708126,1144710047,"JULIANNA  KOPAKOWSKI","240 GEIGER RD","PHILADELPHIA","PA",19115,"DENTAL","Pediatric Dentist"]
[null,843804369,1619352309,"OMAR K ALDOORI","556 N HARDING HWY","VINELAND","NJ","08360","DENTAL","General Dentist"]
[null,464593914,1255536041,"BRIAN K MCNEELY","9550 ROCKY RIVER RD STE 202","CHARLOTTE","NC",28215,"DENTAL","General Dentist"]
[null,521788554,1083068027,"WILLIAM M WAHLE","110 WEST RD STE 200","TOWSON","MD",21204,"DENTAL","General Dentist"]
[null,562185627,1104319516,"RADWA  BEHAIRY","31 OLEANDER DR","CLAYTON","NC",27527,"DENTAL","General Dentist"]
[null,462793799,1396435368,"ANDREW B BISHOP","4102 QUARLES CT","ROCKINGHAM","VA",22801,"DENTAL","General Dentist"]
[null,881869456,1689956658,"ROCHELLE N WILK","136 DRIFTING WIND RUN SUITE 109","DRIPPING SPRINGS","TX",78620,"DENTAL","General Dentist"]
[null,473796334,1841287133,"JEFF J KOA","815 TROY SCHENECTADY RD","LATHAM","NY",12110,"DENTAL","General Dentist"]
[null,861535819,1104031533,"JOSEPH F DELROCINI","658 W CUTHBERT BLVD","WESTMONT","NJ","08108","DENTAL","General Dentist"]
[null,861535819,1972677763,"OMAR  SIDDIQI","658 W CUTHBERT BLVD","WESTMONT","NJ","08108","DENTAL","General Dentist"]
[null,562185627,1073255642,"TROY D FURIMSKY","31 OLEANDER DR","CLAYTON","NC",27527,"DENTAL","General Dentist"]
[null,251773938,1366533564,"JOHN V GUSTAFSON","1253 COCOA AVE","HERSHEY","PA",17033,"DENTAL","General Dentist"]
[null,451579074,1518129998,"CLETUS A FONMEDIG","1709 CHESACO AVE","BALTIMORE","MD",21237,"DENTAL","General Dentist"]
[null,842510054,1174971238,"LAUREN S STEDDUM","2032 RENAISSANCE PARK PLACE","CARY","NC",27513,"DENTAL","General Dentist"]
[null,820548650,1366584898,"AUGUST A EBERHARDT","739 MILFORD RD","EAST STROUDSBURG","PA",18301,"DENTAL","General Dentist"]
[null,993923745,1063530715,"SANDRA  HARMON","101 ROUTE 73 S STE 129","MARLTON","NJ","08053","DENTAL","General Dentist"]
[null,851041158,1295113363,"CHRISTOPHER A HAGGARD","600 CONGAREE ROAD","GREENVILLE","SC",29607,"DENTAL","Periodontist"]
[null,263861343,1184619538,"CHARLES  STEPHEN-HASSARD","1003 SUSHRUTA DR","MARTINSBURG","WV",25401,"DENTAL","General Dentist"]
[null,991022518,1639770266,"FAHAD G KHAN","1480 RYMCO DR SUITE A","WINSTON-SALEM","NC",27103,"DENTAL","General Dentist"]
[null,475491789,1073927752,"ANDREW C DULANEY","310 BYRAM PL STE C","BYRAM","MS",39272,"DENTAL","General Dentist"]
[null,263665946,1912043068,"SINA  REANGBER","15234 WASHINGTON ST","HAYMARKET","VA",20169,"DENTAL","General Dentist"]
[null,231365971,1619604121,"BERFIN  KARATAS JACOBS","3223 N BROAD ST","PHILADELPHIA","PA",19140,"DENTAL","General Dentist"]
[null,263172998,1518310234,"CHENDI  XU","719 MAIN ST","HARWICH","MA","02645","DENTAL","General Dentist"]
[null,271467916,1366617953,"BRIAN C JENSEN","1177 N EAGLE ROAD","EAGLE","ID",83616,"DENTAL","General Dentist"]
[null,272183157,1720375470,"JORDAN D COLLINS","1401 MARVIN RD NE STE 302","LACEY","WA",98516,"DENTAL","General Dentist"]
[null,233024574,1861532442,"SAMUEL I KRATCHMAN","135 S BRYN MAWR AVE STE 340","BRYN MAWR","PA",19010,"DENTAL","Endodontist"]
[null,872590565,1831829472,"RADHIKA  MALHOTRA","1933 DELANCEY PL","PHILADELPHIA","PA",19103,"DENTAL","General Dentist"]
[null,233024574,1902947518,"KENNETH  LEE","135 S BRYN MAWR AVE STE 340","BRYN MAWR","PA",19010,"DENTAL","Endodontist"]
[null,831011434,1265780472,"STEPHEN HERBERT LEVY","9501 OLD ANNAPOLIS RD STE 309","ELLICOTT CITY","MD",21042,"DENTAL","General Dentist"]
[null,231365971,1508036682,"SHARI J SKLAR","3223 N BROAD ST","PHILADELPHIA","PA",19140,"DENTAL","General Dentist"]
[null,232624793,1457531931,"THOMAS L CHERMOL","801 YALE AVE STE 518","SWARTHMORE","PA",19081,"DENTAL","General Dentist"]
[null,200185918,1073962965,"RAQUEL M HAMRICK","2532 STATE ROAD 580 STE F","CLEARWATER","FL",33761,"DENTAL","General Dentist"]
[null,650796764,1134385651,"PHILIP S DESENZE","540 E MCNAB RD STE E","POMPANO BEACH","FL",33060,"DENTAL","General Dentist"]
[null,992271701,1831712892,"BHUMI  DHARIA","2699 1ST AVE N","SAINT PETERSBURG","FL",33713,"DENTAL","General Dentist"]
[null,562185627,1851916753,"DENIA  CISLO","1215 WEST GATE DR STE 180","LELAND","NC",28451,"DENTAL","General Dentist"]
[null,923455017,1124258215,"PATRICK K BROWN","1300 BRIDGE BARRIER RD STE 4","CAROLINA BEACH","NC",28428,"DENTAL","General Dentist"]
[null,863119749,1407902463,"GERALD J LORINO","1550 MATTHEW DR","FORT MYERS","FL",33907,"DENTAL","General Dentist"]
[null,232972143,1760659361,"PAUL  ANAGNOSTAKOS","4 ARBOR LN","FEASTERVILLE TREVOSE","PA",19053,"DENTAL","General Dentist"]
[null,452033337,1578579157,"DONOVAN  YOUNG","2733 PAPERMILL RD","WYOMISSING","PA",19610,"DENTAL","General Dentist"]
[null,541123092,1750860623,"IRTIZA G ABBAS","5849 HARBOUR VIEW BLVD STE 100","SUFFOLK","VA",23435,"DENTAL","General Dentist"]
[null,871538990,1003279290,"RILEY  BALDWIN","294 UPPER MAIN ST","MORRISVILLE","VT","05661","DENTAL","General Dentist"]
[null,231352685,1861614562,"MARC  HENSCHEL","10 MEADOWOOD DR","LANGHORNE","PA",19047,"DENTAL","General Dentist"]
[null,200185918,1518319953,"SHRUTI  CHOPRA","685 CROSSWATER PKWY STE A","PONTE VEDRA","FL",32081,"DENTAL","General Dentist"]
[null,923331036,1235547969,"DANA I ATTAWAY","516 E MAIN ST","ST CHARLES","IL",60174,"DENTAL","General Dentist"]
[null,680658671,1124130216,"A BRITTON DOLLY","2854 NORTHWESTERN PIKE","CAPON BRIDGE","WV",26711,"DENTAL","General Dentist"]
[null,472665132,1659636785,"SHANE D RUGGLESS","1001 CLOCKTOWER DR","SPRINGFIELD","IL",62704,"DENTAL","General Dentist"]
[null,823711837,1710900204,"MARK C GLADNICK","5513 KIRKWOOD HWY","WILMINGTON","DE",19808,"DENTAL","General Dentist"]
[null,233051685,1306971072,"MICHAEL A BLASEK","1000 E WELSH RD","AMBLER","PA",19002,"DENTAL","General Dentist"]
[null,461727123,1700065653,"DAVID A MERRELL","205 FLAT CREEK VILLAGE DR","WEAVERVILLE","NC",28787,"DENTAL","General Dentist"]
[null,464924313,1912040890,"ABDUL  KHAN","12036 COBBLESTONE DR","HUDSON","FL",34667,"DENTAL","General Dentist"]
[null,473971801,1760618094,"SHIMMA  ABDULLA","333 E CITY AVE STE IL43","BALA CYNWYD","PA",19004,"DENTAL","General Dentist"]
[null,453814943,1528372133,"RYAN G CLARK","2521 US ROUTE 11 BX 259","LA FAYETTE","NY",13084,"DENTAL","General Dentist"]
[null,"061682499",1992827711,"JOSHUA P WEINTRAUB","10407 STEVENSON RD","STEVENSON","MD",21153,"DENTAL","General Dentist"]
[null,845087566,1124033774,"DILIP N DUDHAT","1601 WALNUT ST STE 1025","PHILADELPHIA","PA",19102,"DENTAL","General Dentist"]
[null,547251532,1225175946,"YOUNG J KIM","2510 FEDERAL ST","CAMDEN","NJ","08105","DENTAL","General Dentist"]
[null,260357554,1639502784,"DANY  JOSE","1060 S US HIGHWAY 441","LADY LAKE","FL",32159,"DENTAL","General Dentist"]
[null,263975070,1699175745,"STEPHANIE  FERREIRA","1050 BUENAVENTURA BLVD","KISSIMMEE","FL",34743,"DENTAL","General Dentist"]
[null,510519628,1942317045,"ELENA M KOFMAN","1599 PAOLI PIKE","WEST CHESTER","PA",19380,"DENTAL","General Dentist"]
[null,465111097,1992010508,"SARAH  LATIF","1340 WASHINGTON ST","WATERTOWN","NY",13601,"DENTAL","Endodontist"]
[null,274016911,1013646165,"KAYLIE  NGUYEN","804 S STATE STREET","DOVER","DE",19901,"DENTAL","Periodontist"]
[null,550779560,1528154457,"TROY L MCGREW","10 PROFESSIONAL VILLAGE CIRCLE","BEAUFORT","SC",29907,"DENTAL","Endodontist"]
[null,814199858,1578134284,"BILAL  ZAHOOR","5015 HARPETH DR STE A","BRENTWOOD","TN",37027,"DENTAL","General Dentist"]
[null,203929658,1629715305,"MICHAEL  REIDY","1055 NIMITZVIEW DR","CINCINNATI","OH",45230,"DENTAL","General Dentist"]
[null,200913298,1952445348,"JASON R SMITHBERGER","658 KENILWORTH DR STE 201","TOWSON","MD",21204,"DENTAL","General Dentist"]
[null,581970693,1871948695,"KYLE R GARRETT","6076 LAKESIDE COMMONS DR","MACON","GA",31210,"DENTAL","General Dentist"]
[null,465148598,1780959411,"NADDER M HASSAN","9954 LIBERIA AVE","MANASSAS","VA",20110,"DENTAL","General Dentist"]
[null,"010332774",1003986589,"PETER  THEN","254 WESTERN AVE","S PORTLAND","ME","04106","DENTAL","Periodontist"]
[null,883848002,1720717267,"MARCELLOUS K STANSBERRY","2106 CHARLOTTE AVE","NASHVILLE","TN",37203,"DENTAL","General Dentist"]
[null,933187334,1871671057,"CHRISTOPHER B FORSEE","30180 OVERSEAS HWY","BIG PINE KEY","FL",33043,"DENTAL","General Dentist"]
[null,880948632,1487656526,"DAVID  FINE","7479 LAKE WORTH RD STE B","LAKE WORTH","FL",33467,"DENTAL","General Dentist"]
[null,522259263,1598011066,"SARAH  NAGHIBI","128 LUBRANO DR STE 300","ANNAPOLIS","MD",21401,"DENTAL","Oral Surgeon"]
[null,844797574,1144069410,"KARA  SANFORD","1517 PACKER AVE","PHILADELPHIA","PA",19145,"DENTAL","General Dentist"]
[null,522013077,1316160716,"HENRY  HONICK","4367 HOLLINS FERRY RD","BALTIMORE","MD",21227,"DENTAL","General Dentist"]
[null,451625948,1487035283,"EDWARD H HALE","1281 MAIN ST","DAPHNE","AL",36526,"DENTAL","General Dentist"]
[null,232866518,1033529482,"LAURA C MACKEY","165 DOWLIN FORGE RD","EXTON","PA",19341,"DENTAL","General Dentist"]
[null,853879634,1356432272,"ANTHONY M ZALIS","931 E HAVERFORD RD","BRYN MAWR","PA",19010,"DENTAL","General Dentist"]
[null,823388814,1417057985,"MARK T ALBERS","2155 HOLLOW BROOK DR STE 20","COLORADO SPRINGS","CO",80918,"DENTAL","General Dentist"]
[null,571016163,1568750735,"ELIZABETH C ROBINSON","1721 EBENEZER RD  STE 135","ROCK HILL","SC",29732,"DENTAL","General Dentist"]
[null,991178546,1023365905,"MANSHI HARSHAD PATEL","250 W LANCASTER AVE STE 130","FORT WORTH","TX",76102,"DENTAL","General Dentist"]
[null,453113931,1578719548,"JESSICA M BYRNE","796 EAST ST","PITTSBORO","NC",27312,"DENTAL","General Dentist"]
[null,200185918,1659678985,"BRIAN ALEX HARRINGTON","5210 CREEKWOOD BLVD E","BRADENTON","FL",34203,"DENTAL","General Dentist"]
[null,721212880,1164423497,"DARRELL  HARTSFIELD","6351 MAIN ST","ZACHARY","LA",70791,"DENTAL","General Dentist"]
[null,272900398,1134450331,"GRAHAM  FARLESS","2511 OAKCREST AVE","GREENSBORO","NC",27408,"DENTAL","General Dentist"]
[null,832644470,1821160953,"BERNADETTE A LOGAN","72 PAOLI PIKE","PAOLI","PA",19301,"DENTAL","General Dentist"]
[null,"092421601",1982712170,"MICHAEL S MATZ","8302 OLD YORK RD # C 200","ELKINS PARK","PA",19027,"DENTAL","General Dentist"]
[null,650441850,1902025349,"CHRISTOPHER W RICKER","2560 RCA BLVD STE 110","PALM BEACH GARDENS","FL",33410,"DENTAL","General Dentist"]
[null,271554700,1316045859,"BENJAMIN KENNETH MORICZ","3990 CLARK RD","SARASOTA","FL",34233,"DENTAL","General Dentist"]
[null,832644470,1760856041,"MEHUL  SHAH","72 PAOLI PIKE","PAOLI","PA",19301,"DENTAL","General Dentist"]
[null,814814890,1962793174,"RYAN J COLLETTA","27421 TOURNEY RD STE 150","VALENCIA","CA",91355,"DENTAL","Oral Surgeon"]
[null,561565529,1760591655,"DEBRA S ZOMBEK","1284 NEWSOME ST","MOUNT AIRY","NC",27030,"DENTAL","General Dentist"]
[null,463251811,1992020390,"ROBERT M BLITZER","703 HEALTH SERVICES DR","SEAFORD","DE",19973,"DENTAL","General Dentist"]
[null,832722671,1356797153,"KATIE  PIET","49 W CHURCH ST","HARDWICK","VT","05843","DENTAL","General Dentist"]
[null,843253840,1942788146,"COREY  MELE","40 W EVERGREEN AVE STE 111","PHILADELPHIA","PA",19118,"DENTAL","General Dentist"]
[null,310855624,1467200725,"RYAN C BURKHART","4575 WINCHESTER PIKE","COLUMBUS","OH",43232,"DENTAL","General Dentist"]
[null,841828671,1104276260,"DAVID W IRBY","3501 FRANKLIN RD SW","ROANOKE","VA",24014,"DENTAL","General Dentist"]
[null,841004315,1629190194,"JOHN R DODGE","2601 N BROADWAY","BOULDER","CO",80304,"DENTAL","Periodontist"]
[null,820669074,1366547853,"CRAIG M MIZE","2090 WATERSCAPE WAY","NEW BERN","NC",28562,"DENTAL","General Dentist"]
[null,472373687,1750502159,"KATHERINE  WILSON","25 NEW HAMPSHIRE AVE 285","PORTSMOUTH","NH","03801","DENTAL","Periodontist"]
[null,464242046,1740592518,"MARTIN  LEYBOVICH","1866A REISTERSTOWN RD","PIKESVILLE","MD",21208,"DENTAL","Periodontist"]
[null,221996104,1134192784,"MICHAEL E STERN","109 LIVINGSTON AVE","NEW BRUNSWICK","NJ","08901","DENTAL","Oral Surgeon"]
[null,582448045,1235258286,"RICHARD M ZEBELL","402 W MAIN ST","SWAINSBORO","GA",30401,"DENTAL","General Dentist"]
[null,263375538,1568587178,"CHRISTOPHER S GODFREY","127 E 5TH ST","NATCHITOCHES","LA",71457,"DENTAL","General Dentist"]
[null,271652245,1154586162,"AMAL  RASTOGI","11855 HOLLY LN STE 106","WALDORF","MD",20601,"DENTAL","Periodontist"]
[null,260801564,1699866798,"CATHERINE G REIMELS","13605 REESE BLVD W","HUNTERSVILLE","NC",28078,"DENTAL","General Dentist"]
[null,455614682,1225110398,"BARRY H STEINBERG","876 COLUMBIA STREET","HUDSON","NY",12534,"DENTAL","General Dentist"]
[null,842364077,1669856530,"ANDREW R HARRELL","100 EXECUTIVE PARK","ASHEVILLE","NC",28801,"DENTAL","General Dentist"]
[null,331483536,1366401762,"ALINA  RODEK","5775 N. MAIN ST.","ROCK HALL","MD",21661,"DENTAL","General Dentist"]
[null,851570210,1902333990,"PRESTON M BECK","7405 MORRO RD","ATASCADERO","CA",93422,"DENTAL","General Dentist"]
[null,431969531,1043283070,"BRIAN D FLETCHER","1212 BOOKCLIFF AVE STE 4","GRAND JUNCTION","CO",81501,"DENTAL","General Dentist"]
[null,522207538,1144244773,"KINGSLEY U ACHIKEH","8780 GEORGIA AVE","SILVER SPRING","MD",20910,"DENTAL","General Dentist"]
[null,650665173,1083395743,"WINSTON  RAMSAY","900 N SUNCOAST BLVD","CRYSTAL RIVER","FL",34429,"DENTAL","General Dentist"]
[null,591368180,1679050819,"JOSHUA S MUNCH","2137 E COUNTY ROAD 540A","LAKELAND","FL",33813,"DENTAL","General Dentist"]
[null,454080678,1194807214,"MICHAEL R HILLEARY","157 HOLLAND AVE","WESTOVER","WV",26501,"DENTAL","General Dentist"]
[null,462194104,1568554830,"NAVIN  BOGG","1119 RARITAN RD","CLARK","NJ","07066","DENTAL","General Dentist"]
[null,810851229,1649321852,"THOMAS J BEVELOCK","214 N MAIN ST","JAMESTOWN","TN",38556,"DENTAL","General Dentist"]
[null,"050357383",1770679979,"MAHRA B RUBINSTEIN","362 IVES STREET","PROVIDENCE","RI","02906","DENTAL","General Dentist"]
[null,562217863,1841377827,"C E BROWN","2601 OAKCREST AVE STE C","GREENSBORO","NC",27408,"DENTAL","Periodontist"]
[null,592747523,1548435415,"DAVID S TRETTENERO","13440 PARKER COMMONS BLVD #104","FORT MYERS","FL",33912,"DENTAL","General Dentist"]
[null,820562632,1790521409,"LOGAN  LOUQUE","4101 MAIN ST STE D","HILTON HEAD ISLAND","SC",29926,"DENTAL","General Dentist"]
[null,851672359,1376909275,"ANNA E BORDEN","1127 QUEENSBOROUGH BLVD STE 107","MOUNT PLEASANT","SC",29464,"DENTAL","General Dentist"]
[null,333518401,1922405604,"NAILA  MANJI","776 W LANCASTER AVE","BRYN MAWR","PA",19010,"DENTAL","General Dentist"]
[null,464181884,1659444958,"TOMMIE H LANCASTER","1301 N HOWE ST","SOUTHPORT","NC",28461,"DENTAL","General Dentist"]
[null,205535919,1629275607,"ALBERT M JONES","103 W MAIN ST","WASHINGTON","NC",27889,"DENTAL","General Dentist"]
[null,931552941,1063590339,"DOROTHY J CONWAY-QUINN","1500 NORTH KINGS HWY SUITE 100A","CHERRY HILL","NJ","08034","DENTAL","General Dentist"]
[null,473984632,1285783043,"JOHN  KUPCHA","10 S MAIN ST","MULLICA HILL","NJ","08062","DENTAL","General Dentist"]
[null,232870037,1518179340,"JONATHAN BROOKE LEWIS","103 E MAIN ST","SILVERDALE","PA",18962,"DENTAL","General Dentist"]
[null,"030454463",1073723326,"MICHAEL H DAVIS","15680 WELLS HWY","SENECA","SC",29678,"DENTAL","General Dentist"]
[null,273522308,1306045430,"JAMES  THOMPSON","130 CROSS ROADS PLZ","MOUNT PLEASANT","PA",15666,"DENTAL","General Dentist"]
[null,831783286,1689981250,"STEVEN BROCK  MILLER","3321 W ROCK CREEK RD STE 130","NORMAN","OK",73072,"DENTAL","Endodontist"]
[null,232791493,1811052327,"NICHOLAS L WENGRIN","4810 HORSESHOE PIKE","HONEY BROOK","PA",19344,"DENTAL","General Dentist"]
[null,222047975,1285792184,"JOHN P LITTLE","804 HIGHWAY 71","SEA GIRT","NJ","08750","DENTAL","General Dentist"]
[null,881311628,1457906257,"MICHAEL Y PARK","1702 TRANSPORTATION BLVD STE F","CROFTON","MD",21114,"DENTAL","General Dentist"]
[null,311833826,1316101025,"TRACY N TAYLOR","202 E LOCUST ST","FAIRBURY","IL",61739,"DENTAL","General Dentist"]
[null,223575841,1114657376,"CATHERINE F SHAO","25 N MAIN ST","MEDFORD","NJ","08055","DENTAL","General Dentist"]
[null,561133278,1972974780,"NATHAN  HORWITZ","1313 EASTCHESTER DR","HIGH POINT","NC",27265,"DENTAL","Endodontist"]
[null,208847282,1831309558,"TARA L HAID","6455 POST RD STE A","DUBLIN","OH",43016,"DENTAL","General Dentist"]
[null,880845263,1528276185,"GREGORY E OXFORD","100 WHETSTONE PL STE 308","ST AUGUSTINE","FL",32086,"DENTAL","General Dentist"]
[null,464113251,1013133156,"WILLIAM R PLASTER","1455 E MARION ST STE F","SHELBY","NC",28150,"DENTAL","General Dentist"]
[null,201709440,1801902804,"FATEN K NAKHLA","77 GARLAND LN","WILLINGBORO","NJ","08046","DENTAL","General Dentist"]
[null,522067980,1093895377,"EDWARD J LEDDEN","2415 SILVERSIDE RD","WILMINGTON","DE",19810,"DENTAL","General Dentist"]
[null,593272532,1629476338,"THOMAS M SEDLAK","3288 E THOMAS ST","INVERNESS","FL",34453,"DENTAL","General Dentist"]
[null,271577629,1669423315,"THORPE C WHITEHEAD","55 AMARILLO LN","SANFORD","NC",27332,"DENTAL","General Dentist"]
[null,994383396,1407913510,"RICKY J RUBIN","213 BULIFANTS BLVD STE E","WILLIAMSBURG","VA",23188,"DENTAL","General Dentist"]
[null,201272092,1952830580,"MICHAEL D HOANG","1451 SEBASTIAN BLVD STE 180","SEBASTIAN","FL",32958,"DENTAL","General Dentist"]
[null,200185918,1912524315,"MAVI  CRUZ","1405 S 25TH ST STE B","FORT PIERCE","FL",34947,"DENTAL","General Dentist"]
[null,921288297,1013145630,"AKSHAY  RAJPAL","212 N WHITE HORSE PKE","STRATFORD","NJ","08084","DENTAL","General Dentist"]
[null,871491202,1174250740,"FERNANDO  SAAVEDRA","7820 SHRADER RD","RICHMOND","VA",23294,"DENTAL","General Dentist"]
[null,223341978,1093822819,"HOWARD B CETEL","100B KINGS WAY W","SEWELL","NJ","08080","DENTAL","General Dentist"]
[null,815169039,1740400332,"JAMIE O STAUSS","3 PLATTEKILL AVE","NEW PALTZ","NY",12561,"DENTAL","General Dentist"]
[null,251793143,1851837330,"DAVID  YOVIC","5525 LOCUST LN","HARRISBURG","PA",17109,"DENTAL","General Dentist"]
[null,200030858,1700812484,"ALLAN  ACTON","915 KILDAIRE FARM RD","CARY","NC",27511,"DENTAL","General Dentist"]
[null,813793901,1245426972,"RUSSELL N MOSHER","1320 ALVERSER PLZ","MIDLOTHIAN","VA",23113,"DENTAL","General Dentist"]
[null,231966639,1467551317,"JOHN E RICHARDSON","19 MORRIS AVE","BRYN MAWR","PA",19010,"DENTAL","General Dentist"]
[null,930765859,1073723953,"LEE C LONG","1503 THIRD STREET","TILLAMOOK","OR",97141,"DENTAL","General Dentist"]
[null,592747313,1346850849,"JACKSON  REDDICK","440 S BUCKMOORE RD","LAKE WALES","FL",33853,"DENTAL","General Dentist"]
[null,871396870,1124186366,"RICHARD  DELBOCCIO","2300 TAMIAMI TRL STE 13 & 14","PORT CHARLOTTE","FL",33952,"DENTAL","General Dentist"]
[null,221934808,1780724575,"JAMES P SIKORSKI","233 LAUREL HEIGHTS DR","BRIDGETON","NJ","08302","DENTAL","General Dentist"]
[null,871953968,1639393721,"ASMA M MAMSA","2213 NORTH BLVD W","DAVENPORT","FL",33837,"DENTAL","General Dentist"]
[null,521665238,1164429387,"DAVID C BASTACKY","516 N ROLLING RD STE 208","BALTIMORE","MD",21228,"DENTAL","Oral Surgeon"]
[null,923912960,1386721942,"PAUL HENRY ULIASZ","10551 6 MILE CYPRESS PKWY","FORT MYERS","FL",33966,"DENTAL","General Dentist"]
[null,842364077,1669856530,"ANDREW R HARRELL","200 BEVERLY HANKS CTR STE B","HENDERSONVILLE","NC",28792,"DENTAL","General Dentist"]
[null,540897518,1235679432,"NICHOLAS L BROCCOLI","5942 HARBOUR PARK DR","MIDLOTHIAN","VA",23112,"DENTAL","Oral Surgeon"]
[null,"010474598",1437271061,"BRIAN P VANEMMERIK","356 AIRPORT ROAD","STONINGTON","ME","04681","DENTAL","General Dentist"]
[null,991358652,1376037846,"STEVEN  HIPPELI","375 PIERCE ST","KINGSTON","PA",18704,"DENTAL","General Dentist"]
[null,823674724,1396866588,"LINO  DASTI","301 DAWSON ST","MOORESTOWN","NJ","08057","DENTAL","General Dentist"]
[null,832751085,1225883242,"HA Y CHOI","26 KINGS HWY W","HADDONFIELD","NJ","08033","DENTAL","General Dentist"]
[null,830637259,1043491459,"JASON  YI","13415 CONNECTICUT AVE STE 201","SILVER SPRING","MD",20906,"DENTAL","General Dentist"]
[null,811691420,1417174061,"TIFFANY A SPALLONE","1955 POINTE WEST DR","VERO BEACH","FL",32966,"DENTAL","General Dentist"]
[null,273900278,1699091579,"ASMA  KHAN","155 TRADERS WAY STE 400","POOLER","GA",31322,"DENTAL","General Dentist"]
[null,260185892,1467419374,"DOUGLAS A WEBSTER","5371 GLOVER LN","MILTON","FL",32570,"DENTAL","General Dentist"]
[null,231365971,1083811046,"FRANK J SAMMARTINO","3223 N BROAD ST","PHILADELPHIA","PA",19140,"DENTAL","General Dentist"]
[null,205860113,1992087365,"STEPHANIE A ADKINS","49 ROCK SPRINGS RD","CONOWINGO","MD",21918,"DENTAL","General Dentist"]
[null,882453251,1346866639,"NOLIN  CONNELL","531 SAINT CLAIR ST SE","RUSSELLVILLE","AL",35653,"DENTAL","General Dentist"]
[null,331478731,1174626360,"AARON M MEMON","14500 TAMIAMI TRL","NORTH PORT","FL",34287,"DENTAL","General Dentist"]
[null,821595137,1326576828,"JEFFREY J HARRIE","3525 25TH ST S","FARGO","ND",58104,"DENTAL","General Dentist"]
[null,593825493,1699844522,"PATRICK L JOHNSON","1919 TURNBURY DR","GREENVILLE","NC",27858,"DENTAL","General Dentist"]
[null,821998638,1689088437,"AARTI K LALA","623 HORSHAM RD STE A","HORSHAM","PA",19044,"DENTAL","General Dentist"]
[null,200091594,1497496715,"ROCIO E SANCHEZ PADILLA","2301 PLATT RD STE 100","ANN ARBOR","MI",48104,"DENTAL","Periodontist"]
[null,465494711,1033370069,"FORREST  RAYMON FAULKNER","4041 HIGHWAY 90","PACE","FL",32571,"DENTAL","General Dentist"]
[null,882878673,1699525980,"MIA  KNAVISH","687 BLYTHE STREET CT STE B","HENDERSONVILLE","NC",28739,"DENTAL","General Dentist"]
[null,510519628,1942317045,"ELENA M KOFMAN","1599 PAOLI PIKE","WEST CHESTER","PA",19380,"DENTAL","General Dentist"]
[null,200185918,1457910200,"KRISTEN  TRACY","7705 COLLIER BLVD UNIT 404","NAPLES","FL",34114,"DENTAL","General Dentist"]
[null,263748128,1750596045,"TIMOTHY  MEDIANICK","430 KENHORST BLVD","READING","PA",19611,"DENTAL","General Dentist"]
[null,832664040,1578902904,"BRANDON K WHITE","8642 FOREST RD","GOODE","VA",24556,"DENTAL","General Dentist"]
[null,233073282,1811015324,"DAMON V TOMEO","1064 MEMORIAL HWY","OLEY","PA",19547,"DENTAL","General Dentist"]
[null,472299442,1760817001,"ATHANASIOS  NTOUNIS","609 EMANCIPATION HWY STE 101","FREDERICKSBURG","VA",22401,"DENTAL","Periodontist"]
[null,232860692,1487628319,"STEVEN D DANZIG","147 MONTGOMERY AVE","BALA CYNWYD","PA",19004,"DENTAL","General Dentist"]
[null,232173361,1851602775,"SCOTT J SOLOW","990 CITY AVE","WYNNEWOOD","PA",19096,"DENTAL","Pediatric Dentist"]
[null,882481237,1790749323,"LOREN K MASUOKA","7151 RICHMOND RD STE 305","WILLIAMSBURG","VA",23188,"DENTAL","General Dentist"]
[null,833261170,1952309692,"KENNETH  LEPOW","9125 WEST RD","HOUSTON","TX",77064,"DENTAL","General Dentist"]
[null,232184787,1891827341,"CLAIR D TREESE","620 N HANOVER ST","ELIZABETHTOWN","PA",17022,"DENTAL","General Dentist"]
[null,800877361,1003302142,"DANIEL F CIABATTONI","4906 PENN AVE","SINKING SPRING","PA",19608,"DENTAL","General Dentist"]
[null,454015297,1447401187,"STEVEN H DEETS","5690 ALLENTOWN BLVD","HARRISBURG","PA",17112,"DENTAL","General Dentist"]
[null,481294333,1831287929,"TIMOTHY M HALE","810 S MASON RD STE 325","KATY","TX",77450,"DENTAL","Periodontist"]
[null,853211765,1902323306,"JESSICA J GRUDEN","2875 CENTER RD STE 1","BRUNSWICK","OH",44212,"DENTAL","General Dentist"]
[null,881041987,1134505001,"SUHASINI  MANDIGA","5250 FREEMANSBURG AVE","EASTON","PA",18045,"DENTAL","General Dentist"]
[null,383176563,1972617496,"JOSEPH A FERGUSON","8670 FERRY ST","MONTAGUE","MI",49437,"DENTAL","General Dentist"]
[null,680558045,1740083070,"DEREK L BAWDEN","5331 S SUPERSTITION MTN DR STE 108","GOLD CANYON","AZ",85218,"DENTAL","General Dentist"]
[null,453261083,1023198033,"TIMOTHY D SINES","1193 PINEVIEW DR","MORGANTOWN","WV",26505,"DENTAL","General Dentist"]
[null,931513851,1578977765,"JESSE A ALONSO","915 N PARSONS AVE","BRANDON","FL",33510,"DENTAL","General Dentist"]
[null,541186353,1245382878,"STEVEN K LARKIN","10140 STAPLES MILL RD","GLEN ALLEN","VA",23060,"DENTAL","General Dentist"]
[null,832549193,1669093480,"GARETT N BARRY","189 S CHARLES RICHARD BEALL BLVD STE 100","DEBARY","FL",32713,"DENTAL","General Dentist"]
[null,852328980,1437459609,"AMEN  DHYLLON","7516 CITY AVE STE 15","PHILADELPHIA","PA",19151,"DENTAL","General Dentist"]
[null,650670515,1558535260,"JOHN D MILLER","399 TEQUESTA DR STE 104","TEQUESTA","FL",33469,"DENTAL","General Dentist"]
[null,991022518,1972097251,"MATTHEW M KOSTELIC","1480 RYMCO DR SUITE A","WINSTON-SALEM","NC",27103,"DENTAL","General Dentist"]
[null,202870310,1629700992,"ANTHONY C SOUTH","15820 DORA AVE STE A","TAVARES","FL",32778,"DENTAL","General Dentist"]
[null,134240307,1023088408,"YOOSON E KIM","935 HERITAGE DR","ELVERSON","PA",19520,"DENTAL","General Dentist"]
[null,251536173,1811001647,"JONATHAN K COLE","190 W PARK AVE STE 4","DUBOIS","PA",15801,"DENTAL","Periodontist"]
[null,232175092,1013111426,"BRIAN  BOWSER","845 EDGEWOOD RD","YORK","PA",17402,"DENTAL","General Dentist"]
[null,593189433,1629294418,"WESLEY A SHEROUSE","4790 N 9TH AVE","PENSACOLA","FL",32503,"DENTAL","General Dentist"]
[null,800632928,1134807308,"RESHIKA  SUBBAKARAN","2 CAMPBELL ST","LEBANON","NH","03766","DENTAL","General Dentist"]
[null,274260797,1386943355,"MITCHELL  LEVITT","5757 WILSHIRE BLVD STE 559","LOS ANGELES","CA",90036,"DENTAL","General Dentist"]
[null,332245163,1215312871,"GEORGE R HELMY","7895 SEMINOLE BLVD STE 202","SEMINOLE","FL",33772,"DENTAL","General Dentist"]
[null,395705546,1982611448,"EUGENE H YOUNG","924 ARCH ST BSMT","PHILADELPHIA","PA",19107,"DENTAL","General Dentist"]
[null,201237159,1013309384,"TEERAWEE  UNCHALIPONGSE","580 MYRTLE AVE","BROOKLYN","NY",11205,"DENTAL","General Dentist"]
[null,461312591,1821227042,"TODD M BRITTEN","1472 JORDAN HILLS CT","CLEARWATER","FL",33756,"DENTAL","General Dentist"]
[null,270259678,1548424146,"PATRICK F KING","629 N GALENA AVE STE 230","DIXON","IL",61021,"DENTAL","Endodontist"]
[null,473047634,1124260104,"AREZOU  GARMESTANI","14540 JOHN MARSHALL HWY STE 103","GAINESVILLE","VA",20155,"DENTAL","General Dentist"]
[null,832990427,1043764996,"RAJIV  PATEL","901 N WINSTEAD AVE STE 120","ROCKY MOUNT","NC",27804,"DENTAL","General Dentist"]
[null,874390966,1366000820,"ABIGAIL J MANZELLA","16 WYMAN RD","WESTMINSTER","MA","01473","DENTAL","General Dentist"]
[null,863196243,1811933591,"BOBBIE L HAWRANKO","1350 LOCUST ST STE 407","PITTSBURGH","PA",15219,"DENTAL","General Dentist"]
[null,610991938,1285773374,"PAUL C BROOKS III","3600 LEXINGTON RD","LOUISVILLE","KY",40207,"DENTAL","General Dentist"]
[null,490845577,1316063811,"LISA E BLUMOFE","2093 RAND RD","DES PLAINES","IL",60016,"DENTAL","General Dentist"]
[null,208935457,1134449234,"ANDREW  HOPPE","3043 INTERNATIONAL GOLF PKWY","SAINT AUGUSTINE","FL",32092,"DENTAL","General Dentist"]
[null,812396174,1033497409,"KETAN  GINOYA","13901 COASTAL HWY STE 4","OCEAN CITY","MD",21842,"DENTAL","General Dentist"]
[null,881186055,1730568841,"ADAM L COHEN","141 TUCKAHOE RD STE 380","SEWELL","NJ","08080","DENTAL","Oral Surgeon"]
[null,"043735133",1316185275,"DENNIS B DAVIS","12161 COUNTY ROAD 103 STE 101","OXFORD","FL",34484,"DENTAL","Periodontist"]
[null,812396174,1679610166,"DAVID  STEELE","13901 COASTAL HWY STE 4","OCEAN CITY","MD",21842,"DENTAL","General Dentist"]
[null,204711056,1801927025,"JOHN B FONTANA","1702 LOVERING AVE","WILMINGTON","DE",19806,"DENTAL","General Dentist"]
[null,205138437,1154401677,"CHRISTOPHER L ROSS","1550 S HIGHLAND AVE STE A","CLEARWATER","FL",33756,"DENTAL","Endodontist"]
[null,991858841,1659686707,"LUKE A LISZKA","910 JOHNNIE DODDS BLVD STE 120","MOUNT PLEASANT","SC",29464,"DENTAL","Periodontist"]
[null,"042467091",1386837797,"SOTIRIOS  DIAMANTIS","26 NORTH RD 2ND FLOOR","CHELMSFORD","MA","01824","DENTAL","Oral Surgeon"]
[null,823310045,1093165813,"ARMIN K SALIMI","7307 BALTIMORE AVE STE 114","COLLEGE PARK","MD",20740,"DENTAL","General Dentist"]
[null,261997658,1235356742,"GREGORY P CORTELLESSA","1270 SHELBOURNE RD","READING","PA",19606,"DENTAL","General Dentist"]
[null,273900278,1063082170,"TONY V TRAN","516 GA HIGHWAY 247 S","BONAIRE","GA",31005,"DENTAL","General Dentist"]
[null,232628134,1578681706,"DANIEL H GREEN","1150 VALLEY FORGE RD STE 101","PHOENIXVILLE","PA",19460,"DENTAL","General Dentist"]
[null,841972601,1639800360,"AASTHA J GANDHI","15820 SHADDOCK DR STE 160 Suite 160","WINTER GARDEN","FL",34787,"DENTAL","General Dentist"]
[null,863673628,1144076209,"GABRIELLE  GRISONI","1830 PROSPECTOR AVE","PARK CITY","UT",84060,"DENTAL","General Dentist"]
[null,471643227,1609216373,"AMANDA B MIDDLETON","2537 RAEFORD RD STE B","FAYETTEVILLE","NC",28305,"DENTAL","General Dentist"]
[null,134242324,1013078740,"KRYSTLE H CHUONG","957 BEN FRANKLIN HWY W STE C","DOUGLASSVILLE","PA",19518,"DENTAL","General Dentist"]
[null,200185918,1376112185,"PRIYA  CHOPRA","7811 SW HIGHWAY 200","OCALA","FL",34476,"DENTAL","General Dentist"]
[null,"061030009",1356238117,"ALIREZA  ORYAN","1185 SILAS DEANE HWY","WETHERSFIELD","CT","06109","DENTAL","General Dentist"]
[null,200185918,1750957569,"STEPHEN  SLADE","1984 ALAFAYA TRL STE 1006","OVIEDO","FL",32765,"DENTAL","General Dentist"]
[null,843576532,1346651874,"ANDREW S MCNEAL","3415 ROGERS RD STE 100","WAKE FOREST","NC",27587,"DENTAL","General Dentist"]
[null,821125786,1386951598,"ERIN  PALUCHOWSKI","479 JUMPERS HOLE RD STE 104","SEVERNA PARK","MD",21146,"DENTAL","General Dentist"]
[null,810851229,1376959932,"BRANDON L SMITH","214 N MAIN ST","JAMESTOWN","TN",38556,"DENTAL","General Dentist"]
[null,742768009,1730456948,"NICHOLAS BRANDON SAGER","506 N HEWITT DR","HEWITT","TX",76643,"DENTAL","General Dentist"]
[null,331282709,1497562680,"STATE COLLEGE FAMILY DENTISTRY","220 REGENT CT STE D","STATE COLLEGE","PA",16801,"DENTAL","General Dentist"]
[null,472804802,1780972554,"JOSEPH E BROWN","1097 WESTON DR","MOUNT JULIET","TN",37122,"DENTAL","General Dentist"]
[null,232909580,1679825459,"HEIDI A RAY-MONTELEONE","6530 STATE ROUTE 22 STE 305","DELMONT","PA",15626,"DENTAL","Endodontist"]
[null,232076122,1427126184,"TOMOYASU  FUJI","7601 CASTOR AVE STE 300","PHILADELPHIA","PA",19152,"DENTAL","Periodontist"]
[null,850555581,1619030301,"VICTORIA LYNN LEONHART","16202 HUEBNER RD","SAN ANTONIO","TX",78248,"DENTAL","General Dentist"]
[null,521297864,1669030391,"GYEONGWON  KIM","100 WEST RD STE 416","TOWSON","MD",21204,"DENTAL","Orthodontist"]
[null,455506732,1891050282,"JAMISON S COX","736 S 900 E STE 105","SAINT GEORGE","UT",84790,"DENTAL","General Dentist"]
[null,270939831,1972722163,"MICHAEL ADRIAN EISENBAND","2615 STATE RD 7 B550","WELLINGTON","FL",33414,"DENTAL","General Dentist"]
[null,933549624,1568876266,"DAVIA N NICKELSON","320 EMERGENCY ROOM DR","CHAPEL HILL","NC",27599,"DENTAL","General Dentist"]
[null,850849636,1639568843,"JENNIFER  JOHN","20785 PROFESSIONAL PARK BLVD","GEORGETOWN","DE",19947,"DENTAL","General Dentist"]
[null,821027841,1679674311,"JENNIFER L MCCLENDON","16 MEDICAL PARK","VALLEY","AL",36854,"DENTAL","General Dentist"]
[null,464553354,1356581565,"BRENDAN JOHN SELWAY","40000 FREMONT BLVD STE A","FREMONT","CA",94538,"DENTAL","General Dentist"]
[null,844035200,1962650572,"JOHN H KIESSLING","6460 JONESTOWN RD","HARRISBURG","PA",17112,"DENTAL","General Dentist"]
[null,"043059195",1083790877,"KEITH S RICHMOND","12 PENNS TRL STE 154","NEWTOWN","PA",18940,"DENTAL","General Dentist"]
[null,332572382,1164160537,"ANSHELLE R TUCKER","561 FIRST COLONIAL RD STE 104","VIRGINIA BEACH","VA",23451,"DENTAL","General Dentist"]
[null,451427993,1154450047,"MAREK  DWORAK","421 W CRYSTAL LAKE AVE","HADDONFIELD","NJ","08033","DENTAL","General Dentist"]
[null,994523486,1902210313,"JOSHUA D YANOVIAK","9402 N US HWY 1","SEBASTIAN","FL",32958,"DENTAL","General Dentist"]
[null,910932902,1518306406,"M E MCRORY","3031 ORLEANS ST STE 201","BELLINGHAM","WA",98226,"DENTAL","General Dentist"]
[null,271669118,1376676981,"STEVEN D CAWLEY","1210 E MAIN ST","MOUNT JOY","PA",17552,"DENTAL","General Dentist"]
[null,251849716,1497097109,"JOSEPH J MICUCCI","704 LINCOLN AVE","PITTSBURGH","PA",15202,"DENTAL","General Dentist"]
[null,853073598,1710267109,"TOBIE  JONES","45 W KAGY BLVD STE 4","BOZEMAN","MT",59715,"DENTAL","General Dentist"]
[null,873970455,1124544994,"TAHIRA  RIZVI","401 KINGS HWY S STE 2A","CHERRY HILL","NJ","08034","DENTAL","General Dentist"]
[null,232514917,1831284710,"DANIEL J HARMON","444 N YORK RD","HATBORO","PA",19040,"DENTAL","General Dentist"]
[null,815099214,1295950855,"JOEL  SCHWITZER","1050 MANTUA PIKE","WENONAH","NJ","08090","DENTAL","General Dentist"]
[null,392414558,1184409328,"ZAINAB  AL-AZZAWI","2193 W CHESTER PIKE","BROOMALL","PA",19008,"DENTAL","General Dentist"]
[null,843992272,1306259007,"MARCO V CABALLEROS","9560 LEGACY DR STE 230","FRISCO","TX",75033,"DENTAL","General Dentist"]
[null,231365971,1811917321,"VIVIEN  MESINA","3223 N BROAD ST","PHILADELPHIA","PA",19140,"DENTAL","General Dentist"]
[null,"030223344",1710006341,"JOSEPH C KROPF","10 ALFRED ST","BURLINGTON","VT","05401","DENTAL","General Dentist"]
[null,581624008,1639749930,"RYAN  SEERLEY","56 W GIBSON ST","HARTWELL","GA",30643,"DENTAL","General Dentist"]
[null,922791149,1518353770,"LAURA E JOHNSON","1103 DELTA AVE","GLADSTONE","MI",49837,"DENTAL","General Dentist"]
[null,232672431,1689015968,"LAURA A CANNON","1515 W CHESTER PIKE STE D5","WEST CHESTER","PA",19382,"DENTAL","General Dentist"]
[null,200927903,1255853446,"NAM  HOANG","151 S SPRINGFIELD RD","CLIFTON HEIGHTS","PA",19018,"DENTAL","Oral Surgeon"]
[null,360602438,1023114535,"LOUIS M PALACIOS","6 HEARTHSTONE CT STE 302","READING","PA",19606,"DENTAL","General Dentist"]
[null,521160739,1578782579,"GEORGE J KASSOLIS","16918 YORK RD STE 102","MONKTON","MD",21111,"DENTAL","General Dentist"]
[null,382333602,1962522482,"FREDERIC N LEAVITT","24887 GODDARD RD","TAYLOR","MI",48180,"DENTAL","General Dentist"]
[null,522366009,1417965484,"JOHN T O'HORO","791 TURNPIKE ST STE 1","NORTH ANDOVER","MA","01845","DENTAL","General Dentist"]
[null,471479503,1225471311,"SORINA ANDRA RATCHFORD","747 BERNARDO AVE","MORRO BAY","CA",93442,"DENTAL","General Dentist"]
[null,223533155,1912030495,"SOPHIA  NICHOLS","1929 ROUTE 88 EAST","BRICK","NJ","08724","DENTAL","General Dentist"]
[null,473826434,1104181163,"LAURA  SCHOTT","12904 FRY RD STE 500","CYPRESS","TX",77433,"DENTAL","General Dentist"]
[null,200025360,1659583979,"KARA J SEPP","674 VANDERBILT RD","CONNELLSVILLE","PA",15425,"DENTAL","General Dentist"]
[null,863736314,1104137488,"PHILLIP BRIAN KRAVER","3001 DEL PRADO BLVD S","CAPE CORAL","FL",33904,"DENTAL","General Dentist"]
[null,854281974,1598782435,"LEE E OPPENHEIMER","23 SHELTER COVE LN BLDG B STE 200","HILTON HEAD ISLAND","SC",29928,"DENTAL","Periodontist"]
[null,251629470,1265889323,"WENJIE  GAO","354 COLONIAL RD","HARRISBURG","PA",17109,"DENTAL","General Dentist"]
[null,591466656,1003449224,"BENJAMIN  HARRISON","1012 W 11TH ST","PANAMA CITY","FL",32401,"DENTAL","General Dentist"]
[null,455402141,1073280228,"CLAUDIA C DIAZ JIMENEZ","879 LYNNHAVEN PKWY STE 109","VIRGINIA BEACH","VA",23452,"DENTAL","General Dentist"]
[null,854281974,1851723886,"DANIEL J BROCKWAY","300 NEW RIVER PKWY STE 36","HARDEEVILLE","SC",29927,"DENTAL","Periodontist"]
[null,200520785,1700059482,"DAMON  HUGHES","425 A LEXINGTON AVE","CHAPIN","SC",29036,"DENTAL","General Dentist"]
[null,844027648,1598116170,"DANEEN E ZUG","92 DOE RUN RD","MANHEIM","PA",17545,"DENTAL","General Dentist"]
[null,831360513,1124387501,"ARLEN  VARTANIAN","100 E HUNTINGTON DR STE 211","ALHAMBRA","CA",91801,"DENTAL","General Dentist"]
[null,822272495,1922262567,"GARY  SILVERSTROM","580 S LIVINGSTON AVE","LIVINGSTON","NJ","07039","DENTAL","General Dentist"]
[null,883354305,1740329424,"LORI M RADFORD","7491 ULMERTON RD","LARGO","FL",33771,"DENTAL","General Dentist"]
[null,161744476,1184657827,"EDWARD E EGAN","310 SOUTH ST","HYANNIS","MA","02601","DENTAL","General Dentist"]
[null,231365971,1306011754,"JASIM  ALBANDAR","3223 N BROAD ST","PHILADELPHIA","PA",19140,"DENTAL","Periodontist"]
[null,262765869,1689866550,"EMANUEL  KONTOS","2605 KEYSTONE RD","TARPON SPRINGS","FL",34688,"DENTAL","General Dentist"]
[null,232932653,1235221409,"ERIK R MERTENS","3805 WASHINGTON RD","MCMURRAY","PA",15317,"DENTAL","General Dentist"]
[null,271226915,1366021040,"LOGAN D RUTCH","350 TERRY RICH BLVD","SAINT CLAIR","PA",17970,"DENTAL","General Dentist"]
[null,521578500,1366588238,"RICK A JONES","2300 YORK RD STE 210","LUTHERVILLE","MD",21093,"DENTAL","General Dentist"]
[null,521933858,1164616488,"EDWARD M KELLY","1726 JARRETTSVILLE RD","JARRETTSVILLE","MD",21084,"DENTAL","General Dentist"]
[null,231365971,1265939052,"SHRADDHA  KAMAT","3223 N BROAD ST","PHILADELPHIA","PA",19140,"DENTAL","General Dentist"]
[null,825210597,1033477948,"NOELLE R SIGNORIELLO","1 KATHLEEN DR","JACKSON","NJ","08527","DENTAL","General Dentist"]
[null,561882620,1922170802,"CHRIS D HARDISON","121 DUPLIN PROFESSIONAL CT","WARSAW","NC",28398,"DENTAL","General Dentist"]
[null,621522570,1467586016,"D KEVEN  BOWDLE","11232 B WESTPOINT DRIVE","KNOXVILLE","TN",37934,"DENTAL","General Dentist"]
[null,231365971,1740416783,"YUEH J HSIAO","3223 N BROAD ST","PHILADELPHIA","PA",19140,"DENTAL","Periodontist"]
[null,591857489,1518590652,"VANESSA  SCHNEIDER","1401 FORUM WAY STE 800","WEST PALM BEACH","FL",33401,"DENTAL","General Dentist"]
[null,510321801,1740235449,"THE CHRISTINA CNTR ORL MAX SURG PA","4133 OGLETOWN STANTON RD","NEWARK","DE",19713,"DENTAL","General Dentist"]
[null,471573764,1265421986,"MARIANA C ELWELL","15 FRANKLIN ST","BRIDGETON","NJ","08302","DENTAL","General Dentist"]
[null,921041596,1972282903,"HAZEM  ABDELAAL","300 NOVA WAY","PARKESBURG","PA",19365,"DENTAL","General Dentist"]
[null,932472173,1629136031,"GREGORY ROBERT URFRIG","4782 MARIGOLD AVE","KISSIMMEE","FL",34758,"DENTAL","Oral Surgeon"]
[null,270728558,1659789600,"JOSEPH ANTHONY SORRENTINO","13700 N US HIGHWAY 441","LADY LAKE","FL",32159,"DENTAL","General Dentist"]
[null,464188237,1780644153,"JENNY S CHEUNG","1801 ROBERT FULTON DR SUITE #300","RESTON","VA",20191,"DENTAL","General Dentist"]
[null,522199075,1205981248,"JANE  BRODSKY","11404 OLD GEORGETOWN RD STE 204","NORTH BETHESDA","MD",20852,"DENTAL","General Dentist"]
[null,874453609,1922256585,"CHRIS M KELLER","162A TREXLER AVE","KUTZTOWN","PA",19530,"DENTAL","General Dentist"]
[null,200690674,1598884769,"DONALD A EBERHART","14815 W BELL RD STE 202","SURPRISE","AZ",85374,"DENTAL","General Dentist"]
[null,472146740,1174625230,"LAURA L SZYMANSKI","44A S CHESTNUT ST","BOYERTOWN","PA",19512,"DENTAL","General Dentist"]
[null,270713347,1154559334,"MITESH  JIVAN","2230 W OLD US HIGHWAY 441","MOUNT DORA","FL",32757,"DENTAL","General Dentist"]
[null,273193761,1104012723,"WILLIAM H DAGGETT","4676 E 5TH ST","TUCSON","AZ",85711,"DENTAL","General Dentist"]
[null,465554800,1285855809,"JODY S HARRISON","201 E CHESTNUT ST","ASHEVILLE","NC",28801,"DENTAL","Periodontist"]
[null,"043553051",1104317494,"PAULINE P REILLY-LAKE","100 BROOKSBY VILLAGE DR","PEABODY","MA","01960","DENTAL","General Dentist"]
[null,521577143,1972238723,"SARA  SATIN","200 WESTGATE CIR STE 106","ANNAPOLIS","MD",21401,"DENTAL","General Dentist"]
[null,462434325,1295390698,"CAITLIN C CROUSE","250 N READING RD","EPHRATA","PA",17522,"DENTAL","General Dentist"]
[null,521577143,1518168715,"DEBORAH A ODELL","200 WESTGATE CIR STE 106","ANNAPOLIS","MD",21401,"DENTAL","General Dentist"]
[null,510196935,1558985275,"CHRISTINA M ULLOA","17068 LANKFORD HWY","EASTVILLE","VA",23347,"DENTAL","General Dentist"]
[null,231365971,1336370147,"KENNETH G BOBERICK","3223 N BROAD ST","PHILADELPHIA","PA",19140,"DENTAL","General Dentist"]
[null,873951096,1396918264,"NICHOLAS J COLES","1876 E INNOVATION PARK DR","ORO VALLEY","AZ",85755,"DENTAL","Oral Surgeon"]
[null,222218302,1962841205,"KRISTINE A GLEASON","992 MANTUA PIKE STE 302","WOODBURY HEIGHTS","NJ","08097","DENTAL","Oral Surgeon"]
[null,463156642,1346255049,"DARCY M ALLEN","12317 WINCHESTER RD SW STE 100","LAVALE","MD",21502,"DENTAL","General Dentist"]
[null,231902612,1396740205,"LOUIS A HUY","101 PROGRESS DR","DOYLESTOWN","PA",18901,"DENTAL","Oral Surgeon"]
[null,320258316,1437357845,"PATRICK H PAGANA","2416 S BROAD ST 18","PHILADELPHIA","PA",19145,"DENTAL","General Dentist"]
[null,232442788,1730536145,"ROBERT W SLAUCH","467 PENNSYLVANIA AVE STE 201","FORT WASHINGTON","PA",19034,"DENTAL","General Dentist"]
[null,463399630,1649361544,"BRIAN J MILLER","52 HIGHLAND AVE STE A","BETHLEHEM","PA",18017,"DENTAL","Periodontist"]
[null,222802674,1225200249,"JOHN J MCCARTY","379 EGG HARBOR RD","SEWELL","NJ","08080","DENTAL","General Dentist"]
[null,383505782,1558871558,"SHABNAM  BEHDIN","4320 ORCHARD LAKE RD","WEST BLOOMFIELD","MI",48323,"DENTAL","Periodontist"]
[null,263861343,1275743957,"JAY S BOYD","1003 SUSHRUTA DR","MARTINSBURG","WV",25401,"DENTAL","General Dentist"]
[null,630925047,1497833552,"RAYMOND L BOLT","1550 OPELIKA RD # 6-167","AUBURN","AL",36830,"DENTAL","General Dentist"]
[null,831324654,1205329968,"JOSE C RAMIREZ","3751 TAMIAMI TRL E","NAPLES","FL",34112,"DENTAL","General Dentist"]
[null,"042652282",1427430891,"AUSTIN L PERERA","700 ATTUCKS LANE ST 2C","HYANNIS","MA","02601","DENTAL","Endodontist"]
[null,"060871503",1194871657,"ASHKAN  SAMADZADEH","836 FARMINGTON AVE STE 115","WEST HARTFORD","CT","06119","DENTAL","Endodontist"]
[null,811547442,1922121128,"MARK R OLBINA","1699 S 14TH ST STE 21 Ste 21","FERNANDINA BEACH","FL",32034,"DENTAL","General Dentist"]
[null,993655504,1124680806,"COLEMAN C SLONE","1636 NICHOLASVILLE RD STE 7","LEXINGTON","KY",40503,"DENTAL","General Dentist"]
[null,231365971,1841268604,"TEMPLE UNIVERSITY","3223 N BROAD ST","PHILADELPHIA","PA",19140,"DENTAL","General Dentist"]
[null,222559810,1023142569,"JEFFREY  DELSON","1307 W BRIGANTINE AVE","BRIGANTINE","NJ","08203","DENTAL","General Dentist"]
[null,651008982,1902909526,"DAVID  MCDONALD","2758 N ROOSEVELT BLVD","KEY WEST","FL",33040,"DENTAL","General Dentist"]
[null,852009124,1922446772,"NEIL P KEANE","4943 34TH AVE S","MINNEAPOLIS","MN",55417,"DENTAL","General Dentist"]
[null,650965650,1356482129,"GREG  RILEY","13700 US HIGHWAY 1 STE 201","JUNO BEACH","FL",33408,"DENTAL","General Dentist"]
[null,200258973,1811053606,"SARAH E AUFDERHEIDE","202 SAINT CLAIRE PL STE 200","STEVENSVILLE","MD",21666,"DENTAL","General Dentist"]
[null,853943366,1760968606,"CHARLES E CRANE","9565 HIGHWAY 78 600B","LADSON","SC",29456,"DENTAL","General Dentist"]
[null,453685615,1922712587,"MASSEY  WILLIAM","720 LIMEKILN RD","NEW CUMBERLAND","PA",17070,"DENTAL","General Dentist"]
[null,263920159,1821200841,"MICHAEL H MULKEY","3951 MARY ELIZA TRCE NW STE 200","MARIETTA","GA",30064,"DENTAL","General Dentist"]
[null,454792809,1174044390,"JESSIE C BITTNER","7668 MALL RD STE B","FLORENCE","KY",41042,"DENTAL","General Dentist"]
[null,461267800,1720344823,"SAMIRA M TOLOUE","7530 164TH AVE NE STE A120","REDMOND","WA",98052,"DENTAL","Periodontist"]
[null,586001998,1659559433,"JOHN K LEFFERT","55 CARLTON ST","ATHENS","GA",30602,"DENTAL","General Dentist"]
[null,331338723,1205123106,"PALLAVI  BATRA","224 CLIFTON AVE","COLLINGDALE","PA",19023,"DENTAL","General Dentist"]
[null,332405504,1912051186,"JULIETTE A MURCKO","4106 PENN AVE","PITTSBURGH","PA",15224,"DENTAL","General Dentist"]
[null,593273768,1992874010,"TONY D CLARK","526 MARY ESTHER CUT OFF NW","FORT WALTON BEACH","FL",32548,"DENTAL","General Dentist"]
[null,810970394,1205241551,"NANE  BALUYAN","3200 BRISTOL RD","BENSALEM","PA",19020,"DENTAL","General Dentist"]
[null,844510703,1861031577,"CHERISE N HARDIMAN","8528 PIT STOP CT NW STE 30","CONCORD","NC",28027,"DENTAL","General Dentist"]
[null,205495923,1174626360,"AARON M MEMON","14500 TAMIAMI TRL","NORTH PORT","FL",34287,"DENTAL","General Dentist"]
[null,233089331,1235344037,"RICHARD V EIDELSON","1048 SOUTH ST","PHILADELPHIA","PA",19147,"DENTAL","General Dentist"]
[null,272155003,1124009956,"BENJAMIN D COON","120 MIDLAND AVE UNIT 230","GLENWOOD SPRINGS","CO",81601,"DENTAL","General Dentist"]
[null,141818708,1659460939,"SHILOH I LIEBERMAN","1207 TROY SCHENECTADY RD STE 108","LATHAM","NY",12110,"DENTAL","General Dentist"]
[null,208185727,1801586466,"NICHOLAS  LEE","633 N UNION ST","LOUDONVILLE","OH",44842,"DENTAL","General Dentist"]
[null,922570045,1922488295,"STACEY  STEVENS","634 ROCKLAND ST","WEST ROCKPORT","ME","04865","DENTAL","General Dentist"]
[null,200185918,1154163020,"POOJA  BALU","2203 EVERGLADES LN","THE VILLAGES","FL",32163,"DENTAL","General Dentist"]
[null,742944636,1497803183,"FRANK R DANNA","1313 PETERSBURG ST","CASTROVILLE","TX",78009,"DENTAL","General Dentist"]
[null,471653677,1285901520,"THERESA T KUJALA","6 HOWARD ST","ABERDEEN","MD",21001,"DENTAL","General Dentist"]
[null,854222892,1578878385,"JAMES  COMINSKY","2940 MALLORY CIR STE 101","KISSIMMEE","FL",34747,"DENTAL","General Dentist"]
[null,231365971,1457492373,"HOWARD A WIMMER","3223 N BROAD ST","PHILADELPHIA","PA",19140,"DENTAL","General Dentist"]
[null,461215895,1164946687,"VIDHI  SHAH","120 CENTER SQUARE RD STE 205","WOOLWICH TOWNSHIP","NJ","08085","DENTAL","General Dentist"]
[null,521468600,1093029589,"MATTHEW F FEILD","12619 HARFORD RD","FORK","MD",21051,"DENTAL","General Dentist"]
[null,823290223,1427544808,"DYLAN THOMAS TAGG","2151 S ALTERNATE A1A STE 1300","JUPITER","FL",33477,"DENTAL","General Dentist"]
[null,232732126,1700825056,"NEAL E BOZENTKA","944 E HAVERFORD RD","BRYN MAWR","PA",19010,"DENTAL","Oral Surgeon"]
[null,232861715,1740534734,"JULIE R AROUH","261 OLD YORK RD STE 330","JENKINTOWN","PA",19046,"DENTAL","General Dentist"]
[null,233095753,1235597477,"EVAN  RIDGE","1601 WALNUT ST STE 1302","PHILADELPHIA","PA",19102,"DENTAL","General Dentist"]
[null,208185727,1174752992,"TYLER L SCOTT","633 N UNION ST","LOUDONVILLE","OH",44842,"DENTAL","General Dentist"]
[null,814712385,1184228041,"DEEMA  RASLAN","15 RUTH DRIVE","NEWNAN","GA",30265,"DENTAL","General Dentist"]
[null,475252227,1700455326,"ERIC  CRAY","801 OLD YORK RD STE 403","JENKINTOWN","PA",19046,"DENTAL","General Dentist"]
[null,141818708,1598116501,"STEVE  LEONIDAS","74 DELAWARE AVE","DELMAR","NY",12054,"DENTAL","General Dentist"]
[null,521116591,1518264415,"YIYA  ZHOU","320 HARGRAVES DR","FEDERALSBURG","MD",21632,"DENTAL","General Dentist"]
[null,474567766,1568895688,"JERREL  MILLS","1209 N RETAIL COURT","MYRTLE BEACH","SC",29577,"DENTAL","General Dentist"]
[null,521116591,1497058051,"TUMOUH T AL-ALLAQ","320 HARGRAVES DR","FEDERALSBURG","MD",21632,"DENTAL","General Dentist"]
[null,521116591,1629298146,"SANDRA A GARBELY-KERKOVICH","300 S CHURCH ST","SUDLERSVILLE","MD",21668,"DENTAL","General Dentist"]
[null,753072118,1922187798,"DANIEL  DINSE","1890 STATE ST","EAST PETERSBURG","PA",17520,"DENTAL","General Dentist"]
[null,383063197,1437104643,"HUY D NGUYEN","415 W COMMERCE RD","COMMERCE TOWNSHIP","MI",48382,"DENTAL","General Dentist"]
[null,222763588,1689603938,"KIMBERLY L BENBERRY","335 DELSEA DR N","GLASSBORO","NJ","08028","DENTAL","General Dentist"]
[null,223936254,1093756488,"ABBAS  MOHAMMADI","483 MIDDLE TPKE W STE 309","MANCHESTER","CT","06040","DENTAL","General Dentist"]
[null,331325671,1467551317,"JOHN E RICHARDSON","19 MORRIS AVE","BRYN MAWR","PA",19010,"DENTAL","General Dentist"]
[null,810824964,1437834074,"GREGORY  SWINSON","850 NORMAN DR","LEBANON","PA",17042,"DENTAL","General Dentist"]
[null,853371216,1609992619,"SEAN  MARTIN","524 S MAIN ST","WEST CREEK","NJ","08092","DENTAL","General Dentist"]
[null,474662090,1326223793,"ARCHIE  COOK","1700 KILDAIRE FARM RD STE 100","CARY","NC",27511,"DENTAL","General Dentist"]
[null,272907370,1295886422,"MALINDA T LAM-GERSHONY","16710 NE 79TH ST STE 100","REDMOND","WA",98052,"DENTAL","General Dentist"]
[null,202760195,1730307836,"NICHOLAS F BREEN","926 HADDONFIELD RD","CHERRY HILL","NJ","08002","DENTAL","General Dentist"]
[null,452546142,1134601669,"DERRICK GLEN TENGCO","6320 VENTURE DR STE 102","LAKEWOOD RANCH","FL",34202,"DENTAL","General Dentist"]
[null,"010644983",1013058445,"DREW  EARHART","1891 FRUITVILLE PIKE","LANCASTER","PA",17601,"DENTAL","General Dentist"]
[null,231365971,1699732602,"MEHRAN  HOSSAINIZADEH","3223 N BROAD ST","PHILADELPHIA","PA",19140,"DENTAL","Oral Surgeon"]
[null,842464644,1447393871,"ADLY E WILSON","810 LANDMARK DR STE 124","GLEN BURNIE","MD",21061,"DENTAL","General Dentist"]
[null,331945280,1750819488,"ZACHARY  HALEY","3637 MEDINA RD STE 200","MEDINA","OH",44256,"DENTAL","General Dentist"]
[null,562578891,1952403511,"STEPHEN S VALIS","1144 B INDIA HOOK RD","ROCK HILL","SC",29732,"DENTAL","General Dentist"]
[null,451266532,1144742446,"ALTON R THOMAS","1586 HWY 17N","NORTH MYRTLE BEACH","SC",29582,"DENTAL","General Dentist"]
[null,273733788,1215037742,"JENNIFER N KOTTENSTETTE","1207 PASEO DEL NORTE","PUEBLO","CO",81008,"DENTAL","General Dentist"]
[null,274484180,1285110528,"CRYSTAL MAY TRAEGER","4060 E STATE ROAD 44 STE 2-B","WILDWOOD","FL",34785,"DENTAL","General Dentist"]
[null,205970239,1710679717,"TYLER  KURLE","521 4TH ST","HAVRE","MT",59501,"DENTAL","General Dentist"]
[null,205970239,1689007825,"JUSTICE GERALD SHERIDAN PILGRIM","521 4TH ST","HAVRE","MT",59501,"DENTAL","General Dentist"]
[null,853113522,1447790282,"MITULKUMAR  PATEL","8530 MAYLAND DR","HENRICO","VA",23294,"DENTAL","Periodontist"]
[null,561565529,1659413557,"JAMES H WELLS","1284 NEWSOME ST","MOUNT AIRY","NC",27030,"DENTAL","General Dentist"]
[null,841254528,1619109667,"HOLLY  NARTKER","2902 EVERGREEN PARKWAY","EVERGREEN","CO",80439,"DENTAL","General Dentist"]
[null,473751946,1437132305,"KELLY ROBERT CLARKE","706 39TH ST W","BRADENTON","FL",34205,"DENTAL","General Dentist"]
[null,831049708,1508411653,"KYLE  DETAVERNIER","40400 ANN ARBOR RD E STE 103","PLYMOUTH","MI",48170,"DENTAL","General Dentist"]
[null,831218525,1447956008,"CHANDEEP  KAUR","7330 FRANKFORD AVE","PHILADELPHIA","PA",19136,"DENTAL","General Dentist"]
[null,232264432,1841214640,"STEPHEN A HASSLER","1100 PENN AVE","WYOMISSING","PA",19610,"DENTAL","General Dentist"]
[null,273741647,1386864353,"LADERRICK D BULLOCK","1630 ROUTE 322 STE F","SWEDESBORO","NJ","08085","DENTAL","Prosthodontist"]
[null,223664535,1982615647,"WAYNE A ALDREDGE","999 PALMER AVE STE 1","HOLMDEL","NJ","07733","DENTAL","Periodontist"]
[null,451266532,1225702020,"JASLEEN K KUNDLAS","2749 AGNES LN","MYRTLE BEACH","SC",29577,"DENTAL","General Dentist"]
[null,260375508,1467701003,"ELIZABETH L CLAPHAM","206 FIELDALE RD","MEBANE","NC",27302,"DENTAL","General Dentist"]
[null,823388814,1851532568,"ELENA  OGAN","2155 HOLLOW BROOK DR STE 20","COLORADO SPRINGS","CO",80918,"DENTAL","General Dentist"]
[null,201548932,1730291584,"SUSAN M SHEAHAN","4016 CORTEZ RD W STE 1101","BRADENTON","FL",34210,"DENTAL","General Dentist"]
[null,830697146,1871145722,"MICHELLE  FELIX","14731 N CLEVELAND AVE STE 1","NORTH FORT MYERS","FL",33903,"DENTAL","General Dentist"]
[null,833675557,1720531684,"DHIREN A ZAVERI","11840 KINGSTON PIKE STE A","KNOXVILLE","TN",37934,"DENTAL","General Dentist"]
[null,262149832,1740341379,"JOREY E PARKHURST","5503 OLEANDER DR","WILMINGTON","NC",28403,"DENTAL","General Dentist"]
[null,200185918,1275191298,"CINTHIA  FUNES","9940 BELVEDERE RD STE A","ROYAL PALM BEACH","FL",33411,"DENTAL","General Dentist"]
[null,473939709,1881789824,"KEVIN  CONNELLY","1065 LISBON ST","LEWISTON","ME","04240","DENTAL","General Dentist"]
[null,814692807,1134322183,"TODD R REGNAERT","709 S BROADWAY STE C-11","PENNSVILLE","NJ","08070","DENTAL","General Dentist"]
[null,231966639,1326146218,"NOELLE  LING","19 MORRIS AVE","BRYN MAWR","PA",19010,"DENTAL","General Dentist"]
[null,393091735,1659530798,"COURTNEY  WILSON","400 DEL WEBB BLVD STE 104","GEORGETOWN","TX",78633,"DENTAL","General Dentist"]
[null,882453251,1588406326,"JACOB  PETE","531 SAINT CLAIR ST SE","RUSSELLVILLE","AL",35653,"DENTAL","General Dentist"]
[null,872590565,1205123106,"PALLAVI  BATRA","1933 DELANCEY PL","PHILADELPHIA","PA",19103,"DENTAL","General Dentist"]
[null,231365971,1861536146,"CAROL  BOLANOS","3223 N BROAD ST","PHILADELPHIA","PA",19140,"DENTAL","General Dentist"]
[null,591685673,1881731677,"ABRAHAM K ASSEFF","3800 S OCEAN DR STE 241","HOLLYWOOD","FL",33019,"DENTAL","General Dentist"]
[null,854119488,1720678618,"KENNETH  DEPOLO","1724 STATE RD STE 4D","SUMMERVILLE","SC",29483,"DENTAL","General Dentist"]
[null,463279591,1124123773,"RICHARD  STEINBERG","3030 US HIGHWAY 301 N","ELLENTON","FL",34222,"DENTAL","General Dentist"]
[null,541899255,1649438615,"NICHOLAS A MUSS","131 ELDEN ST SUITE 2C2","HERNDON","VA",20170,"DENTAL","General Dentist"]
[null,203042732,1932339512,"ANDREW M HUNTZINGER","3924 SYLVAN LAKES BLVD","SYLVANIA","OH",43560,"DENTAL","General Dentist"]
[null,811823324,1598029365,"DARSHIL B RANPARIYA","2320 GRAND AVE","WAUKEGAN","IL",60085,"DENTAL","General Dentist"]
[null,263800267,1578309696,"TABASOM  SANJIDEH","10051 MARKET CIRCLE","MANASSAS","VA",20110,"DENTAL","General Dentist"]
[null,464114693,1861608218,"NADEZDA  SELMIC","401 E LAS OLAS BLVD STE 140","FORT LAUDERDALE","FL",33301,"DENTAL","General Dentist"]
[null,823766618,1356897623,"DIANE RENEE CHAVIS","1658 OLD MONROVIA RD NW STE 102","HUNTSVILLE","AL",35806,"DENTAL","General Dentist"]
[null,473754661,1326206137,"TUAN N DO","34 NORTH MAIN ST","MANSFIELD","MA","02048","DENTAL","General Dentist"]
[null,300431754,1790331379,"SHADAN  YASSINE","433 APOLLO BEACH BLVD","APOLLO BEACH","FL",33572,"DENTAL","General Dentist"]
[null,251771565,1497562680,"STATE COLLEGE FAMILY DENTISTRY","220 REGENT CT STE D","STATE COLLEGE","PA",16801,"DENTAL","General Dentist"]
[null,825218380,1275902454,"GURPREET  KAUR","403 PURDY ST SUITE 201","EASTON","MD",21601,"DENTAL","General Dentist"]
[null,269621570,1023283322,"PAUL E WEBB","2094 TREMONT CTR","COLUMBUS","OH",43221,"DENTAL","General Dentist"]
[null,522023260,1598886863,"LUIS D CAMACHO","2021 EASTCHESTER DR STE 101","HIGH POINT","NC",27265,"DENTAL","General Dentist"]
[null,593614460,1407897630,"PENNEY L WEEKS","228 PONTE VEDRA PARK DR STE 100","PONTE VEDRA BEACH","FL",32082,"DENTAL","General Dentist"]
[null,232743545,1952836355,"JOHN  LANKALIS","51 N 39TH ST STE W565","PHILADELPHIA","PA",19104,"DENTAL","Oral Surgeon"]
[null,571121662,1427244516,"BONNIE J ROTHWELL","11 HOSPITAL CENTER COMMON STE 200","HILTON HEAD ISLAND","SC",29926,"DENTAL","General Dentist"]
[null,521884788,1750441275,"SERGIO C ZARBIN","1831 YORK RD","TIMONIUM","MD",21093,"DENTAL","General Dentist"]
[null,232743545,1558707505,"JOSEPH A FOOTE","51 N 39TH ST STE W565","PHILADELPHIA","PA",19104,"DENTAL","Oral Surgeon"]
[null,"020331318",1629237672,"CHARLES J SCHMIDT","22 BUNKER HILL ST","LANCASTER","NH","03584","DENTAL","General Dentist"]
[null,371119861,1427109404,"WILLIAM M TODD","106 AIRWAY DR","MARION","IL",62959,"DENTAL","Endodontist"]
[null,271516018,1467719674,"ANNA  JAYJOCK","700 WHITNELL ST","MURRAY","KY",42071,"DENTAL","General Dentist"]
[null,452480835,1003832528,"JOEL BRIAN SLINGBAUM","3716 N ROOSEVELT BLVD #6","KEY WEST","FL",33040,"DENTAL","General Dentist"]
[null,951642394,1467791954,"NISSIM  BENBASSAT","1031 W 34TH ST STE 401","LOS ANGELES","CA",90089,"DENTAL","Prosthodontist"]
[null,873016641,1609761386,"MARIA FERNANDA CHIRIVELLA","1 DOCTORS LN","LAKE WALES","FL",33853,"DENTAL","General Dentist"]
[null,995005160,1124139647,"MILITA G BORGUET","110 N ESSEX AVE","NARBERTH","PA",19072,"DENTAL","Periodontist"]
[null,232743545,1326508227,"PUHAN  HE","3400 CIVIC CENTER BLVD FL 4","PHILADELPHIA","PA",19104,"DENTAL","Oral Surgeon"]
[null,550774338,1508942467,"JASON G GUMP","176 MONROE AVE","RIVESVILLE","WV",26588,"DENTAL","General Dentist"]
[null,260375508,1558384354,"DAVID E MCGLOHON","206 FIELDALE RD","MEBANE","NC",27302,"DENTAL","General Dentist"]
[null,811940668,1518022383,"DAVID S CHO","2103 BRANCH PIKE STE 16","CINNAMINSON","NJ","08077","DENTAL","General Dentist"]
[null,260829147,1659539807,"WILLIAM KNOWLTON GIBSON","15271 MCGREGOR BLVD","FORT MYERS","FL",33908,"DENTAL","General Dentist"]
[null,861588705,1912908153,"JEFFREY N BOURNE","15271 MCGREGOR BLVD STE 21","FORT MYERS","FL",33908,"DENTAL","General Dentist"]
[null,200185918,1043716996,"ANTHONY T RIGGIO","10070 UNIVERSITY PLAZA DR","FORT MYERS","FL",33913,"DENTAL","General Dentist"]
[null,205961399,1558412437,"DAVID  MONOKIAN","151 W GREENTREE RD STE A","MARLTON","NJ","08053","DENTAL","General Dentist"]
[null,274781485,1144473075,"JENNIFER L KAPELA FROEBEL","224 MAIN ST","HAMBURG","NY",14075,"DENTAL","General Dentist"]
[null,861913635,1184065732,"LAURA  OAKES","333 MAIN ST","WATERVILLE","ME","04901","DENTAL","General Dentist"]
[null,742428018,1073725693,"MARQUEL R MCCABE","2130 NE LOOP 410 STE 225","SAN ANTONIO","TX",78217,"DENTAL","General Dentist"]
[null,461310972,1841671096,"GREGORY D PISOTTI","2116 VISTA OESTE NW STE 202","ALBUQUERQUE","NM",87120,"DENTAL","General Dentist"]
[null,650542058,1275552523,"BRADFORD P SMITH","1710 36TH ST BLDG B","VERO BEACH","FL",32960,"DENTAL","Endodontist"]
[null,451266532,1053936914,"CODY  MILLER","7748 CHARLOTTE HWY","INDIAN LAND","SC",29707,"DENTAL","General Dentist"]
[null,341911980,1558553842,"SABRINA E MICKEL","24100 CHARGIN BLVD STE 170","BEACHWOOD","OH",44122,"DENTAL","General Dentist"]
[null,800877361,1831278936,"LISA M CIABATTONI","4906 PENN AVE","SINKING SPRING","PA",19608,"DENTAL","General Dentist"]
[null,455005083,1821133299,"BORIS D BABINER","332 BUSTLETON PIKE","FEASTERVILLE TREVOSE","PA",19053,"DENTAL","Periodontist"]
[null,231944530,1679543987,"ANDREW  HEISE","190 GOOD DR","LANCASTER","PA",17603,"DENTAL","Oral Surgeon"]
[null,465453457,1710271226,"DAVID M BROWN","2000 N UNION AVE","ROSWELL","NM",88201,"DENTAL","General Dentist"]
[null,811302253,1962597724,"TED A BEITELSCHEES","3349 EXECUTIVE PKWY STE G","TOLEDO","OH",43606,"DENTAL","General Dentist"]
[null,201806734,1174646962,"BRIAN A SUH","8150 LEESBURG PIKE STE 502","VIENNA","VA",22182,"DENTAL","Endodontist"]
[null,474122816,1295901478,"ROLANDE J TAMEGHE","2045 UNIVERSITY BOULEVARD EAST STE 201","HYATTSVILLE","MD",20783,"DENTAL","General Dentist"]
[null,593727118,1902585342,"STEFANIE  DIFRANCESCO","8454 NORTHCLIFFE BLVD","SPRING HILL","FL",34606,"DENTAL","General Dentist"]
[null,463208647,1083908875,"RICHARD A PARKER","300 HICKMAN RD STE 101","CHARLOTTESVILLE","VA",22911,"DENTAL","General Dentist"]
[null,474775816,1417269259,"GERARD  CORSI","161 N BROAD ST","WOODBURY","NJ","08096","DENTAL","General Dentist"]
[null,832587949,1023109006,"KENNETH M SOFRANKO","201 OHIO RIVER BLVD UNIT A","SEWICKLEY","PA",15143,"DENTAL","General Dentist"]
[null,521256741,1265498893,"CHARLES  FINE","20 CROSSROADS DR STE 110","OWINGS MILLS","MD",21117,"DENTAL","General Dentist"]
[null,521116591,1972352300,"RAPHAELLA  RANJO","320 HARGRAVES DR","FEDERALSBURG","MD",21632,"DENTAL","General Dentist"]
[null,263081607,1770655615,"SIDHARTH  BANSAL","120 LOWES DR STE 106","PITTSBORO","NC",27312,"DENTAL","General Dentist"]
[null,873775643,1851627376,"MARYAM  HARIRI","368 BROADWAY STE 18","SARATOGA SPRINGS","NY",12866,"DENTAL","General Dentist"]
[null,273635983,1871887984,"ALISON MONIQUE HOGAN ROSS","2710 WEST OXFORD LOOP","OXFORD","MS",38655,"DENTAL","General Dentist"]
[null,920862908,1730601295,"SELMA  MOHAMMEDI","494 HIGHLAND AVE","NEWPORT","VT","05855","DENTAL","General Dentist"]
[null,522061120,1912338088,"NAYEREH N GHAMARIAN","6017 BRADLEY BLVD","BETHESDA","MD",20817,"DENTAL","General Dentist"]
[null,611033691,1881322410,"ANNA M JOINES","211 KY 59","VANCEBURG","KY",41179,"DENTAL","General Dentist"]
[null,461565299,1871750448,"SEYED S SHAHMEHDI","81 NEWARK POMPTON TPKE","LITTLE FALLS","NJ","07424","DENTAL","General Dentist"]
[null,475162989,1902210313,"JOSHUA D YANOVIAK","9402 N US HIGHWAY 1","SEBASTIAN","FL",32958,"DENTAL","General Dentist"]
[null,204804773,1093909913,"JUNEE F GARDY","1044 CASTELLO DR STE 109","NAPLES","FL",34103,"DENTAL","General Dentist"]
[null,341196118,1659449882,"GARY  SCHWEEN","18849 PEARL RD","STRONGSVILLE","OH",44136,"DENTAL","Oral Surgeon"]
[null,920183840,1164593794,"YELENA  VINOGRADOV","6737 HARBISON AVE","PHILADELPHIA","PA",19149,"DENTAL","General Dentist"]
[null,862275735,1205671054,"ARLENA  TAPIA","1711 E NINE MILE RD","PENSACOLA","FL",32514,"DENTAL","General Dentist"]
[null,382629283,1841413465,"BRADLEY C WALDEN","N5241 US HIGHWAY 45","WATERSMEET","MI",49969,"DENTAL","General Dentist"]
[null,814076832,1649530569,"JAMES G KOKORELIS","9010 HARFORD RD","PARKVILLE","MD",21234,"DENTAL","General Dentist"]
[null,874064477,1154603348,"MELISSA  GLAZER","6825 E HAMPDEN AVE STE 201","DENVER","CO",80224,"DENTAL","General Dentist"]
[null,582426214,1205810470,"WILLIAM S GARRIS","9083-B OLD HWY 6","SANTEE","SC",29142,"DENTAL","General Dentist"]
[null,871255032,1962997965,"DAVID  NGUYEN","5210 TOWN CENTER BLVD STE 310","PEACHTREE CORNERS","GA",30092,"DENTAL","General Dentist"]
[null,455533987,1518114651,"LINDSAY  CHRISTENSEN","1 CALLE MEDICO STE 2","SANTA FE","NM",87505,"DENTAL","General Dentist"]
[null,461553230,1073646105,"THANH  MAI","7214 STATE ROAD 52","HUDSON","FL",34667,"DENTAL","General Dentist"]
[null,832691420,1346094174,"KUNAL N KADAKIA","9880 BUSTLETON AVE STE 213","PHILADELPHIA","PA",19115,"DENTAL","General Dentist"]
[null,371477197,1073723516,"ADENIYI O AKANDE","1902 E ASHLAN AVE","FRESNO","CA",93726,"DENTAL","General Dentist"]
[null,465119292,1104961648,"CHARLES MICHAEL OBRIEN","2015 INTERSTATE DR","OPELIKA","AL",36801,"DENTAL","General Dentist"]
[null,842061719,1619005436,"AMY B KAMINSKI","375 MARTZVILLE RD","BERWICK","PA",18603,"DENTAL","General Dentist"]
[null,472227928,1699970731,"JONATHON S MALONEY","317 7TH ST W","PALMETTO","FL",34221,"DENTAL","General Dentist"]
[null,561047404,1780886556,"ADAM D SERLO","2823 N DUKE ST","DURHAM","NC",27704,"DENTAL","Oral Surgeon"]
[null,550628530,1114015567,"STEPHEN H JERAN","61 S KANAWHA ST","BUCKHANNON","WV",26201,"DENTAL","General Dentist"]
[null,330985808,1346311446,"ROBERT TODD MCMASTER","910 E GRAND AVE STE F","ESCONDIDO","CA",92025,"DENTAL","General Dentist"]
[null,851665841,1275003469,"DHRUV A PATEL","602 N THORNTON AVE","ORLANDO","FL",32803,"DENTAL","General Dentist"]
[null,264165262,1902015886,"SANJAY  KAPOOR","618 TARGEE ST","STATEN ISLAND","NY",10304,"DENTAL","General Dentist"]
[null,"010826551",1396814042,"JASON D LINK","1216 PLEASANT VALLEY BLVD STE 1","ALTOONA","PA",16602,"DENTAL","General Dentist"]
[null,522013077,1316160716,"HENRY  HONICK","4367 HOLLINS FERRY RD","BALTIMORE","MD",21227,"DENTAL","General Dentist"]
[null,273681811,1215040712,"FADI  KARAM","2131 NORTHAMPTON ST","EASTON","PA",18042,"DENTAL","General Dentist"]
[null,593645550,1588005490,"MATTHEW B FOURNIER","703 W DEL WEBB BLVD STE B","SUN CITY CENTER","FL",33573,"DENTAL","General Dentist"]
[null,263975070,1568086718,"JAIME  RUIZ","5316 CENTRAL FLORIDA PKWY","ORLANDO","FL",32821,"DENTAL","General Dentist"]
[null,872973596,1255358966,"KINNARI JAYESH GHIA","4501 CALL FIELD RD","WICHITA FALLS","TX",76308,"DENTAL","General Dentist"]
[null,202870310,1023678927,"TALITA  SIZEMORE","15820 DORA AVE STE A","TAVARES","FL",32778,"DENTAL","General Dentist"]
[null,232852589,1558535278,"JOANNA  KU","1 BELMONT AVE STE 316","BALA CYNWYD","PA",19004,"DENTAL","Endodontist"]
[null,881698680,1245524073,"MYRNELLE  DAMAS","508 CYNWOOD DR STE B","EASTON","MD",21601,"DENTAL","Pediatric Dentist"]
[null,851291207,1992087068,"LJILJANA  STANISIC","1 WHEATLEY BLVD","MULLICA HILL","NJ","08062","DENTAL","General Dentist"]
[null,202784939,1902069271,"MICHAEL K LECHOLOP","125 C WAPPOO CREEK DR STE 1","CHARLESTON","SC",29412,"DENTAL","Oral Surgeon"]
[null,813264608,1346682754,"TYRESIA J WHITE","440 SOCIETY HILL DR STE 201","AIKEN","SC",29803,"DENTAL","Periodontist"]
[null,270728558,1821134107,"JAMES E EDWARDS","13700 N US HIGHWAY 441","LADY LAKE","FL",32159,"DENTAL","General Dentist"]
[null,820998368,1942868443,"LENA  MERCHO","1507 W PASSYUNK AVE","PHILADELPHIA","PA",19145,"DENTAL","General Dentist"]
[null,521577143,1720104995,"J P DAVLIAKOS","200 WESTGATE CIR STE 106","ANNAPOLIS","MD",21401,"DENTAL","General Dentist"]
[null,593643669,1063567949,"LAWRENCE J SUTTON","2825 SE 17TH ST","OCALA","FL",34471,"DENTAL","General Dentist"]
[null,205292736,1922084201,"RACHAEL H TINGEN","3 HOMESTEADS RD STE B","PLACITAS","NM",87043,"DENTAL","General Dentist"]
[null,203296691,1114926706,"ROBERT  DELIE","2675 E CUMBERLAND ST","PHILADELPHIA","PA",19125,"DENTAL","Periodontist"]
[null,883891234,1710473681,"JUSTIN  ROSS","1605 FOREST TRL","TEMPLE","TX",76502,"DENTAL","General Dentist"]
[null,471174849,1407472962,"ELIZABETH  COHEN","1605 CORAOPOLIS HEIGHTS RD STE 110","MOON TWP","PA",15108,"DENTAL","Oral Surgeon"]
[null,454817839,1033447602,"BHAVIN C PATEL","529 S NEW YORK RD","GALLOWAY","NJ","08205","DENTAL","Prosthodontist"]
[null,200185918,1003357351,"LATOYA  BUTLER","5442 THOMASVILLE RD STE 1","TALLAHASSEE","FL",32312,"DENTAL","General Dentist"]
[null,993071625,1871386615,"LAUREN  ALLEN","11310 MANKLIN CREEK RD UNIT 5","OCEAN PINES","MD",21811,"DENTAL","General Dentist"]
[null,465754024,1629497367,"DANIELLE C WILLIAMS","16546 N DALE MABRY HWY","TAMPA","FL",33618,"DENTAL","Oral Surgeon"]
[null,812569715,1447040324,"HEN  BERSHADSKIY","870 N US HIGHWAY 27 STE A","LADY LAKE","FL",32159,"DENTAL","General Dentist"]
[null,232749255,1215059001,"PATRICK  HAYES","314 RUSHBROOK ST","JERMYN","PA",18433,"DENTAL","General Dentist"]
[null,332245163,1215312871,"GEORGE R HELMY","7895 SEMINOLE BLVD STE 202","SEMINOLE","FL",33772,"DENTAL","General Dentist"]
[null,251208566,1891131876,"ERIC R STRAYER","209 DEPOT ST","LATROBE","PA",15650,"DENTAL","Oral Surgeon"]
[null,992404935,1396796272,"PAUL R SAUVAGE","15946 REDMOND WAY STE 106","REDMOND","WA",98052,"DENTAL","General Dentist"]
[null,232896915,1841585916,"HECTOR C SIORDIA","25 EASTGATE DR","CARLISLE","PA",17015,"DENTAL","Oral Surgeon"]
[null,300604753,1740314863,"MICHAEL S GRAMS","6900 E US HIGHWAY 60 STE 110","GOLD CANYON","AZ",85118,"DENTAL","General Dentist"]
[null,463595811,1760226971,"JAMES M MCNEELY","1490 WO EZELL BLVD","SPARTANBURG","SC",29301,"DENTAL","General Dentist"]
[null,510196935,1477080612,"BENZON H HUYNH","5219 LANKFORD HWY","NEW CHURCH","VA",23415,"DENTAL","General Dentist"]
[null,842053038,1760891485,"STEPHEN H PARKER","133 TRAVELERS BLVD","WEST UNION","SC",29696,"DENTAL","General Dentist"]
[null,832526230,1184043226,"GABRIEL N ROSS","2001 2ND AVE STE 102","SUMMERVILLE","SC",29486,"DENTAL","Pediatric Dentist"]
[null,454500820,1629692322,"VIVEK  BHATTY","127 E MAIN ST STE 131","MIDDLETOWN","NY",10940,"DENTAL","General Dentist"]
[null,873215474,1891536009,"MEGHAN  HODDER","6182 N US HIGHWAY 41 UNIT A","APOLLO BEACH","FL",33572,"DENTAL","General Dentist"]
[null,873215474,1437999448,"ALICIA  JOHNSON","6182 N US HIGHWAY 41 UNIT A","APOLLO BEACH","FL",33572,"DENTAL","General Dentist"]
[null,921604861,1376712364,"LOUIS V HARRISON","412 TYLER HOLMES DR","WINONA","MS",38967,"DENTAL","General Dentist"]
[null,271561298,1063868602,"ELIZABETH  COUGHLIN","538 POLARIS PKWY","WESTERVILLE","OH",43082,"DENTAL","General Dentist"]
[null,650665173,1750410304,"FUAD  MALKI","900 N SUNCOAST BLVD","CRYSTAL RIVER","FL",34429,"DENTAL","Periodontist"]
[null,202420073,1851475313,"DAVID R BOWSER","114 RIDGEWOOD DR","FISHERTOWN","PA",15539,"DENTAL","General Dentist"]
[null,263219184,1194953752,"COLE E YOUNGER","3803 COMPUTER DR STE 200","RALEIGH","NC",27609,"DENTAL","General Dentist"]
[null,263827888,1063598225,"WILLIAM THOMAS FERGUS","27000 BASS PRO DR STE E300","SPANISH FORT","AL",36527,"DENTAL","General Dentist"]
[null,862143103,1164207981,"NIKTA  MANSOURI","12612 CAPITAL BLVD STE 100","WAKE FOREST","NC",27587,"DENTAL","General Dentist"]
[null,881887853,1629525258,"MICHAEL  MASTERSON","1815 SE US HIGHWAY 19","CRYSTAL RIVER","FL",34429,"DENTAL","General Dentist"]
[null,231365971,1396845830,"JUDITH  MCKAIN-RUBIN","3223 N BROAD ST","PHILADELPHIA","PA",19140,"DENTAL","General Dentist"]
[null,231365971,1124078290,"GERALDINE  WEINSTEIN","3223 N BROAD ST","PHILADELPHIA","PA",19140,"DENTAL","General Dentist"]
[null,823470772,1588868384,"JITEN P GOHEL","313 W BOOT RD","WEST CHESTER","PA",19380,"DENTAL","General Dentist"]
[null,883354305,1659266468,"JILLIAN M SENNELLO","5215 MANATEE AVE W","BRADENTON","FL",34209,"DENTAL","General Dentist"]
[null,825294944,1245519560,"EYAD M ALDARA","1975 NILES CORTLAND RD NE STE 2","WARREN","OH",44484,"DENTAL","General Dentist"]
[null,232860692,1487437968,"JOSHUA  KIM","147 MONTGOMERY AVE","BALA CYNWYD","PA",19004,"DENTAL","General Dentist"]
[null,831042920,1447335997,"ANWAR  AHMAD","294 W LEE HWY STE 201","WARRENTON","VA",20186,"DENTAL","General Dentist"]
[null,954632149,1851417737,"VIVEK  SHETTY","10833 LE CONTE AVE","LOS ANGELES","CA",90095,"DENTAL","Oral Surgeon"]
[null,562084642,1104207968,"LOGAN D BARNES","11990 HIGHWAY 17 BYPASS UNIT 8","MURRELLS INLET","SC",29576,"DENTAL","General Dentist"]
[null,844919448,1750357240,"PAUL DAVID STEIN","1861 PLACIDA RD STE 105","ENGLEWOOD","FL",34223,"DENTAL","General Dentist"]
[null,861160597,1184705832,"GLEN THOMAS CASTO","621 SEBASTIAN BLVD STE B","SEBASTIAN","FL",32958,"DENTAL","Endodontist"]
[null,611441682,1881871234,"JACQUELINE  ORTEGA","1298 N DIXIE FWY","NEW SMYRNA","FL",32168,"DENTAL","General Dentist"]
[null,611441682,1841477296,"ALEJANDRO E MIRANDA KNAPP","1298 N DIXIE FWY","NEW SMYRNA","FL",32168,"DENTAL","General Dentist"]
[null,473038547,1922355403,"HENRY  HUANG","241 ROUTE 9W","GLENMONT","NY",12077,"DENTAL","General Dentist"]
[null,208293911,1447370176,"RYAN S PITMAN","2230 W BURNSIDE ST STE C","PORTLAND","OR",97210,"DENTAL","General Dentist"]
[null,"010644983",1013058445,"DREW  EARHART","1891 FRUITVILLE PIKE NORTH","LANCASTER","PA",17601,"DENTAL","General Dentist"]
[null,270659686,1447799028,"MEGAN  LARAWAY","160 SALLITT DR STE 106","STEVENSVILLE","MD",21666,"DENTAL","Pediatric Dentist"]
[null,820593947,1760176234,"JENNIFER M DEMOURA","365 MARKET PL STE 100","ROSWELL","GA",30075,"DENTAL","General Dentist"]
[null,843670598,1124269816,"CATALIN F ARHIRI","606 CHESTER PIKE","CRUM LYNNE","PA",19022,"DENTAL","General Dentist"]
[null,833905872,1992823124,"WINNIE  LEE","3706 N ROOSEVELT BLVD STE 201","KEY WEST","FL",33040,"DENTAL","General Dentist"]
[null,921496164,1932490307,"BRADLY K RUSSELL","1601 S HAWTHORNE RD","WINSTON SALEM","NC",27103,"DENTAL","General Dentist"]
[null,200919034,1619088556,"BRIAN H GOLD","60 JEFFERSON ST","MONTICELLO","NY",12701,"DENTAL","General Dentist"]
[null,582120048,1164510111,"R JASON J HEHR","5401 NETHERBY LN STE 500","NORTH CHARLESTON","SC",29420,"DENTAL","Oral Surgeon"]
[null,814076832,1770150245,"JOHN  HENRY","9010 HARFORD RD","PARKVILLE","MD",21234,"DENTAL","General Dentist"]
[null,231365971,1114076387,"BRIDGET A MCLAUGHLIN","3223 N BROAD ST","PHILADELPHIA","PA",19140,"DENTAL","General Dentist"]
[null,261163534,1992808547,"BERNARD  CALEM","30 JACKSON RD STE A5","MEDFORD","NJ","08055","DENTAL","Periodontist"]
[null,370966854,1962011080,"NIDHI  PRIYA","402 S LEWIS LANE","CARBONDALE","IL",62901,"DENTAL","General Dentist"]
[null,455540750,1023670320,"ROMI  PARK","17 EXECUTIVE PARK DR NE STE 235","ATLANTA","GA",30329,"DENTAL","General Dentist"]
[null,912180598,1255915021,"REBECCA R CARRATT","707 228TH AVE NE ST","SAMMAMISH","WA",98074,"DENTAL","General Dentist"]
[null,541590300,1558689240,"TIFFANY L WILLIAMS","1000 E BROAD ST","RICHMOND","VA",23219,"DENTAL","Pediatric Dentist"]
[null,170465210,1285986091,"ANTHONY F OSWICK","8720 LOST COVE DR","ORLANDO","FL",32819,"DENTAL","General Dentist"]
[null,883873658,1972121432,"MEENALI  KHARE","217 S 2ND AVE","WALLA WALLA","WA",99362,"DENTAL","General Dentist"]
[null,882341499,1669543211,"JOYCE A PERIH","1210 ONEILL HWY","DUNMORE","PA",18512,"DENTAL","Orthodontist"]
[null,822683940,1295950459,"LINDA M KLATT","140 UNION RD","BELLEFONTE","PA",16823,"DENTAL","General Dentist"]
[null,223936254,1669802054,"ISMAIL  OKASHA","483 MIDDLE TPKE W STE 309","MANCHESTER","CT","06040","DENTAL","Prosthodontist"]
[null,"061672117",1609551100,"SYED JUNAID QADIR","5744 CANTON CV","WINTER SPRINGS","FL",32708,"DENTAL","General Dentist"]
[null,232345050,1275154478,"BRITTANY  MILLER","130 ALMSHOUSE RD STE 500","RICHBORO","PA",18954,"DENTAL","General Dentist"]
[null,510158976,1134147390,"COLLEEN M WILLIAMS","2150 US HWY 54 S","ALAMOGORDO","NM",88310,"DENTAL","General Dentist"]
[null,"014701530",1215467881,"RACHAEL E CREISHER","1750 POST RD","WELLS","ME","04090","DENTAL","General Dentist"]
[null,833389349,1366973802,"AMANDA  NEBEL","136 E 57TH ST STE 1604","NEW YORK","NY",10022,"DENTAL","General Dentist"]
[null,263715531,1275052417,"PAIGE R GRATER","3606 MEDICAL PARK CT","MOREHEAD CITY","NC",28557,"DENTAL","General Dentist"]
[null,651144303,1457084964,"ALYSSA ANGELA BONOMO","2401 PGA BLVD STE 276","PALM BEACH GARDENS","FL",33410,"DENTAL","General Dentist"]
[null,852047949,1144725128,"ROBERT E GEARY","344 ROCKLAND ST","HINGHAM","MA","02043","DENTAL","General Dentist"]
[null,112651747,1528241817,"MICHAEL A NASTASI","453 ROCKAWAY AVE","VALLEY STREAM","NY",11581,"DENTAL","General Dentist"]
[null,233024574,1861532442,"SAMUEL I KRATCHMAN","1460 RUSSELL RD STE 203","PAOLI","PA",19301,"DENTAL","Endodontist"]
[null,263234229,1649761115,"JASON  SCHLUETER","409 W LUDINGTON AVE STE 101","LUDINGTON","MI",49431,"DENTAL","General Dentist"]
[null,812998147,1730924473,"JESSICA  CHACON","1710 DEKALB PIKE","BLUE BELL","PA",19422,"DENTAL","General Dentist"]
[null,232997598,1740364231,"GLENN  GRAY","219 HAMPDEN AVE","NARBERTH","PA",19072,"DENTAL","General Dentist"]
[null,599144642,1083048458,"VALERIE  CLAVELL GARCIA","CALLE REINA 104 ESQUINA MENDEZ VIGO","PONCE","PR","00731","DENTAL","General Dentist"]
[null,582049872,1669597183,"SUSAN  SWAIN","1200 BALD RIDGE MARINA RD STE 200","CUMMING","GA",30041,"DENTAL","General Dentist"]
[null,824455962,1285051847,"ERIK  WONG","140 HOOHANA ST STE 300","KAHULUI","HI",96732,"DENTAL","Prosthodontist"]
[null,202094369,1790351187,"JAY R PIETILA","1550 W QUINCY ST","HANCOCK","MI",49930,"DENTAL","General Dentist"]
[null,394128813,1174369482,"TIFFANY  GRYSZKO","2800 66TH ST N","ST PETERSBURG","FL",33710,"DENTAL","General Dentist"]
[null,821352549,1831211564,"HARVEY  LESTER","9030 W SAHARA AVE","LAS VEGAS","NV",89117,"DENTAL","General Dentist"]
[null,231365971,1457813040,"JESSICA L EDWARDS","3223 N BROAD ST","PHILADELPHIA","PA",19140,"DENTAL","General Dentist"]
[null,262276712,1194357277,"STACI  SMITH","39 BROADWAY RM 2115","NEW YORK","NY",10006,"DENTAL","General Dentist"]
[null,821352549,1053531194,"THOMAS T VAHDANI","9030 W SAHARA AVE","LAS VEGAS","NV",89117,"DENTAL","General Dentist"]
[null,201938618,1053890095,"DILEEP  VARGHESE","3940 W WHEATLAND RD","DALLAS","TX",75237,"DENTAL","General Dentist"]
[null,231365971,1649431784,"MICHAEL T BARNES","3223 N BROAD ST","PHILADELPHIA","PA",19140,"DENTAL","General Dentist"]
[null,453859945,1669160164,"KIROLLOS  GERGES","1762 HIGHWAY 48 STE A","CLARKSVILLE","TN",37040,"DENTAL","General Dentist"]
[null,956006143,1164523114,"PAULO M CAMARGO","10833 LE CONTE AVE STE 10-137","LOS ANGELES","CA",90095,"DENTAL","Periodontist"]
[null,"060979905",1942282363,"CRAIG K FOISIE","97 ELM ST","OLD SAYBROOK","CT","06475","DENTAL","Periodontist"]
[null,"060979905",1285997403,"TATYANA  OKS","25 DURHAM RD","MADISON","CT","06443","DENTAL","Periodontist"]
[null,274257185,1386350882,"SAMUEL D RATCLIFFE","677 ROUTE 7A","SHAFTSBURY","VT","05262","DENTAL","General Dentist"]
[null,274257185,1649966672,"ADDISON  VITOLS","677 ROUTE 7A","SHAFTSBURY","VT","05262","DENTAL","General Dentist"]
[null,832587949,1538845250,"POONAM K FURMAH","201 OHIO RIVER BLVD UNIT A","SEWICKLEY","PA",15143,"DENTAL","General Dentist"]
[null,146013200,1902929706,"STEVEN M ZOVE","SULLIVAN HALL","STONY BROOK","NY",11794,"DENTAL","Periodontist"]
[null,202264453,1285651257,"LISA A MARVIL","14 PIDGEON HILL DR STE 360","STERLING","VA",20165,"DENTAL","Periodontist"]
[null,333560475,1023418225,"ANDREW D BARNES","5 CAULK LN","EASTON","MD",21601,"DENTAL","General Dentist"]
[null,934343802,1194455329,"DIANA  PEREZ","701 S INDIANA AVE","ENGLEWOOD","FL",34223,"DENTAL","General Dentist"]
[null,232001063,1891258141,"SAMANTHA A PIROK","1740 SOUTH ST STE 504","PHILADELPHIA","PA",19146,"DENTAL","General Dentist"]
[null,850849636,1386164846,"SIM  CHING","20785 PROFESSIONAL PARK BLVD","GEORGETOWN","DE",19947,"DENTAL","General Dentist"]
[null,264141691,1619179702,"DANIEL  KUBIKIAN","340 EGG HARBOR RD","SEWELL","NJ","08080","DENTAL","Periodontist"]
[null,383505782,1104910405,"DAVID  KAM","4320 ORCHARD LAKE RD","WEST BLOOMFIELD","MI",48323,"DENTAL","General Dentist"]
[null,383505782,1174182356,"KEVIN H MALERMAN","4320 ORCHARD LAKE RD","WEST BLOOMFIELD","MI",48323,"DENTAL","General Dentist"]
[null,263533609,1538206123,"ABDUL FARIS WAHEED","528 W BALDWIN RD","PANAMA CITY","FL",32405,"DENTAL","General Dentist"]
[null,842782656,1093494767,"ANNA-JANE  SMITH","31 E MACK BAYOU DRIVE","SANTA ROSA BEACH","FL",32459,"DENTAL","General Dentist"]
[null,320285314,1225769995,"MARCO  BONGARZONE","729 FRANKLINVILLE RD","MULLICA HILL","NJ","08062","DENTAL","General Dentist"]
[null,994989830,1063234946,"SG DENTAL SERVICES LLC","722 E PULASKI HWY STE 102","ELKTON","MD",21921,"DENTAL","General Dentist"]

{"sheet":"DHMO Provider Listing","index":2,"n_rows":176,"n_cols":16,"rows_kept":176,"cut":false,"hidden":false,"merged":[[4,10,4,12],[4,13,4,15],[1,1,1,4],[2,1,2,4],[3,1,3,4],[3,10,3,12],[3,13,3,15]]}
[]
[null,"The State of Delaware"]
[null,"DHMO Providers Utilized"]
[null,"INCURRED January 1, 2025 through December 31, 2025 and PAID from January 1, 2025 through current",null,null,null,"DO NOT SORT OR REORDER ANY OF THE ROWS BELOW",null,null,null,null,{"$f":"IF('Vendor Instructions'!$D$11=\"\",\"Vendor Name\",'Vendor Instructions'!$D$11)","v":"Vendor Name"},null,null,{"$f":"IF('Vendor Instructions'!$D$11=\"\",\"Vendor Name\",'Vendor Instructions'!$D$11)","v":"Vendor Name"}]
[null,null,null,null,null,null,null,null,null,null,{"$f":"IF('Vendor Instructions'!$D$12=\"\",\"DPPO Primary Network\",'Vendor Instructions'!$D$12)","v":"DPPO Primary Network"},null,null,{"$f":"IF('Vendor Instructions'!$D$13=\"\",\"DPPO Alt Network\",'Vendor Instructions'!$D$13)","v":"DPPO Alt Network"}]
[null,"Provider TIN","Provider NPI","Provider Name","Address where service was rendered","Address 2","City where service was rendered","State where \nservice was rendered","Zip code where \nservice was rendered","Coverage","Is this Provider contracted in network?\n(Y/D/N/E)","Match Criteria ","Additional comment (optional)","Is this Provider contracted in network?\n(Y/D/N/E)","Match Criteria","Additional comment (optional)"]
[null,"271740902","1568598514","American Dental Care of Dover LLC","60 Wolf Creek Blvd","Dover","DE","19901","Dental","General Provider                   "]
[null,"881009167","1245450774","Constantine Piperis DDS PA","218 Pennsylvania Ave.","Seaford","DE","19973","Dental","General Provider                   "]
[null,"272896503","1679613335","Lisa A Fagioletti DMD LLC","25 W Commerce St","Smyrna","DE","19977","Dental","General Provider                   "]
[null,"880714495","1932329612","Milford Dental Center","909 N Dupont Hwy","Milford","DE","19963","Dental","General Provider                   "]
[null,"510398102","1184288581","Progressive Dental Arts","5301 Limestone Rd Suite","Wilmington","DE","19808","Dental","General Provider                   "]
[null,"472600937","1295969160","Cook Family Dentistry PA","12 Pennington Street Sui","Middletown","DE","19709","Dental","General Provider                   "]
[null,"510398102","1659833168","Progressive Dental Arts","685 E. Chestnut Hill Rd.","Newark","DE","19713","Dental","General Provider                   "]
[null,"463251811","1396880894","Southern Dental LLC","703 Health Services Dr S","Seaford","DE","19973","Dental","General Provider                   "]
[null,"463508754","1881722635","Rutledge Dental Associates","410 N. Cass St.","Middletown","DE","19709","Dental","General Provider                   "]
[null,"202289843","1891917266","Healthy Smiles of Delaware PA","1700 N Rodney St","Wilmington","DE","19806","Dental","General Provider                   "]
[null,"463251811","1134283963","Southern Dental LLC","703 Health Services Dr","Seaford","DE","19973","Dental","General Provider                   "]
[null,"463251811","1992020390","Southern Dental LLC","703 Health Services Dr","Seaford","DE","19973","Dental","General Provider                   "]
[null,"271740902","1447983523","American Dental Care of Dover LLC","60 Wolf Creek Blvd","Dover","DE","19901","Dental","General Provider                   "]
[null,"271740902","1740704832","American Dental Care of Dover LLC","60 Wolf Creek Blvd","Dover","DE","19901","Dental","General Provider                   "]
[null,"510361961","1083093603","New Concept Dental","2004 Foulk Rd. Suite 1","Wilmington","DE","19810","Dental","General Provider                   "]
[null,"271740902","1134571565","American Dental Care of Dover LLC","60 Wolf Creek Blvd","Dover","DE","19901","Dental","General Provider                   "]
[null,"460826508","1508145970","Daniel J Fay DMD PA","748 S New Street","Dover","DE","19904","Dental","General Provider                   "]
[null,"510398102","1760043079","Progressive Dental Arts","685 E. Chestnut Hill Rd.","Newark","DE","19713","Dental","General Provider                   "]
[null,"510122179","1396880894","Brown and Baran Family Dentistry","1601 Milltown Rd. Suite","Wilmington","DE","19808","Dental","General Provider                   "]
[null,"510122179","1134283963","Brown and Baran Family Dentistry","1601 Milltown Rd. Suite","Wilmington","DE","19808","Dental","General Provider                   "]
[null,"204150838","1083922785","Park Place Dental","210 West Park Place","Newark","DE","19711","Dental","General Provider                   "]
[null,"208643759","1033257530","First State Oral & Maxillofacial Surgery","1004 S State St Suite 1","Dover","DE","19901","Dental","Oral Surgeon                       "]
[null,"474948787","1881946333","Wilmington Orthodontic Center LLC","2300 Pennsylvania Ave Su","Wilmington","DE","19806","Dental","Orthodontist                       "]
[null,"510398102","1609457001","Progressive Dental Arts","685 E. Chestnut Hill Rd.","Newark","DE","19713","Dental","General Provider                   "]
[null,"232667609","1245285568","Herbert T Casalena DDS PA","2300 Pennsylvania Ave 6t","Wilmington","DE","19806","Dental","General Provider                   "]
[null,"800569484","1457565830","Dr. Jeffrey L. Cook","16 Peddlers Village","Christiana","DE","19702","Dental","General Provider                   "]
[null,"474948787","1881946333","Wilmington Orthodontic  Center","20785 Professional Park","Georgetown","DE","19947","Dental","Orthodontist                       "]
[null,"820740118","1104984582","Mid Atlantic Dental Partners","330 Christiana Medical C","Newark","DE","19702","Dental","General Provider                   "]
[null,"208643759","1144462649","First State Oral & Maxillofacial Surgery","1004 S State St Suite 1","Dover","DE","19901","Dental","Oral Surgeon                       "]
[null,"510361961","1467016279","New Concept Dental","2004 Foulk Rd. Suite 1","Wilmington","DE","19810","Dental","General Provider                   "]
[null,"510398102","1053466250","Progressive Dental Arts","42 Omega Dr Bldg H","Newark","DE","19713","Dental","General Provider                   "]
[null,"853088518","1629395264","Albanese Oral & Maxillofacial Surgery PLLC","300 Old Forge Ln Suite 3","Kennett Square","PA","19348","Dental","Oral Surgeon                       "]
[null,"463508754","1063540342","Rutledge Dental Associates","410 N. Cass St.","Middletown","DE","19709","Dental","General Provider                   "]
[null,"832045481","1215215652","Childrens Dental Health of Delaware LLC","3301 Lancaster Pike Unit","Wilmington","DE","19805","Dental","Pedodontist                        "]
[null,"820740118","1104984582","Mid Atlantic Dental Partners","P.O. Box 860036","Minneapolis","MN","55486","Dental","General Provider                   "]
[null,"262646682","1811059033","Braden Dental Of South Jersey","160 S Broadway","Pennsville","NJ","08070","Dental","General Provider                   "]
[null,"271742376","1235229428","Brandywine Dental Care","707 Foulk Rd Suite 201","Wilmington","DE","19803","Dental","General Provider                   "]
[null,"510398102","1760655930","Progressive Dental Arts","685 E. Chestnut Hill Rd.","Newark","DE","19713","Dental","General Provider                   "]
[null,"510398102","1730351172","Progressive Dental Arts","685 E. Chestnut Hill Rd.","Newark","DE","19713","Dental","General Provider                   "]
[null,"204879395","1467546556","Gentle Care Family Dentistry","2300 Pennsylvania Ave. U","Wilmington","DE","19806","Dental","General Provider                   "]
[null,"262566714","1205894789","Smyrna Dental Center","671 S Carter Rd. Ste. 13","Smyrna","DE","19977","Dental","General Provider                   "]
[null,"208643759","1144462649","First State Oral and Maxillofacial Surgery","9096 Riverside Dr Suite","Seaford","DE","19973","Dental","Oral Surgeon                       "]
[null,"510191513","1417083627","Oral & Maxillofacial Surgery Associates, P.A.","1304 North Broom Street","Wilmington","DE","19806","Dental","Oral Surgeon                       "]
[null,"832045481","1215215652","Childrens Dental Health of Delaware LLC","P.O. Box  820233 Suite 2","Philadelphia","PA","19182","Dental","Pedodontist                        "]
[null,"920779456","1386704815","Middletown Dental Care","423 E Main St","Middletown","DE","19709","Dental","General Provider                   "]
[null,"271740902","1457519712","American Dental Care of Dover LLC","60 Wolf Creek Blvd","Dover","DE","19901","Dental","General Provider                   "]
[null,"510376139","1154536464","MichaelAloe","850 S State Street","Dover","DE","19901","Dental","Endodontist                        "]
[null,"510361961","1821558677","New Concept Dental","2004 Foulk Rd. Suite 1","Wilmington","DE","19810","Dental","General Provider                   "]
[null,"208643759","1033257530","First State Oral and Maxillofacial Surgery","1004 S State St 1 Suite","Dover","DE","19901","Dental","Oral Surgeon                       "]
[null,"208643759","1679868095","First State Oral & Maxillofacial Surgery","1004 S State St Suite 1","Dover","DE","19901","Dental","Oral Surgeon                       "]
[null,"510191513","1417083627","Oral & Maxillofacial Surgery Associates, P.A.","Oral Maxillofacial Surg","Wilmington","DE","19806","Dental","Oral Surgeon                       "]
[null,"464244840","1306100607","Delaware Dental Solutions","131 Becks Woods Drive","Bear","DE","19701","Dental","General Provider                   "]
[null,"833246828","1285150003","Brandywine Pediatric Dentistry PA","2000 Foulk Road Ste C","Wilmington","DE","19810","Dental","Pedodontist                        "]
[null,"273764920","1710191697","Centre for Cosmetic Dentistry","275 Wilmington Westchest","Chadds Ford","PA","19317","Dental","General Provider                   "]
[null,"208643759","1831458207","First State Oral & Maxillofacial Surgery","1004 S State St Suite 1","Dover","DE","19901","Dental","Oral Surgeon                       "]
[null,"880917543","1659001493","Family Dentistry Of Jensen Bea","3571 Nw Federal Hwy","Jensen Beach","FL","34957","Dental","General Provider                   "]
[null,"271740902","1417382490","American Dental Care of Dover LLC","60 Wolf Creek Blvd","Dover","DE","19901","Dental","General Provider                   "]
[null,"510398102","1982722617","Progressive Dental Arts","685 E. Chestnut Hill Rd.","Newark","DE","19713","Dental","General Provider                   "]
[null,"208643759","1831458207","First State Oral & Maxillofacial Surgery","19323 Lighthouse Plaza U","Rehoboth","DE","19971","Dental","Oral Surgeon                       "]
[null,"510376139","1346419546","SukCarr","850 South State Street","Dover","DE","19901","Dental","General Provider                   "]
[null,"208643759","1831458207","First State Oral and Maxillofacial Surgery","9096 Riverside Dr Ste. 1","Seaford","DE","19973","Dental","Oral Surgeon                       "]
[null,"510191513","1417083627","Oral & Maxillofacial Surgery Associates, P.A.","2601 Annand Drive, Suite","Wilmington","DE","19808","Dental","Oral Surgeon                       "]
[null,"208643759","1144462649","First State Oral & Maxillofacial Surgery","19323 Lighthouse Plaza U","Rehoboth","DE","19971","Dental","Oral Surgeon                       "]
[null,"223707311","1437268190","Lisa Gambino DMD","4 West Maple Court","Woodstown","NJ","08098","Dental","General Provider                   "]
[null,"263894534","1003915091","DarlaBrice","3512 Silverside Rd The C","Wilmington","DE","19810","Dental","General Provider                   "]
[null,"814805611","1851915789","Media endodontics","1215 W Baltimore Pike St","Media","PA","19063","Dental","Endodontist                        "]
[null,"208643759","1679868095","First State Oral and Maxillofacial Surgery","1004 S State St 1 Ste. 1","Dover","DE","19901","Dental","Oral Surgeon                       "]
[null,"871184393","1437355369","Mary A Haley DDS PLLC","801 Greenbrier Parkway S","Chesapeake","VA","23320","Dental","General Provider                   "]
[null,"510191513","1417083627","Oral & Maxillofacial Surgery Associates, P.A.","2601 Annand Dr Ste 10","Wilmington","DE","19808","Dental","Oral Surgeon                       "]
[null,"208643759","1679868095","First State Oral and Maxillofacial Surgery","9096 Riverside Dr Ste. 1","Seaford","DE","19973","Dental","Oral Surgeon                       "]
[null,"232054483","1588866933","Oral & Maxillofacial Surgery Associates of Chester","721 E Baltimore Pk Ste 2","Kennett Square","PA","19348","Dental","Oral Surgeon                       "]
[null,"874330129","1427897446","Community Dental of Cumberland","2271 N 2nd Street","Millville","NJ","08332","Dental","General Provider                   "]
[null,"208643759","1114488772","First State Oral and Maxillofacial Surgery","9096 Riverside Dr Ste 1","Seaford","DE","19973","Dental","Oral Surgeon                       "]
[null,"043721993","1154472272","North Penn Endodontics","2100 North Broad Street","Lansdale","PA","19446","Dental","Endodontist                        "]
[null,"510228227","1083717094","DanielKreshtool","1815 West 13th Street","Wilmington","DE","19806","Dental","Endodontist                        "]
[null,"208643759","1033257530","First State Oral and Maxillofacial Surgery","9096 Riverside Dr Suite","Seaford","DE","19973","Dental","Oral Surgeon                       "]
[null,"460826508","1700312527","Daniel J Fay DMD PA","748 S New Street","Dover","DE","19904","Dental","General Provider                   "]
[null,"921153299","1528686862","Aero Dental PC","1209 Ward Ave. Suite 2","West Chester","PA","19380","Dental","General Provider                   "]
[null,"272702993","1598805608","A + Oral Surgery Specialty Care PC","401 Commerce Drive Ste 2","Fort Washingto","PA","19034","Dental","Oral Surgeon                       "]
[null,"833246828","1003109877","Brandywine Pediatric Dentistry PA","2000 Foulk Road Ste C","Wilmington","DE","19810","Dental","Pedodontist                        "]
[null,"820740118","1720146160","Mid Atlantic Dental Partners","330 Christiana Medical C","Newark","DE","19702","Dental","General Provider                   "]
[null,"208643759","1114488772","First State Oral & Maxillofacial Surgery","1004 S State St Suite 1","Dover","DE","19901","Dental","Oral Surgeon                       "]
[null,"510361961","1205914652","New Concept Dental","2004 Foulk Rd. Suite 1","Wilmington","DE","19810","Dental","General Provider                   "]
[null,"043721993","1093731465","North Penn Endodontics","2100 North Broad Street","Lansdale","PA","19446","Dental","Endodontist                        "]
[null,"814805611","1922626787","Media endodontics","1215 W Baltimore Pike St","Media","PA","19063","Dental","Endodontist                        "]
[null,"233101899","1134393945","Pennsylvania Oral and Max Surgery","555 2nd Ave Suite E-100","Collegeville","PA","19426","Dental","Oral Surgeon                       "]
[null,"510398102","1205914652","Progressive Dental Arts","5301 Limestone Rd Suite","Wilmington","DE","19808","Dental","General Provider                   "]
[null,"462832821","1326120569","Elkton Bear Dental Arts","142 W High St","Elkton","MD","21921","Dental","General Provider                   "]
[null,"521805308","1710035878","Marc G Geballa, DDS","6911 Laurel Bowie Rd. Su","Bowie","MD","20715","Dental","Endodontist                        "]
[null,"261193634","1366583841","Cape May Family Dental Pa","3159 Route 9 S Unit 7","Rio Grande","NJ","08242","Dental","Endodontist                        "]
[null,"262231139","1962654459","Holdbrook Pediatric Dental Llc","499 Beckett Rd Ste 102","Logan Township","NJ","08085","Dental","Pedodontist                        "]
[null,"263894534","1003915091","DarlaBrice","3512 Silverside Rd Ste 6","Wilmington","DE","19810","Dental","Periodontist                       "]
[null,"812104257","1497388300","Excel Endodontics of Pennsylvania LLC","1500 Walnut St Suite 600","Philadelphia","PA","19102","Dental","Endodontist                        "]
[null,"463358957","1386059772","Periodontal Consultants","1901 S. Broad St.","Philadelphia","PA","19148","Dental","Periodontist                       "]
[null,"541123092","1699506675","Dental Specialty Center of Virginia Beach","684 N. Battlefield Blvd.","Chesapeake","VA","23320","Dental","Endodontist                        "]
[null,"208643759","1679868095","First State Oral & Maxillofacial Surgery","19323 Lighthouse Plaza U","Rehoboth","DE","19971","Dental","Oral Surgeon                       "]
[null,"900604147","1902063910","Silly Smiles LLC","200 Biddle Ave Suite 201","Newark","DE","19702","Dental","Pedodontist                        "]
[null,"822854414","1659786648","Gentle Touch Smiles","4201 Miller Rd","Wilmington","DE","19802","Dental","General Provider                   "]
[null,"820740118","1720146160","Mid Atlantic Dental Partners","P.O. Box 860036","Minneapolis","MN","55486","Dental","General Provider                   "]
[null,"232856415","1164593794","A-1 Family Dental Care PC","401 Commerce Drive Suite","Fort Washingto","PA","19034","Dental","General Provider                   "]
[null,"881224580","1609938828","The Smilist Dental PA PLLC Specialists","145 Brinton Lake Rd Ste","Glen Mills","PA","19342","Dental","Periodontist                       "]
[null,"208643759","1831458207","First State Oral and Maxillofacial Surgery","1004 S State St 1 Ste. 1","Dover","DE","19901","Dental","Oral Surgeon                       "]
[null,"461589362","1336418151","JohnFontana","910 Walker Square Suite","Dover","DE","19904","Dental","General Provider                   "]
[null,"332282775","1598494866","Bath Dental Care LLC","116 S Walnut St Suite 10","Bath","PA","18014","Dental","General Provider                   "]
[null,"264718450","1831715044","Ardent Smile PC","401 Commerce Drive Suite","Fort Washingto","PA","19034","Dental","General Provider                   "]
[null,"822854414","1619288461","Gentle Touch Smiles Specialists","4201 Miller Rd","Wilmington","DE","19802","Dental","Pedodontist                        "]
[null,"881224580","1124582242","The Smilist Dental PA PLLC","145 Brinton Lake Rd Suit","Glen Mills","PA","19342","Dental","General Provider                   "]
[null,"232860692","1487437968","Direct Mobile Dental Services","147 Montgomery Ave","Bala Cynwyd","PA","19004","Dental","General Provider                   "]
[null,"115384349","1194810606","Estelle R Stein DDS","116 South Walnut Street","Bath","PA","18014","Dental","General Provider                   "]
[null,"208643759","1144462649","First State Oral and Maxillofacial Surgery","1004 S State St 1 Suite","Dover","DE","19901","Dental","Oral Surgeon                       "]
[null,"231412950","1932380284","Shore & Snyder Dental Center","519 Chester Pike Box 40","Norwood","PA","19074","Dental","General Provider                   "]
[null,"203497479","1215051958","Drexel Hill Family Dentistry PC","4244 Ferne Blvd","Drexel Hill","PA","19026","Dental","General Provider                   "]
[null,"462406749","1205404456","Center City Emergency Dentist","1429 Walnut Str 6th Floo","Philadelphia","PA","19102","Dental","General Provider                   "]
[null,"510402578","1083922785","Foulk Road Dental","300 Foulk Road Suite 101","Wilmington","DE","19803","Dental","General Provider                   "]
[null,"232856415","1962922906","A-1 Family Dental Care PC","8355 Loretto Avenue Suit","Philadelphia","PA","19152","Dental","General Provider                   "]
[null,"232860692","1164152591","Direct Mobile Dental Services","147 Montgomery Ave","Bala Cynwyd","PA","19004","Dental","General Provider                   "]
[null,"510398102","1205914652","Progressive Dental Arts","42 Omega Dr Bldg H","Newark","DE","19713","Dental","General Provider                   "]
[null,"825118844","1588154934","Dental Arts Group Elmer Specialists","350 Front St.","Elmer","NJ","08318","Dental","Oral Surgeon                       "]
[null,"113512698","1639386675","Schuller And Schuller DDS","508 Newark Pompton Turnp","Pompton Plains","NJ","07444","Dental","General Provider                   "]
[null,"205961509","1114120805","Charles A Evans DMD","7 Benson Avenue","Pennsville","NJ","08070","Dental","General Provider                   "]
[null,"921887625","1063903375","Pearly Whites","24415 W Warren St","Dearborn Heigh","MI","48127","Dental","General Provider                   "]
[null,"232856415","1659941896","A-1 Family Dental Care PC","8539 Bustleton Ave. Suit","Philadelphia","PA","19152","Dental","General Provider                   "]
[null,"510398102","1275700130","Progressive Dental Arts","685 E. Chestnut Hill Rd.","Newark","DE","19713","Dental","General Provider                   "]
[null,"522206059","1073551768","BEL AIR DENTAL ASSOCIATES LLC","10 W BROADWAY Lower Leve","BEL AIR","MD","21014","Dental","General Provider                   "]
[null,"843026378","1356961395","Dentists Of Port Charlotte","PO BOX 920050","DALLAS","TX","92614","Dental","General Provider                   "]
[null,"999999999","1558610139","AustinJang","408 SOUTH RIDGE AVE","Middletown","DE","19709","Dental","General Provider                   "]
[null,"461158725","1124852629","Advanced Family Smile Care PC","8 Pond's Edge Drive Suit","Chadds Ford","PA","19317","Dental","General Provider                   "]
[null,"822854414","1619288461","Gentle Touch Smiles Specialists","P.O. Box 912913","Denver","CO","80291","Dental","Pedodontist                        "]
[null,"272702993","1598014524","A+ Oral Surgery Specialty Care PC","401 Commerce Drive Suite","Fort Washingto","PA","19034","Dental","Oral Surgeon                       "]
[null,"270375083","1366588071","Family Dental Care of South Jersey","707 Haddonfield-Berlin R","Voorhees","NJ","08043","Dental","General Provider                   "]
[null,"231365971","1861730434","Temple University Kornberg School of Dentistry","PO Box 22438","New York","NY","10087","Dental","General Provider                   "]
[null,"232815882","1013031020","American Dental Care PC","6240 Lake Osprey Drive D","Sarasota","FL","34240","Dental","General Provider                   "]
[null,"461158725","1831715044","Advanced Family Smile Care PC","401 Commerce Drive Suite","Fort Washingto","PA","19034","Dental","General Provider                   "]
[null,"881625957","1033495510","Smyrna Pediatric Dentistry","51 Huntfield Dr Ste 100","Smyrna","DE","19977","Dental","Pedodontist                        "]
[null,"208643759","1407803398","OttoTidwell","9096 RIVERSIDE DR","Seaford","DE","19973","Dental","General Provider                   "]
[null,"832045481","1841859238","Childrens Dental Health of Delaware LLC","3301 Lancaster Pike Unit","Wilmington","DE","19805","Dental","Pedodontist                        "]
[null,"262646682","1841920618","Braden Dental Of South Jersey","160 S Broadway","Pennsville","NJ","08070","Dental","General Provider                   "]
[null,"832045481","1841859238","Childrens Dental Health of Delaware LLC","P.O. Box  820233","Philadelphia","PA","19182","Dental","Pedodontist                        "]
[null,"261193634","1366583841","Cape May Family Dental PA","3159 Route 9 South UNIT","Rio Grande","NJ","08242","Dental","Endodontist                        "]
[null,"825118844","1467834937","Dental Arts Group Elmer Specialists","350 Front St.","Elmer","NJ","08318","Dental","Endodontist                        "]
[null,"991053411","1285150003","Brandywine Pediatric Dentistry Of Middletown","498 Warwick Middletown R","Middletown","DE","19709","Dental","Pedodontist                        "]
[null,"208643759","1033257530","First State Oral & Maxillofacial Surgery","19323 Lighthouse Plaza U","Rehoboth","DE","19971","Dental","Oral Surgeon                       "]
[null,"464836212","1164101804","Lansdale Family Dentistry","2031 N Broad St Suite 14","Lansdale","PA","19446","Dental","General Provider                   "]
[null,"232708126","1578918777","Doc Bresler's Cavity Busters","4659 West Chester Pike","Newtown Square","PA","19073","Dental","Pedodontist                        "]
[null,"461158725","1841781754","Advanced Family Smile Care PC","8 Pond's Edge Drive Suit","Chadds Ford","PA","19317","Dental","General Provider                   "]
[null,"222488654","1740840388","Westside Family Healthcare Inc","1802 W Fourth St","Wilmington","DE","19805","Dental","General Provider                   "]
[null,"232180548","1053727727","Pennslyvania Endodontics Specialist","32 Parking Plz Suite 702","Ardmore","PA","19003","Dental","Endodontist                        "]
[null,"521945975","1295897940","Bright Now Dental","68 Thomas Johnson  Dr. S","Frederick","MD","21702","Dental","General Provider                   "]
[null,"262231139","1134109069","Holdbrook Pediatric Dental Llc","499 Beckett Rd Ste 102","Logan Township","NJ","08085","Dental","Pedodontist                        "]
[null,"522105412","1013778661","American Dental Solutions","2642 Egypt Rd. Ste. E","Audubon","PA","19403","Dental","General Provider                   "]
[null,"454571127","1275775439","The Maryland Oral Surgery Group and Implant Center","14300 Gallant Fox Ln Ste","Bowie","MD","20715","Dental","Oral Surgeon                       "]
[null,"232860692","1336273036","Direct Mobile Dental Services","147 Montgomery Ave","Bala Cynwyd","PA","19004","Dental","General Provider                   "]
[null,"541123092","1699506675","Dental Specialty Center of Virginia Beach","3388 Princess Anne Rd St","Virginia Beach","VA","23456","Dental","Endodontist                        "]
[null,"272702993","1598805608","A + Oral Surgery Specialty Care PC","401 Commerce Drive Ste 1","Fort Washingto","PA","19034","Dental","Oral Surgeon                       "]
[null,"231365971","1730109190","Temple University Kornberg School of Dentistry","PO Box 22438","New York","NY","10087","Dental","General Provider                   "]
[null,"232815882","1043902042","American Dental Care PC","722 Market Street","Philadelphia","PA","19106","Dental","General Provider                   "]
[null,"814692807","1134322183","Prager, Todd","709 S Broadway Ste C11","Pennsville","NJ","08070","Dental","General Provider                   "]
[null,"463251811","1528270022","Southern Dental LLC","703 Health Services Dr","Seaford","DE","19973","Dental","General Provider                   "]
[null,"521874990","1154417715","Robert A Goodman DDS PA","6301 N Charles St Ste 3","Baltimore","MD","21212","Dental","General Provider                   "]
[null,"231365971","1730109190","Temple University Kornberg School of Dentistry","3223 N Broad St","Philadelphia","PA","19140","Dental","General Provider                   "]
[null,"205498134","1225122203","Delaware Maryland Dental","614 Eastern Shore Drive","Salisbury","MD","21804","Dental","General Provider                   "]
[null,"271298387","1124852629","AAA Signature Smile PC","401 Commerce Dr. Ste. 10","Fort Washingto","PA","19034","Dental","General Provider                   "]
[null,"231365971","1811349517","Temple University Kornberg School of Dentistry","PO Box 22438","New York","NY","10087","Dental","Periodontist                       "]
[null,"232608442","1518978378","John A Cooper Jr DMD","231 N Shippen Pl Suite 3","Lancaster","PA","17602","Dental","General Provider                   "]
[null,"231365971","1609498534","Temple University Kornberg School of Dentistry","PO Box 22438","New York","NY","10087","Dental","General Provider                   "]
[null,"900003651","1740333004","Dental One Associates Annapolis PC","2623 Housley Rd","Annapolis","MD","21401","Dental","Periodontist                       "]
[null,"872665874","1982967543","Karan Teledentistry PC","9841 Washington Blvd. Su","Gaithersburg","MD","20878","Dental","General Provider                   "]
[null,"851283040","1366583841","Brighter Dental Care Delran Specialists","1320B Fairview Blvd. M-6","Delran","NJ","08075","Dental","Endodontist                        "]
[null,"231365971","1750466470","Temple University Kornberg School of Dentistry","PO Box 22438","New York","NY","10087","Dental","General Provider                   "]
[null,"232860692","1821126129","Direct Mobile Dental Services","147 Montgomery Ave","Bala Cynwyd","PA","19004","Dental","General Provider                   "]

{"sheet":"Field List","index":3,"n_rows":12,"n_cols":10,"rows_kept":12,"cut":false,"hidden":true,"merged":[]}
[]
["MedicalT","Provider TIN","Provider NPI","Provider Name","Address where service was rendered","City where service was rendered","State where \nservice was rendered","Zip code where \nservice was rendered","Physician or \nFacility","Provider Type / Specialty"]
["Medical1",123456789,1234567890,"ABC GENERAL HOSPITAL","6065 CENTRAL AVENUE","PORT CHARLES","NY","01234","FACILITY","GENERAL ACUTE-CARE HOSPITAL"]
["Medical2",234567890,9876543210,"GREGORY HOUSE M.D.","221B BAKER ST","PRINCETON","NJ",12345,"PHYSICIAN","INTERNAL MEDICINE"]
[]
["DentalT","Provider TIN","Provider NPI","Provider Name","Address where service was rendered","City where service was rendered","State where \nservice was rendered","Zip code where \nservice was rendered","Coverage","Provider Type / Specialty"]
["Dental1",123456789,1234567890,"NOVA KANE, DDS","555 E CHOCOLATE AVE #101","HERSHEY","PA","01234","DENTAL","GENERAL DENTIST"]
["Dental2",234567890,9876543210,"BRACE YOURSELF ORTHODONTIA","123 BRIDGE STREET","BAYSIDE","CA",12345,"DENTAL","ORTHODONTIA"]
[]
["VisionT","Provider TIN","Provider NPI","Provider Name","Address where service was rendered","City where service was rendered","State where \nservice was rendered","Zip code where \nservice was rendered","Coverage","Provider Type / Specialty"]
["Vision1",123456789,1234567890,"J. QUINCY MAGOO, OD","1 W 2ND STREET","FREDERICK","MD","01234","VISION","OPTOMETRIST"]
["Vision2",234567890,9876543210,"FRANLKIN BIFOCALS","300 MARKET STREET","PHILADELPHIA","PA",12345,"VISION","OPTICIAN"]