{"text_format":"1","workbook":"xlsx","n_sheets":4,"sheets":["Vendor Instructions","DPPO Provider Listing","DHMO Provider Listing","Field List"],"not_rendered":{"charts":0,"images":0,"macros":1,"external_links":0,"defined_names":6,"comments":0,"pivot_tables":0},"unopened":[],"bounds":{"document_bytes":16777216,"sheet_cells":100000,"rows_first":2000,"rows_last":500,"rows_between":2000,"halvings":0,"cell_chars":16384,"cell_head_chars":4096},"cells_cut":0,"cells_raw":0,"read":"whole","date_system":"1900"}

{"sheet":"Vendor Instructions","index":0,"n_rows":33,"n_cols":8,"rows_kept":33,"cut":false,"hidden":false,"merged":[[10,3,10,4],[11,3,11,4],[12,3,12,4],[26,2,26,10],[31,2,31,10],[32,2,32,10],[30,2,30,10],[27,2,27,10],[28,2,28,10],[29,2,29,10]]}
[]
[null,"Provider Disruption Reporting Template"]
[]
[null,"Basic information"]
[null,null,"Enter the name of your organization and (if applicable) the name of the network being analyzed"]
[]
[null,"Basic information"]
[null,null,"Enter the name of your organization and (if applicable) the name of the network being analyzed"]
[null,null,"If multiple networks were requested, please complete separate copies of this workbook"]
[]
[null,null,"Vendor Name"]
[null,null,"DPPO Primary Network"]
[null,null,"DPPO Alt Network",null,null,"(leave blank if not applicable)"]
[]
[null,"Required Tabs"]
[null,null,"There are separate tabs provided for the State's current DPPO and DHMO plans provider listings."]
[null,null,"Please complete the required fields within both of the tabs with the DPPO network included in your proposal"]
[]
[null,"Required Fields"]
[null,null,"All fields in each of the \"Provider Listing\" tabs must be completed (Columns $K-$M).  If an alternate network will be proposed, columns $N-$P must be completed as well."]
[null,null,null,{"$f":"\"1) \"&'DPPO Provider Listing'!$K$6","v":"1) Is this Provider contracted in network?\n(Y/D/N/E)"},null,null,null,"[See definitions below]"]
[null,null,null,{"$f":"\"2) \"&'DPPO Provider Listing'!$L$6","v":"2) Match Criteria "}]
[null,null,null,{"$f":"\"3) \"&'DPPO Provider Listing'!$M$6","v":"3) Additional comment (optional)"}]
[null,null,"Please enter this information for each row of data within the \"Provider Listing\" tabs, even if a provider with the same TIN and Address information is listed more than once."]
[]
[null,"Definitions"]
[null,null,"TIN - The 9-digit Federal Taxpayer Identification Number of the specific physician rendering the service, even if the physician is part of a larger group practice."]
[null,null,"NPI - The 10-digit National Provider Identification number for the physician rendering the service"]
[null,null,"Is this Provider contracted in network?"]
[null,null,"[Y] Provider is contracted with a proprietary contract with your network - This category reflects providers with whom you directly hold the contract via the network you are proposing.  This would NOT include any discounts tied to contracts via a third-party or via another network which you offer."]
[null,null,"[D] Provider is contracted in your network, but via a wrap or secondary network - This category would include discounts via rental networks, but also any discount not covered via the ongoing proprietary contract you hold with the provider (i.e. discounts via a “shared savings” program, or a second network you offer)."]
[null,null,"[N] Provider is not contracted in your network - This category should include ALL providers with whom you do not directly hold a contract (e.g. anesthesiologists, radiologists, or other hospital-based physicians if they are not separately contracted with you)."]
[null,null,"[E] Excluded from analysis - This indicator should be used when you were unable to determine if the provider is Y/N/D."]

{"sheet":"DPPO Provider Listing","index":1,"n_rows":5809,"n_cols":16,"rows_kept":5809,"cut":false,"hidden":false,"merged":[[4,10,4,12],[4,13,4,15],[1,1,1,4],[2,1,2,4],[3,1,3,4],[3,10,3,12],[3,13,3,15]]}
[]
[null,"The State of Delaware"]
[null,"DPPO Providers Utilized"]
[null,"INCURRED January 1, 2025 through December 31, 2025 and PAID from January 1, 2025 through current",null,null,null,"DO NOT SORT OR REORDER ANY OF THE ROWS BELOW",null,null,null,null,{"$f":"IF('Vendor Instructions'!$D$11=\"\",\"Vendor Name\",'Vendor Instructions'!$D$11)","v":"Vendor Name"},null,null,{"$f":"IF('Vendor Instructions'!$D$11=\"\",\"Vendor Name\",'Vendor Instructions'!$D$11)","v":"Vendor Name"}]
[null,null,null,null,null,null,null,null,null,null,{"$f":"IF('Vendor Instructions'!$D$12=\"\",\"DPPO Primary Network\",'Vendor Instructions'!$D$12)","v":"DPPO Primary Network"},null,null,{"$f":"IF('Vendor Instructions'!$D$13=\"\",\"DPPO Alt Network\",'Vendor Instructions'!$D$13)","v":"DPPO Alt Network"}]
[null,"Provider TIN","Provider NPI","Provider Name","Address where service was rendered","Address 2","City where service was rendered","State where \nservice was rendered","Zip code where \nservice was rendered","Coverage","Is this Provider contracted in network?\n(Y/D/N/E)","Match Criteria ","Additional comment (optional)","Is this Provider contracted in network?\n(Y/D/N/E)","Match Criteria","Additional comment (optional)"]
[null,271740902,1568598514,"AMIT P PATEL","60 WOLF CREEK BLVD","DOVER","DE",19901,"DENTAL","General Dentist"]
[null,510246944,1598057895,"HEATHER R BOYLE","385 SAULSBURY RD","DOVER","DE",19904,"DENTAL","General Dentist"]
[null,932235027,1326064932,"ROBERT W WEBSTER","1522 S STATE ST","DOVER","DE",19901,"DENTAL","General Dentist"]
[null,510266734,1972896322,"MICHAEL D KELLER","543 N SHIPLEY ST STE E","SEAFORD","DE",19973,"DENTAL","General Dentist"]
[null,831433343,1528409448,"JAE M GRYMES","625 N DUPONT BLVD","MILFORD","DE",19963,"DENTAL","Pediatric Dentist"]
[null,510255657,1194929836,"JULIE Q NIES","1380 S STATE ST","DOVER","DE",19901,"DENTAL","Pediatric Dentist"]
[null,510399899,1326205105,"MATTHEW L SEDA","250 BEISER BLVD STE 102","DOVER","DE",19904,"DENTAL","General Dentist"]
[null,510162936,1568629277,"MICHAEL JOHN NIES","27 DEAK DR","SMYRNA","DE",19977,"DENTAL","General Dentist"]
[null,842032097,1518462373,"WAYNE C THOMAS","1981 S STATE ST","DOVER","DE",19901,"DENTAL","General Dentist"]
[null,853656477,1447695127,"JEFFREY S BARTOSHESKY","10250 STONE CREEK DR UNIT 1","LAUREL","DE",19956,"DENTAL","General Dentist"]
[null,462158764,1528258779,"JESSICA  DICERBO DIPIETRO","18947 JOHN J WILLIAMS HWY UNIT 309","REHOBOTH BEACH","DE",19971,"DENTAL","Pediatric Dentist"]
[null,273034258,1740380849,"NORMAN S STEWARD","214 S WALNUT ST","MILFORD","DE",19963,"DENTAL","General Dentist"]
[null,510162936,1538276217,"DAVID R DEAKYNE","27 DEAK DR","SMYRNA","DE",19977,"DENTAL","General Dentist"]
[null,203723460,1881671493,"ALVIS D BURRIS","199 SOUTH ST","CAMDEN","DE",19934,"DENTAL","General Dentist"]
[null,272896503,1679613335,"LISA A FAGIOLETTI","25 W COMMERCE ST","SMYRNA","DE",19977,"DENTAL","General Dentist"]
[null,460826508,1508145970,"DANIEL J FAY","748 S NEW ST","DOVER","DE",19904,"DENTAL","General Dentist"]
[null,881009167,1245450774,"CONSTANTINE  PIPERIS","218 PENNSYLVANIA AVE","SEAFORD","DE",19973,"DENTAL","General Dentist"]
[null,510385838,1639225790,"BLAIR A JONES","34359 CARPENTERS WAY","LEWES","DE",19958,"DENTAL","General Dentist"]
[null,823910939,1164701033,"PHILLIP JAMES LOUIE","250 BEISER BLVD STE 101","DOVER","DE",19904,"DENTAL","Pediatric Dentist"]
[null,462158764,1891327466,"JEREMY  IRVING","18947 JOHN J WILLIAMS HWY UNIT 309","REHOBOTH BEACH","DE",19971,"DENTAL","Pediatric Dentist"]
[null,462158764,1891327466,"JEREMY  IRVING","51 FALLON AVE","SEAFORD","DE",19973,"DENTAL","Pediatric Dentist"]
[null,510367791,1700023165,"MICHAEL R BUTTERWORTH","31059 DUPONT BLVD","DAGSBORO","DE",19939,"DENTAL","General Dentist"]
[null,510385838,1235285149,"CHARLES J LABIN","34359 CARPENTERS WAY","LEWES","DE",19958,"DENTAL","General Dentist"]
[null,932235027,1366931073,"RYAN PATRICK ECKLEY","1522 S STATE ST","DOVER","DE",19901,"DENTAL","General Dentist"]
[null,510115432,1366657322,"ERIC S BALLIET","212 W MARKET ST","GEORGETOWN","DE",19947,"DENTAL","General Dentist"]
[null,510399899,1942396924,"DANIELLE L GERBER","250 BEISER BLVD STE 102","DOVER","DE",19904,"DENTAL","General Dentist"]
[null,510413028,1558473934,"KEVIN H BRAFMAN","31381 DOGWOOD ACRES DR","DAGSBORO","DE",19939,"DENTAL","General Dentist"]
[null,450518729,1285800524,"ANDREA N PUDDICOMBE","215 W LIBERTY WAY","MILFORD","DE",19963,"DENTAL","General Dentist"]
[null,270466764,1457406407,"JUNIOR  DOVER","1084 S STATE ST","DOVER","DE",19901,"DENTAL","General Dentist"]
[null,831433343,1568719003,"GERARDO  MARTINEZ","625 N DUPONT BLVD","MILFORD","DE",19963,"DENTAL","Pediatric Dentist"]
[null,450518729,1083961460,"HALLEH  ASADPOUR","215 W LIBERTY WAY","MILFORD","DE",19963,"DENTAL","General Dentist"]
[null,873845775,1598776460,"BRIAN A WISK","17 W GLENWOOD AVE","SMYRNA","DE",19977,"DENTAL","General Dentist"]
[null,510413028,1841302221,"WENDY  BRAFMAN","31381 DOGWOOD ACRES DR","DAGSBORO","DE",19939,"DENTAL","General Dentist"]
[null,450518729,1568802577,"PHILIP O SELS","215 W LIBERTY WAY","MILFORD","DE",19963,"DENTAL","General Dentist"]
[null,880714495,1932329612,"NAVID  ASGARI","909 N DUPONT BLVD","MILFORD","DE",19963,"DENTAL","General Dentist"]
[null,273034258,1952720260,"CANDACE L GAULL","214 S WALNUT ST","MILFORD","DE",19963,"DENTAL","General Dentist"]
[null,850849636,1881946333,"NANCY  PANCKO","20785 PROFESSIONAL PARK BLVD","GEORGETOWN","DE",19947,"DENTAL","Orthodontist"]
[null,204150838,1083922785,"MICHAEL C DUFFY","210 W PARK PL","NEWARK","DE",19711,"DENTAL","General Dentist"]
[null,208909361,1801005475,"JEFFREY M COOPER","18947 JOHN J WILLIAMS HWY UNIT 301","REHOBOTH BEACH","DE",19971,"DENTAL","General Dentist"]
[null,832041051,1730442252,"JITEN P PATEL","100 SUSSEX AVE","MILFORD","DE",19963,"DENTAL","General Dentist"]
[null,510376139,1154536464,"MICHAEL T ALOE","850 S STATE ST","DOVER","DE",19901,"DENTAL","Endodontist"]
[null,450518729,1053327593,"LUCINDA K BUNTING","215 W LIBERTY WAY","MILFORD","DE",19963,"DENTAL","General Dentist"]
[null,920779456,1386704815,"PAUL R CHRISTIAN","423 E MAIN ST","MIDDLETOWN","DE",19709,"DENTAL","General Dentist"]
[null,510385838,1588710404,"THOMAS  KUON","34359 CARPENTERS WAY","LEWES","DE",19958,"DENTAL","General Dentist"]
[null,510115432,1013569946,"JULIE  PARKER","212 W MARKET ST","GEORGETOWN","DE",19947,"DENTAL","General Dentist"]
[null,830399007,1295754505,"ROBERT R COOPE","1250 S GOVERNORS AVE","DOVER","DE",19904,"DENTAL","General Dentist"]
[null,271740902,1740704832,"VENKAT YASHASWI Y KONDAPALLI","60 WOLF CREEK BLVD","DOVER","DE",19901,"DENTAL","General Dentist"]
[null,208643759,1144462649,"FRANKLIN X PANCKO","1004 S STATE ST STE 1","DOVER","DE",19901,"DENTAL","Oral Surgeon"]
[null,203900082,1215947494,"TAURANCE  BISHOP","300 BIDDLE AVE STE 204","NEWARK","DE",19702,"DENTAL","General Dentist"]
[null,510376139,1346419546,"SUK-YOUNG Y CARR","850 S STATE ST","DOVER","DE",19901,"DENTAL","Endodontist"]
[null,202377988,1942318555,"JOSEPH C KELLY","2205 SILVERSIDE RD","WILMINGTON","DE",19810,"DENTAL","General Dentist"]
[null,450518729,1720446164,"MARA E SHINDELL","215 W LIBERTY WAY","MILFORD","DE",19963,"DENTAL","General Dentist"]
[null,203455344,1104955160,"RICHARD J TANANIS","12000 OLD VINE BLVD UNIT 112","LEWES","DE",19958,"DENTAL","General Dentist"]
[null,462752854,1992097307,"RYAN P ROBINSON","4901 LIMESTONE RD","WILMINGTON","DE",19808,"DENTAL","General Dentist"]
{"$rows_left_out":5750}
{"sheet":"DHMO Provider Listing","index":2,"n_rows":176,"n_cols":16,"rows_kept":176,"cut":false,"hidden":false,"merged":[[4,10,4,12],[4,13,4,15],[1,1,1,4],[2,1,2,4],[3,1,3,4],[3,10,3,12],[3,13,3,15]]}
[]
[null,"The State of Delaware"]
[null,"DHMO Providers Utilized"]
[null,"INCURRED January 1, 2025 through December 31, 2025 and PAID from January 1, 2025 through current",null,null,null,"DO NOT SORT OR REORDER ANY OF THE ROWS BELOW",null,null,null,null,{"$f":"IF('Vendor Instructions'!$D$11=\"\",\"Vendor Name\",'Vendor Instructions'!$D$11)","v":"Vendor Name"},null,null,{"$f":"IF('Vendor Instructions'!$D$11=\"\",\"Vendor Name\",'Vendor Instructions'!$D$11)","v":"Vendor Name"}]
[null,null,null,null,null,null,null,null,null,null,{"$f":"IF('Vendor Instructions'!$D$12=\"\",\"DPPO Primary Network\",'Vendor Instructions'!$D$12)","v":"DPPO Primary Network"},null,null,{"$f":"IF('Vendor Instructions'!$D$13=\"\",\"DPPO Alt Network\",'Vendor Instructions'!$D$13)","v":"DPPO Alt Network"}]
[null,"Provider TIN","Provider NPI","Provider Name","Address where service was rendered","Address 2","City where service was rendered","State where \nservice was rendered","Zip code where \nservice was rendered","Coverage","Is this Provider contracted in network?\n(Y/D/N/E)","Match Criteria ","Additional comment (optional)","Is this Provider contracted in network?\n(Y/D/N/E)","Match Criteria","Additional comment (optional)"]
[null,"271740902","1568598514","American Dental Care of Dover LLC","60 Wolf Creek Blvd","Dover","DE","19901","Dental","General Provider                   "]
[null,"881009167","1245450774","Constantine Piperis DDS PA","218 Pennsylvania Ave.","Seaford","DE","19973","Dental","General Provider                   "]
[null,"272896503","1679613335","Lisa A Fagioletti DMD LLC","25 W Commerce St","Smyrna","DE","19977","Dental","General Provider                   "]
[null,"880714495","1932329612","Milford Dental Center","909 N Dupont Hwy","Milford","DE","19963","Dental","General Provider                   "]
[null,"510398102","1184288581","Progressive Dental Arts","5301 Limestone Rd Suite","Wilmington","DE","19808","Dental","General Provider                   "]
[null,"472600937","1295969160","Cook Family Dentistry PA","12 Pennington Street Sui","Middletown","DE","19709","Dental","General Provider                   "]
[null,"510398102","1659833168","Progressive Dental Arts","685 E. Chestnut Hill Rd.","Newark","DE","19713","Dental","General Provider                   "]
[null,"463251811","1396880894","Southern Dental LLC","703 Health Services Dr S","Seaford","DE","19973","Dental","General Provider                   "]
[null,"463508754","1881722635","Rutledge Dental Associates","410 N. Cass St.","Middletown","DE","19709","Dental","General Provider                   "]
[null,"202289843","1891917266","Healthy Smiles of Delaware PA","1700 N Rodney St","Wilmington","DE","19806","Dental","General Provider                   "]
[null,"463251811","1134283963","Southern Dental LLC","703 Health Services Dr","Seaford","DE","19973","Dental","General Provider                   "]
[null,"463251811","1992020390","Southern Dental LLC","703 Health Services Dr","Seaford","DE","19973","Dental","General Provider                   "]
[null,"271740902","1447983523","American Dental Care of Dover LLC","60 Wolf Creek Blvd","Dover","DE","19901","Dental","General Provider                   "]
[null,"271740902","1740704832","American Dental Care of Dover LLC","60 Wolf Creek Blvd","Dover","DE","19901","Dental","General Provider                   "]
[null,"510361961","1083093603","New Concept Dental","2004 Foulk Rd. Suite 1","Wilmington","DE","19810","Dental","General Provider                   "]
[null,"271740902","1134571565","American Dental Care of Dover LLC","60 Wolf Creek Blvd","Dover","DE","19901","Dental","General Provider                   "]
[null,"460826508","1508145970","Daniel J Fay DMD PA","748 S New Street","Dover","DE","19904","Dental","General Provider                   "]
[null,"510398102","1760043079","Progressive Dental Arts","685 E. Chestnut Hill Rd.","Newark","DE","19713","Dental","General Provider                   "]
[null,"510122179","1396880894","Brown and Baran Family Dentistry","1601 Milltown Rd. Suite","Wilmington","DE","19808","Dental","General Provider                   "]
[null,"510122179","1134283963","Brown and Baran Family Dentistry","1601 Milltown Rd. Suite","Wilmington","DE","19808","Dental","General Provider                   "]
[null,"204150838","1083922785","Park Place Dental","210 West Park Place","Newark","DE","19711","Dental","General Provider                   "]
[null,"208643759","1033257530","First State Oral & Maxillofacial Surgery","1004 S State St Suite 1","Dover","DE","19901","Dental","Oral Surgeon                       "]
[null,"474948787","1881946333","Wilmington Orthodontic Center LLC","2300 Pennsylvania Ave Su","Wilmington","DE","19806","Dental","Orthodontist                       "]
[null,"510398102","1609457001","Progressive Dental Arts","685 E. Chestnut Hill Rd.","Newark","DE","19713","Dental","General Provider                   "]
[null,"232667609","1245285568","Herbert T Casalena DDS PA","2300 Pennsylvania Ave 6t","Wilmington","DE","19806","Dental","General Provider                   "]
[null,"800569484","1457565830","Dr. Jeffrey L. Cook","16 Peddlers Village","Christiana","DE","19702","Dental","General Provider                   "]
[null,"474948787","1881946333","Wilmington Orthodontic  Center","20785 Professional Park","Georgetown","DE","19947","Dental","Orthodontist                       "]
[null,"820740118","1104984582","Mid Atlantic Dental Partners","330 Christiana Medical C","Newark","DE","19702","Dental","General Provider                   "]
[null,"208643759","1144462649","First State Oral & Maxillofacial Surgery","1004 S State St Suite 1","Dover","DE","19901","Dental","Oral Surgeon                       "]
[null,"510361961","1467016279","New Concept Dental","2004 Foulk Rd. Suite 1","Wilmington","DE","19810","Dental","General Provider                   "]
[null,"510398102","1053466250","Progressive Dental Arts","42 Omega Dr Bldg H","Newark","DE","19713","Dental","General Provider                   "]
[null,"853088518","1629395264","Albanese Oral & Maxillofacial Surgery PLLC","300 Old Forge Ln Suite 3","Kennett Square","PA","19348","Dental","Oral Surgeon                       "]
[null,"463508754","1063540342","Rutledge Dental Associates","410 N. Cass St.","Middletown","DE","19709","Dental","General Provider                   "]
[null,"832045481","1215215652","Childrens Dental Health of Delaware LLC","3301 Lancaster Pike Unit","Wilmington","DE","19805","Dental","Pedodontist                        "]
[null,"820740118","1104984582","Mid Atlantic Dental Partners","P.O. Box 860036","Minneapolis","MN","55486","Dental","General Provider                   "]
[null,"262646682","1811059033","Braden Dental Of South Jersey","160 S Broadway","Pennsville","NJ","08070","Dental","General Provider                   "]
[null,"271742376","1235229428","Brandywine Dental Care","707 Foulk Rd Suite 201","Wilmington","DE","19803","Dental","General Provider                   "]
[null,"510398102","1760655930","Progressive Dental Arts","685 E. Chestnut Hill Rd.","Newark","DE","19713","Dental","General Provider                   "]
[null,"510398102","1730351172","Progressive Dental Arts","685 E. Chestnut Hill Rd.","Newark","DE","19713","Dental","General Provider                   "]
[null,"204879395","1467546556","Gentle Care Family Dentistry","2300 Pennsylvania Ave. U","Wilmington","DE","19806","Dental","General Provider                   "]
[null,"262566714","1205894789","Smyrna Dental Center","671 S Carter Rd. Ste. 13","Smyrna","DE","19977","Dental","General Provider                   "]
[null,"208643759","1144462649","First State Oral and Maxillofacial Surgery","9096 Riverside Dr Suite","Seaford","DE","19973","Dental","Oral Surgeon                       "]
[null,"510191513","1417083627","Oral & Maxillofacial Surgery Associates, P.A.","1304 North Broom Street","Wilmington","DE","19806","Dental","Oral Surgeon                       "]
[null,"832045481","1215215652","Childrens Dental Health of Delaware LLC","P.O. Box  820233 Suite 2","Philadelphia","PA","19182","Dental","Pedodontist                        "]
[null,"920779456","1386704815","Middletown Dental Care","423 E Main St","Middletown","DE","19709","Dental","General Provider                   "]
[null,"271740902","1457519712","American Dental Care of Dover LLC","60 Wolf Creek Blvd","Dover","DE","19901","Dental","General Provider                   "]
[null,"510376139","1154536464","MichaelAloe","850 S State Street","Dover","DE","19901","Dental","Endodontist                        "]
[null,"510361961","1821558677","New Concept Dental","2004 Foulk Rd. Suite 1","Wilmington","DE","19810","Dental","General Provider                   "]
[null,"208643759","1033257530","First State Oral and Maxillofacial Surgery","1004 S State St 1 Suite","Dover","DE","19901","Dental","Oral Surgeon                       "]
[null,"208643759","1679868095","First State Oral & Maxillofacial Surgery","1004 S State St Suite 1","Dover","DE","19901","Dental","Oral Surgeon                       "]
[null,"510191513","1417083627","Oral & Maxillofacial Surgery Associates, P.A.","Oral Maxillofacial Surg","Wilmington","DE","19806","Dental","Oral Surgeon                       "]
[null,"464244840","1306100607","Delaware Dental Solutions","131 Becks Woods Drive","Bear","DE","19701","Dental","General Provider                   "]
[null,"833246828","1285150003","Brandywine Pediatric Dentistry PA","2000 Foulk Road Ste C","Wilmington","DE","19810","Dental","Pedodontist                        "]
[null,"273764920","1710191697","Centre for Cosmetic Dentistry","275 Wilmington Westchest","Chadds Ford","PA","19317","Dental","General Provider                   "]
{"$rows_left_out":117}
{"sheet":"Field List","index":3,"n_rows":12,"n_cols":10,"rows_kept":12,"cut":false,"hidden":true,"merged":[]}
[]
["MedicalT","Provider TIN","Provider NPI","Provider Name","Address where service was rendered","City where service was rendered","State where \nservice was rendered","Zip code where \nservice was rendered","Physician or \nFacility","Provider Type / Specialty"]
["Medical1",123456789,1234567890,"ABC GENERAL HOSPITAL","6065 CENTRAL AVENUE","PORT CHARLES","NY","01234","FACILITY","GENERAL ACUTE-CARE HOSPITAL"]
["Medical2",234567890,9876543210,"GREGORY HOUSE M.D.","221B BAKER ST","PRINCETON","NJ",12345,"PHYSICIAN","INTERNAL MEDICINE"]
[]
["DentalT","Provider TIN","Provider NPI","Provider Name","Address where service was rendered","City where service was rendered","State where \nservice was rendered","Zip code where \nservice was rendered","Coverage","Provider Type / Specialty"]
["Dental1",123456789,1234567890,"NOVA KANE, DDS","555 E CHOCOLATE AVE #101","HERSHEY","PA","01234","DENTAL","GENERAL DENTIST"]
["Dental2",234567890,9876543210,"BRACE YOURSELF ORTHODONTIA","123 BRIDGE STREET","BAYSIDE","CA",12345,"DENTAL","ORTHODONTIA"]
[]
["VisionT","Provider TIN","Provider NPI","Provider Name","Address where service was rendered","City where service was rendered","State where \nservice was rendered","Zip code where \nservice was rendered","Coverage","Provider Type / Specialty"]
["Vision1",123456789,1234567890,"J. QUINCY MAGOO, OD","1 W 2ND STREET","FREDERICK","MD","01234","VISION","OPTOMETRIST"]
["Vision2",234567890,9876543210,"FRANLKIN BIFOCALS","300 MARKET STREET","PHILADELPHIA","PA",12345,"VISION","OPTICIAN"]