{"text_format":"1","workbook":"xlsx","n_sheets":6,"sheets":["Vendor Instructions","Employee Counts","Access - With","Access - Without","Distance - With","Distance - Without"],"not_rendered":{"charts":0,"images":0,"macros":1,"external_links":0,"defined_names":13,"comments":0,"pivot_tables":0},"unopened":[],"bounds":{"document_bytes":16777216,"sheet_cells":100000,"rows_first":2000,"rows_last":500,"rows_between":2000,"halvings":0,"cell_chars":16384,"cell_head_chars":4096},"cells_cut":0,"cells_raw":0,"read":"whole","date_system":"1900"}

{"sheet":"Vendor Instructions","index":0,"n_rows":39,"n_cols":4,"rows_kept":39,"cut":false,"hidden":false,"merged":[[1,1,1,9]]}
[]
[null,"GeoAccess Reporting Template"]
[]
[]
[null,"Step 1: Basic information"]
[null,null,"Enter the name of your organization and (if applicable) the name of the network being analyzed"]
[null,null,"If multiple networks were requested, please complete separate copies of this workbook"]
[]
[null,null,"Vendor Name","[Enter vendor name here]"]
[null,null,"Network Name","[Enter network name here]"]
[]
[null,"Step 2: Validate EE Counts"]
[null,null,"In column $C, we have pre-populated the number of covered employees per zip code"]
[null,null,"Note: We are no longer indicating which class (U/S/R) each zip code is in.  Please use the full census for all access standards."]
[null,null,"In column $D, please confirm the number of employees actually used in your analysis."]
[null,null,"(for example, you may enter '0' if the zip code was found to be invalid)"]
[null,null,"If your totals differ from column $C, you may provide commentary in the spaces provided"]
[]
[1,{"$f":"IF(A19=1,\"Step \"&2+A19&\": Number of employees WITH Access\",\"[HIDE]\")","v":"Step 3: Number of employees WITH Access"}]
[1,null,"Please enter the number of employees with access to each provider within the specified range"]
{"$rows_left_out":20}
{"sheet":"Employee Counts","index":1,"n_rows":2221,"n_cols":7,"rows_kept":2221,"cut":false,"hidden":false,"merged":[[1,1,1,4],[2,1,2,4]]}
[null,null,null,null,null,null,"Vendor Comment"]
[null,"State of Delaware"]
[null,{"$f":"IF('Vendor Instructions'!$D$9=\"\",\"Vendor Name\",'Vendor Instructions'!$D$9)&\"-\"&IF('Vendor Instructions'!$D$10=\"\",\"Vendor Name\",'Vendor Instructions'!$D$10)","v":"[Enter vendor name here]-[Enter network name here]"}]
[]
[null,"In column $C, we have pre-populated the number of covered employees per zip code"]
[null,"Note: We are no longer indicating which class (U/S/R) each zip code is in.  Please use the full census for all access standards."]
[null,"In column $D, please confirm the number of employees actually used in your analysis."]
[null,"(for example, you may enter '0' if the zip code was found to be invalid)"]
[null,"If your totals differ from column $C, you may provide commentary in the spaces provided"]
[null,"ZIP Code","Employees\nProvided","Employees\nUsed by Vendor","Vendor Comment"]
[1,19904,2342]
[2,19901,1785]
[3,19720,1703]
[4,19977,1660]
[5,19709,1553]
[6,19711,1509]
[7,19966,1426]
[8,19958,1415]
[9,19963,1364]
[10,19702,1320]
{"$rows_left_out":2202}
{"sheet":"Access - With","index":2,"n_rows":2221,"n_cols":33,"rows_kept":2221,"cut":false,"hidden":false,"merged":[[8,30,8,32],[8,27,8,29],[6,6,6,8],[6,3,6,5],[6,9,6,11],[8,21,8,23],[8,24,8,26],[8,18,8,20],[6,12,6,14],[6,15,6,17]]}
[null,null,{"$f":"SUM(C11:C2221)","v":43197},{"$f":"IF(D6=\"HIDE\",\"\",SUM(D11:D2221))","v":0},0,0,0,0,0,0,0,0,0,0,0,0,0,0,"","","","","","","","","","","","","","",""]
[null,"State of Delaware",null,"Please enter the number of employees with access to each provider within the specified range"]
[null,{"$f":"IF('Vendor Instructions'!$D$9=\"\",\"Vendor Name\",'Vendor Instructions'!$D$9)&\"-\"&IF('Vendor Instructions'!$D$10=\"\",\"Vendor Name\",'Vendor Instructions'!$D$10)","v":"[Enter vendor name here]-[Enter network name here]"},null,"For example, \"2 in 10\" means the number of employees with at least 2 providers of a given type within a 10 miles drive"]
[null,null,null,"Provide a numeric (non percentage) response to all columns requested"]
[]
[null,null,null,null,null,null,null,null,null,null,null,null,null,null,null,null,null,null,"HIDE","HIDE","HIDE","HIDE","HIDE","HIDE","HIDE","HIDE","HIDE","HIDE","HIDE","HIDE","HIDE","HIDE","HIDE"]
[null,null,"Provider Type","[DEN] General Dentists",null,null,"[DEN] Endodontists",null,null,"[DEN] Oral Surgeons",null,null,"[DEN] Periodontists",null,null,"[DEN] Orthodontists"]
[null,null,"Access Standard","3 in 5","2 in 10","2 in 15","2 in 10","2 in 15","2 in 20","2 in 10","2 in 15","2 in 20","2 in 10","2 in 15","2 in 20","2 in 10","2 in 15","2 in 20"]
[null,null,"Accepting New Patients?","Yes",null,null,"Yes",null,null,"Yes",null,null,"Yes",null,null,"Yes"]
[null,"Zip Code","EEs Provided"]
[{"$error":"#N/A"},19904,2342]
[{"$error":"#N/A"},19901,1785]
[{"$error":"#N/A"},19720,1703]
[{"$error":"#N/A"},19977,1660]
[{"$error":"#N/A"},19709,1553]
[{"$error":"#N/A"},19711,1509]
[{"$error":"#N/A"},19966,1426]
[{"$error":"#N/A"},19958,1415]
[{"$error":"#N/A"},19963,1364]
[{"$error":"#N/A"},19702,1320]
{"$rows_left_out":2202}
{"sheet":"Access - Without","index":3,"n_rows":2221,"n_cols":33,"rows_kept":2221,"cut":false,"hidden":false,"merged":[[8,21,8,23],[8,24,8,26],[8,27,8,29],[8,30,8,32],[8,18,8,20],[6,3,6,5],[6,6,6,8],[6,9,6,11],[6,12,6,14],[6,15,6,17]]}
[null,null,{"$f":"SUM(C11:C2221)","v":43197},{"$f":"IF(D6=\"HIDE\",\"\",SUMPRODUCT('Employee Counts'!$D10:$D2221-'Access - With'!D$11:D$2221,'Distance - Without'!D$11:D$2221))","v":{"$error":"#VALUE!"}},{"$f":"IF(E6=\"HIDE\",\"\",SUMPRODUCT('Employee Counts'!$D10:$D2221-'Access - With'!E$11:E$2221,'Distance - Without'!E$11:E$2221))","v":{"$error":"#VALUE!"}},{"$f":"IF(F6=\"HIDE\",\"\",SUMPRODUCT('Employee Counts'!$D10:$D2221-'Access - With'!F$11:F$2221,'Distance - Without'!F$11:F$2221))","v":{"$error":"#VALUE!"}},{"$f":"IF(G6=\"HIDE\",\"\",SUMPRODUCT('Employee Counts'!$D10:$D2221-'Access - With'!G$11:G$2221,'Distance - Without'!G$11:G$2221))","v":{"$error":"#VALUE!"}},{"$f":"IF(H6=\"HIDE\",\"\",SUMPRODUCT('Employee Counts'!$D10:$D2221-'Access - With'!H$11:H$2221,'Distance - Without'!H$11:H$2221))","v":{"$error":"#VALUE!"}},{"$f":"IF(I6=\"HIDE\",\"\",SUMPRODUCT('Employee Counts'!$D10:$D2221-'Access - With'!I$11:I$2221,'Distance - Without'!I$11:I$2221))","v":{"$error":"#VALUE!"}},{"$f":"IF(J6=\"HIDE\",\"\",SUMPRODUCT('Employee Counts'!$D10:$D2221-'Access - With'!J$11:J$2221,'Distance - Without'!J$11:J$2221))","v":{"$error":"#VALUE!"}},{"$f":"IF(K6=\"HIDE\",\"\",SUMPRODUCT('Employee Counts'!$D10:$D2221-'Access - With'!K$11:K$2221,'Distance - Without'!K$11:K$2221))","v":{"$error":"#VALUE!"}},{"$f":"IF(L6=\"HIDE\",\"\",SUMPRODUCT('Employee Counts'!$D10:$D2221-'Access - With'!L$11:L$2221,'Distance - Without'!L$11:L$2221))","v":{"$error":"#VALUE!"}},{"$f":"IF(M6=\"HIDE\",\"\",SUMPRODUCT('Employee Counts'!$D10:$D2221-'Access - With'!M$11:M$2221,'Distance - Without'!M$11:M$2221))","v":{"$error":"#VALUE!"}},{"$f":"IF(N6=\"HIDE\",\"\",SUMPRODUCT('Employee Counts'!$D10:$D2221-'Access - With'!N$11:N$2221,'Distance - Without'!N$11:N$2221))","v":{"$error":"#VALUE!"}},{"$f":"IF(O6=\"HIDE\",\"\",SUMPRODUCT('Employee Counts'!$D10:$D2221-'Access - With'!O$11:O$2221,'Distance - Without'!O$11:O$2221))","v":{"$error":"#VALUE!"}},{"$f":"IF(P6=\"HIDE\",\"\",SUMPRODUCT('Employee Counts'!$D10:$D2221-'Access - With'!P$11:P$2221,'Distance - Without'!P$11:P$2221))","v":{"$error":"#VALUE!"}},{"$f":"IF(Q6=\"HIDE\",\"\",SUMPRODUCT('Employee Counts'!$D10:$D2221-'Access - With'!Q$11:Q$2221,'Distance - Without'!Q$11:Q$2221))","v":{"$error":"#VALUE!"}},{"$f":"IF(R6=\"HIDE\",\"\",SUMPRODUCT('Employee Counts'!$D10:$D2221-'Access - With'!R$11:R$2221,'Distance - Without'!R$11:R$2221))","v":{"$error":"#VALUE!"}},{"$f":"IF(S6=\"HIDE\",\"\",SUMPRODUCT('Employee Counts'!$D10:$D2221-'Access - With'!S$11:S$2221,'Distance - Without'!S$11:S$2221))","v":""},{"$f":"IF(T6=\"HIDE\",\"\",SUMPRODUCT('Employee Counts'!$D10:$D2221-'Access - With'!T$11:T$2221,'Distance - Without'!T$11:T$2221))","v":""},{"$f":"IF(U6=\"HIDE\",\"\",SUMPRODUCT('Employee Counts'!$D10:$D2221-'Access - With'!U$11:U$2221,'Distance - Without'!U$11:U$2221))","v":""},{"$f":"IF(V6=\"HIDE\",\"\",SUMPRODUCT('Employee Counts'!$D10:$D2221-'Access - With'!V$11:V$2221,'Distance - Without'!V$11:V$2221))","v":""},{"$f":"IF(W6=\"HIDE\",\"\",SUMPRODUCT('Employee Counts'!$D10:$D2221-'Access - With'!W$11:W$2221,'Distance - Without'!W$11:W$2221))","v":""},{"$f":"IF(X6=\"HIDE\",\"\",SUMPRODUCT('Employee Counts'!$D10:$D2221-'Access - With'!X$11:X$2221,'Distance - Without'!X$11:X$2221))","v":""},{"$f":"IF(Y6=\"HIDE\",\"\",SUMPRODUCT('Employee Counts'!$D10:$D2221-'Access - With'!Y$11:Y$2221,'Distance - Without'!Y$11:Y$2221))","v":""},{"$f":"IF(Z6=\"HIDE\",\"\",SUMPRODUCT('Employee Counts'!$D10:$D2221-'Access - With'!Z$11:Z$2221,'Distance - Without'!Z$11:Z$2221))","v":""},{"$f":"IF(AA6=\"HIDE\",\"\",SUMPRODUCT('Employee Counts'!$D10:$D2221-'Access - With'!AA$11:AA$2221,'Distance - Without'!AA$11:AA$2221))","v":""},{"$f":"IF(AB6=\"HIDE\",\"\",SUMPRODUCT('Employee Counts'!$D10:$D2221-'Access - With'!AB$11:AB$2221,'Distance - Without'!AB$11:AB$2221))","v":""},{"$f":"IF(AC6=\"HIDE\",\"\",SUMPRODUCT('Employee Counts'!$D10:$D2221-'Access - With'!AC$11:AC$2221,'Distance - Without'!AC$11:AC$2221))","v":""},{"$f":"IF(AD6=\"HIDE\",\"\",SUMPRODUCT('Employee Counts'!$D10:$D2221-'Access - With'!AD$11:AD$2221,'Distance - Without'!AD$11:AD$2221))","v":""},{"$f":"IF(AE6=\"HIDE\",\"\",SUMPRODUCT('Employee Counts'!$D10:$D2221-'Access - With'!AE$11:AE$2221,'Distance - Without'!AE$11:AE$2221))","v":""},{"$f":"IF(AF6=\"HIDE\",\"\",SUMPRODUCT('Employee Counts'!$D10:$D2221-'Access - With'!AF$11:AF$2221,'Distance - Without'!AF$11:AF$2221))","v":""},{"$f":"IF(AG6=\"HIDE\",\"\",SUMPRODUCT('Employee Counts'!$D10:$D2221-'Access - With'!AG$11:AG$2221,'Distance - Without'!AG$11:AG$2221))","v":""}]
[null,"State of Delaware",null,"Please enter the number of employees without access to each provider within the specified range"]
[null,{"$f":"IF('Vendor Instructions'!$D$9=\"\",\"Vendor Name\",'Vendor Instructions'!$D$9)&\"-\"&IF('Vendor Instructions'!$D$10=\"\",\"Vendor Name\",'Vendor Instructions'!$D$10)","v":"[Enter vendor name here]-[Enter network name here]"},null,"For example, \"2 in 10\" means the number of employees without at least 2 providers of a given type within a 10 miles drive"]
[null,null,null,"Provide a numeric (non percentage) response to all columns requested"]
[]
[null,null,null,null,null,null,null,null,null,null,null,null,null,null,null,null,null,null,"HIDE","HIDE","HIDE","HIDE","HIDE","HIDE","HIDE","HIDE","HIDE","HIDE","HIDE","HIDE","HIDE","HIDE","HIDE"]
[null,null,"Provider Type","[DEN] General Dentists",null,null,"[DEN] Endodontists",null,null,"[DEN] Oral Surgeons",null,null,"[DEN] Periodontists",null,null,"[DEN] Orthodontists"]
[null,null,"Access Standard","3 in 5","2 in 10","2 in 15","2 in 10","2 in 15","2 in 20","2 in 10","2 in 15","2 in 20","2 in 10","2 in 15","2 in 20","2 in 10","2 in 15","2 in 20"]
[null,null,"Accepting New Patients?","Yes",null,null,"Yes",null,null,"Yes",null,null,"Yes",null,null,"Yes"]
[null,"Zip Code","EEs Provided"]
[{"$error":"#N/A"},19904,2342]
[{"$error":"#N/A"},19901,1785]
[{"$error":"#N/A"},19720,1703]
[{"$error":"#N/A"},19977,1660]
[{"$error":"#N/A"},19709,1553]
[{"$error":"#N/A"},19711,1509]
[{"$error":"#N/A"},19966,1426]
[{"$error":"#N/A"},19958,1415]
[{"$error":"#N/A"},19963,1364]
[{"$error":"#N/A"},19702,1320]
{"$rows_left_out":2202}
{"sheet":"Distance - With","index":4,"n_rows":2221,"n_cols":33,"rows_kept":2221,"cut":false,"hidden":false,"merged":[[8,21,8,23],[8,24,8,26],[8,27,8,29],[8,30,8,32],[8,18,8,20],[6,3,6,5],[6,6,6,8],[6,9,6,11],[6,12,6,14],[6,15,6,17]]}
[null,null,{"$f":"SUM(C11:C42211)","v":43197},{"$f":"IF(D6=\"HIDE\",\"\",SUMPRODUCT('Access - With'!D$11:D$2221,D$11:D$2221)/SUM('Access - With'!D$11:D$2221))","v":{"$error":"#DIV/0!"}},{"$f":"IF(E6=\"HIDE\",\"\",SUMPRODUCT('Access - With'!E$11:E$2221,E$11:E$2221)/SUM('Access - With'!E$11:E$2221))","v":{"$error":"#DIV/0!"}},{"$f":"IF(F6=\"HIDE\",\"\",SUMPRODUCT('Access - With'!F$11:F$2221,F$11:F$2221)/SUM('Access - With'!F$11:F$2221))","v":{"$error":"#DIV/0!"}},{"$f":"IF(G6=\"HIDE\",\"\",SUMPRODUCT('Access - With'!G$11:G$2221,G$11:G$2221)/SUM('Access - With'!G$11:G$2221))","v":{"$error":"#DIV/0!"}},{"$f":"IF(H6=\"HIDE\",\"\",SUMPRODUCT('Access - With'!H$11:H$2221,H$11:H$2221)/SUM('Access - With'!H$11:H$2221))","v":{"$error":"#DIV/0!"}},{"$f":"IF(I6=\"HIDE\",\"\",SUMPRODUCT('Access - With'!I$11:I$2221,I$11:I$2221)/SUM('Access - With'!I$11:I$2221))","v":{"$error":"#DIV/0!"}},{"$f":"IF(J6=\"HIDE\",\"\",SUMPRODUCT('Access - With'!J$11:J$2221,J$11:J$2221)/SUM('Access - With'!J$11:J$2221))","v":{"$error":"#DIV/0!"}},{"$f":"IF(K6=\"HIDE\",\"\",SUMPRODUCT('Access - With'!K$11:K$2221,K$11:K$2221)/SUM('Access - With'!K$11:K$2221))","v":{"$error":"#DIV/0!"}},{"$f":"IF(L6=\"HIDE\",\"\",SUMPRODUCT('Access - With'!L$11:L$2221,L$11:L$2221)/SUM('Access - With'!L$11:L$2221))","v":{"$error":"#DIV/0!"}},{"$f":"IF(M6=\"HIDE\",\"\",SUMPRODUCT('Access - With'!M$11:M$2221,M$11:M$2221)/SUM('Access - With'!M$11:M$2221))","v":{"$error":"#DIV/0!"}},{"$f":"IF(N6=\"HIDE\",\"\",SUMPRODUCT('Access - With'!N$11:N$2221,N$11:N$2221)/SUM('Access - With'!N$11:N$2221))","v":{"$error":"#DIV/0!"}},{"$f":"IF(O6=\"HIDE\",\"\",SUMPRODUCT('Access - With'!O$11:O$2221,O$11:O$2221)/SUM('Access - With'!O$11:O$2221))","v":{"$error":"#DIV/0!"}},{"$f":"IF(P6=\"HIDE\",\"\",SUMPRODUCT('Access - With'!P$11:P$2221,P$11:P$2221)/SUM('Access - With'!P$11:P$2221))","v":{"$error":"#DIV/0!"}},{"$f":"IF(Q6=\"HIDE\",\"\",SUMPRODUCT('Access - With'!Q$11:Q$2221,Q$11:Q$2221)/SUM('Access - With'!Q$11:Q$2221))","v":{"$error":"#DIV/0!"}},{"$f":"IF(R6=\"HIDE\",\"\",SUMPRODUCT('Access - With'!R$11:R$2221,R$11:R$2221)/SUM('Access - With'!R$11:R$2221))","v":{"$error":"#DIV/0!"}},{"$f":"IF(S6=\"HIDE\",\"\",SUMPRODUCT('Access - With'!S$11:S$2221,S$11:S$2221)/SUM('Access - With'!S$11:S$2221))","v":""},{"$f":"IF(T6=\"HIDE\",\"\",SUMPRODUCT('Access - With'!T$11:T$2221,T$11:T$2221)/SUM('Access - With'!T$11:T$2221))","v":""},{"$f":"IF(U6=\"HIDE\",\"\",SUMPRODUCT('Access - With'!U$11:U$2221,U$11:U$2221)/SUM('Access - With'!U$11:U$2221))","v":""},{"$f":"IF(V6=\"HIDE\",\"\",SUMPRODUCT('Access - With'!V$11:V$2221,V$11:V$2221)/SUM('Access - With'!V$11:V$2221))","v":""},{"$f":"IF(W6=\"HIDE\",\"\",SUMPRODUCT('Access - With'!W$11:W$2221,W$11:W$2221)/SUM('Access - With'!W$11:W$2221))","v":""},{"$f":"IF(X6=\"HIDE\",\"\",SUMPRODUCT('Access - With'!X$11:X$2221,X$11:X$2221)/SUM('Access - With'!X$11:X$2221))","v":""},{"$f":"IF(Y6=\"HIDE\",\"\",SUMPRODUCT('Access - With'!Y$11:Y$2221,Y$11:Y$2221)/SUM('Access - With'!Y$11:Y$2221))","v":""},{"$f":"IF(Z6=\"HIDE\",\"\",SUMPRODUCT('Access - With'!Z$11:Z$2221,Z$11:Z$2221)/SUM('Access - With'!Z$11:Z$2221))","v":""},{"$f":"IF(AA6=\"HIDE\",\"\",SUMPRODUCT('Access - With'!AA$11:AA$2221,AA$11:AA$2221)/SUM('Access - With'!AA$11:AA$2221))","v":""},{"$f":"IF(AB6=\"HIDE\",\"\",SUMPRODUCT('Access - With'!AB$11:AB$2221,AB$11:AB$2221)/SUM('Access - With'!AB$11:AB$2221))","v":""},{"$f":"IF(AC6=\"HIDE\",\"\",SUMPRODUCT('Access - With'!AC$11:AC$2221,AC$11:AC$2221)/SUM('Access - With'!AC$11:AC$2221))","v":""},{"$f":"IF(AD6=\"HIDE\",\"\",SUMPRODUCT('Access - With'!AD$11:AD$2221,AD$11:AD$2221)/SUM('Access - With'!AD$11:AD$2221))","v":""},{"$f":"IF(AE6=\"HIDE\",\"\",SUMPRODUCT('Access - With'!AE$11:AE$2221,AE$11:AE$2221)/SUM('Access - With'!AE$11:AE$2221))","v":""},{"$f":"IF(AF6=\"HIDE\",\"\",SUMPRODUCT('Access - With'!AF$11:AF$2221,AF$11:AF$2221)/SUM('Access - With'!AF$11:AF$2221))","v":""},{"$f":"IF(AG6=\"HIDE\",\"\",SUMPRODUCT('Access - With'!AG$11:AG$2221,AG$11:AG$2221)/SUM('Access - With'!AG$11:AG$2221))","v":""}]
[null,"State of Delaware",null,"Provide the average driving distance to the indicated number of providers for employees who do not meet the access standards"]
[null,{"$f":"IF('Vendor Instructions'!$D$9=\"\",\"Vendor Name\",'Vendor Instructions'!$D$9)&\"-\"&IF('Vendor Instructions'!$D$10=\"\",\"Vendor Name\",'Vendor Instructions'!$D$10)","v":"[Enter vendor name here]-[Enter network name here]"},null,"For example, \"2 in 10\" means the average driving distance (among employees with at least 2 providers within 10 miles) to reach their 2nd nearest in-network provider"]
[null,null,null,"Provide a numeric (in miles) response to all columns requested (apply the full census to each access standard)"]
[null,null,null,"You may leave cells blank if all employees live within the defined access standard"]
[null,null,null,null,null,null,null,null,null,null,null,null,null,null,null,null,null,null,"HIDE","HIDE","HIDE","HIDE","HIDE","HIDE","HIDE","HIDE","HIDE","HIDE","HIDE","HIDE","HIDE","HIDE","HIDE"]
[null,null,"Provider Type","[DEN] General Dentists",null,null,"[DEN] Endodontists",null,null,"[DEN] Oral Surgeons",null,null,"[DEN] Periodontists",null,null,"[DEN] Orthodontists"]
[null,null,"Access Standard","3 in 5","2 in 10","2 in 15","2 in 10","2 in 15","2 in 20","2 in 10","2 in 15","2 in 20","2 in 10","2 in 15","2 in 20","2 in 10","2 in 15","2 in 20"]
[null,null,"Accepting New Patients?","Yes",null,null,"Yes",null,null,"Yes",null,null,"Yes",null,null,"Yes"]
[null,"Zip Code","EEs Provided"]
[{"$error":"#N/A"},19904,2342]
[{"$error":"#N/A"},19901,1785]
[{"$error":"#N/A"},19720,1703]
[{"$error":"#N/A"},19977,1660]
[{"$error":"#N/A"},19709,1553]
[{"$error":"#N/A"},19711,1509]
[{"$error":"#N/A"},19966,1426]
[{"$error":"#N/A"},19958,1415]
[{"$error":"#N/A"},19963,1364]
[{"$error":"#N/A"},19702,1320]
{"$rows_left_out":2202}
{"sheet":"Distance - Without","index":5,"n_rows":2221,"n_cols":33,"rows_kept":2221,"cut":false,"hidden":false,"merged":[[8,21,8,23],[8,24,8,26],[8,27,8,29],[8,30,8,32],[8,18,8,20],[6,3,6,5],[6,6,6,8],[6,9,6,11],[6,12,6,14],[6,15,6,17]]}
[null,null,{"$f":"SUM(C11:C42211)","v":43197},{"$f":"IF(D6=\"HIDE\",\"\",SUMPRODUCT('Employee Counts'!$D10:$D2221-'Access - With'!D$11:D$2221,D$11:D$2221)/($C1-'Access - With'!D$1))","v":{"$error":"#VALUE!"}},{"$f":"IF(E6=\"HIDE\",\"\",SUMPRODUCT('Employee Counts'!$D10:$D2221-'Access - With'!E$11:E$2221,E$11:E$2221)/($C1-'Access - With'!E$1))","v":{"$error":"#VALUE!"}},{"$f":"IF(F6=\"HIDE\",\"\",SUMPRODUCT('Employee Counts'!$D10:$D2221-'Access - With'!F$11:F$2221,F$11:F$2221)/($C1-'Access - With'!F$1))","v":{"$error":"#VALUE!"}},{"$f":"IF(G6=\"HIDE\",\"\",SUMPRODUCT('Employee Counts'!$D10:$D2221-'Access - With'!G$11:G$2221,G$11:G$2221)/($C1-'Access - With'!G$1))","v":{"$error":"#VALUE!"}},{"$f":"IF(H6=\"HIDE\",\"\",SUMPRODUCT('Employee Counts'!$D10:$D2221-'Access - With'!H$11:H$2221,H$11:H$2221)/($C1-'Access - With'!H$1))","v":{"$error":"#VALUE!"}},{"$f":"IF(I6=\"HIDE\",\"\",SUMPRODUCT('Employee Counts'!$D10:$D2221-'Access - With'!I$11:I$2221,I$11:I$2221)/($C1-'Access - With'!I$1))","v":{"$error":"#VALUE!"}},{"$f":"IF(J6=\"HIDE\",\"\",SUMPRODUCT('Employee Counts'!$D10:$D2221-'Access - With'!J$11:J$2221,J$11:J$2221)/($C1-'Access - With'!J$1))","v":{"$error":"#VALUE!"}},{"$f":"IF(K6=\"HIDE\",\"\",SUMPRODUCT('Employee Counts'!$D10:$D2221-'Access - With'!K$11:K$2221,K$11:K$2221)/($C1-'Access - With'!K$1))","v":{"$error":"#VALUE!"}},{"$f":"IF(L6=\"HIDE\",\"\",SUMPRODUCT('Employee Counts'!$D10:$D2221-'Access - With'!L$11:L$2221,L$11:L$2221)/($C1-'Access - With'!L$1))","v":{"$error":"#VALUE!"}},{"$f":"IF(M6=\"HIDE\",\"\",SUMPRODUCT('Employee Counts'!$D10:$D2221-'Access - With'!M$11:M$2221,M$11:M$2221)/($C1-'Access - With'!M$1))","v":{"$error":"#VALUE!"}},{"$f":"IF(N6=\"HIDE\",\"\",SUMPRODUCT('Employee Counts'!$D10:$D2221-'Access - With'!N$11:N$2221,N$11:N$2221)/($C1-'Access - With'!N$1))","v":{"$error":"#VALUE!"}},{"$f":"IF(O6=\"HIDE\",\"\",SUMPRODUCT('Employee Counts'!$D10:$D2221-'Access - With'!O$11:O$2221,O$11:O$2221)/($C1-'Access - With'!O$1))","v":{"$error":"#VALUE!"}},{"$f":"IF(P6=\"HIDE\",\"\",SUMPRODUCT('Employee Counts'!$D10:$D2221-'Access - With'!P$11:P$2221,P$11:P$2221)/($C1-'Access - With'!P$1))","v":{"$error":"#VALUE!"}},{"$f":"IF(Q6=\"HIDE\",\"\",SUMPRODUCT('Employee Counts'!$D10:$D2221-'Access - With'!Q$11:Q$2221,Q$11:Q$2221)/($C1-'Access - With'!Q$1))","v":{"$error":"#VALUE!"}},{"$f":"IF(R6=\"HIDE\",\"\",SUMPRODUCT('Employee Counts'!$D10:$D2221-'Access - With'!R$11:R$2221,R$11:R$2221)/($C1-'Access - With'!R$1))","v":{"$error":"#VALUE!"}},{"$f":"IF(S6=\"HIDE\",\"\",SUMPRODUCT('Employee Counts'!$D10:$D2221-'Access - With'!S$11:S$2221,S$11:S$2221)/($C1-'Access - With'!S$1))","v":""},{"$f":"IF(T6=\"HIDE\",\"\",SUMPRODUCT('Employee Counts'!$D10:$D2221-'Access - With'!T$11:T$2221,T$11:T$2221)/($C1-'Access - With'!T$1))","v":""},{"$f":"IF(U6=\"HIDE\",\"\",SUMPRODUCT('Employee Counts'!$D10:$D2221-'Access - With'!U$11:U$2221,U$11:U$2221)/($C1-'Access - With'!U$1))","v":""},{"$f":"IF(V6=\"HIDE\",\"\",SUMPRODUCT('Employee Counts'!$D10:$D2221-'Access - With'!V$11:V$2221,V$11:V$2221)/($C1-'Access - With'!V$1))","v":""},{"$f":"IF(W6=\"HIDE\",\"\",SUMPRODUCT('Employee Counts'!$D10:$D2221-'Access - With'!W$11:W$2221,W$11:W$2221)/($C1-'Access - With'!W$1))","v":""},{"$f":"IF(X6=\"HIDE\",\"\",SUMPRODUCT('Employee Counts'!$D10:$D2221-'Access - With'!X$11:X$2221,X$11:X$2221)/($C1-'Access - With'!X$1))","v":""},{"$f":"IF(Y6=\"HIDE\",\"\",SUMPRODUCT('Employee Counts'!$D10:$D2221-'Access - With'!Y$11:Y$2221,Y$11:Y$2221)/($C1-'Access - With'!Y$1))","v":""},{"$f":"IF(Z6=\"HIDE\",\"\",SUMPRODUCT('Employee Counts'!$D10:$D2221-'Access - With'!Z$11:Z$2221,Z$11:Z$2221)/($C1-'Access - With'!Z$1))","v":""},{"$f":"IF(AA6=\"HIDE\",\"\",SUMPRODUCT('Employee Counts'!$D10:$D2221-'Access - With'!AA$11:AA$2221,AA$11:AA$2221)/($C1-'Access - With'!AA$1))","v":""},{"$f":"IF(AB6=\"HIDE\",\"\",SUMPRODUCT('Employee Counts'!$D10:$D2221-'Access - With'!AB$11:AB$2221,AB$11:AB$2221)/($C1-'Access - With'!AB$1))","v":""},{"$f":"IF(AC6=\"HIDE\",\"\",SUMPRODUCT('Employee Counts'!$D10:$D2221-'Access - With'!AC$11:AC$2221,AC$11:AC$2221)/($C1-'Access - With'!AC$1))","v":""},{"$f":"IF(AD6=\"HIDE\",\"\",SUMPRODUCT('Employee Counts'!$D10:$D2221-'Access - With'!AD$11:AD$2221,AD$11:AD$2221)/($C1-'Access - With'!AD$1))","v":""},{"$f":"IF(AE6=\"HIDE\",\"\",SUMPRODUCT('Employee Counts'!$D10:$D2221-'Access - With'!AE$11:AE$2221,AE$11:AE$2221)/($C1-'Access - With'!AE$1))","v":""},{"$f":"IF(AF6=\"HIDE\",\"\",SUMPRODUCT('Employee Counts'!$D10:$D2221-'Access - With'!AF$11:AF$2221,AF$11:AF$2221)/($C1-'Access - With'!AF$1))","v":""},{"$f":"IF(AG6=\"HIDE\",\"\",SUMPRODUCT('Employee Counts'!$D10:$D2221-'Access - With'!AG$11:AG$2221,AG$11:AG$2221)/($C1-'Access - With'!AG$1))","v":""}]
[null,"State of Delaware",null,"Provide the average driving distance to the indicated number of providers for employees who do not meet the access standards"]
[null,{"$f":"IF('Vendor Instructions'!$D$9=\"\",\"Vendor Name\",'Vendor Instructions'!$D$9)&\"-\"&IF('Vendor Instructions'!$D$10=\"\",\"Vendor Name\",'Vendor Instructions'!$D$10)","v":"[Enter vendor name here]-[Enter network name here]"},null,"For example, \"2 in 10\" means the average driving distance (among employees without at least 2 providers within 10 miles) to reach their 2nd nearest in-network provider"]
[null,null,null,"Provide a numeric (in miles) response to all columns requested (apply the full census to each access standard)"]
[null,null,null,"You may leave cells blank if all employees live within the defined access standard"]
[null,null,null,null,null,null,null,null,null,null,null,null,null,null,null,null,null,null,"HIDE","HIDE","HIDE","HIDE","HIDE","HIDE","HIDE","HIDE","HIDE","HIDE","HIDE","HIDE","HIDE","HIDE","HIDE"]
[null,null,"Provider Type","[DEN] General Dentists",null,null,"[DEN] Endodontists",null,null,"[DEN] Oral Surgeons",null,null,"[DEN] Periodontists",null,null,"[DEN] Orthodontists"]
[null,null,"Access Standard","3 in 5","2 in 10","2 in 15","2 in 10","2 in 15","2 in 20","2 in 10","2 in 15","2 in 20","2 in 10","2 in 15","2 in 20","2 in 10","2 in 15","2 in 20"]
[null,null,"Accepting New Patients?","Yes",null,null,"Yes",null,null,"Yes",null,null,"Yes",null,null,"Yes"]
[null,"Zip Code","EEs Provided"]
[{"$error":"#N/A"},19904,2342]
[{"$error":"#N/A"},19901,1785]
[{"$error":"#N/A"},19720,1703]
[{"$error":"#N/A"},19977,1660]
[{"$error":"#N/A"},19709,1553]
[{"$error":"#N/A"},19711,1509]
[{"$error":"#N/A"},19966,1426]
[{"$error":"#N/A"},19958,1415]
[{"$error":"#N/A"},19963,1364]
[{"$error":"#N/A"},19702,1320]
{"$rows_left_out":2201}